{"text_format":"1","workbook":"xlsx","n_sheets":13,"sheets":["Data_Sheet","Internal_Analysis","T1","T1_Analysis","T2","T2_Analysis","T3","T3_Analysis","A1","A1_Analysis","A2","A2_Analysis","Overall_CO"],"not_rendered":{"charts":1,"images":0,"macros":1,"external_links":3,"defined_names":55,"comments":6,"pivot_tables":0},"unopened":[],"bounds":{"document_bytes":16777216,"sheet_cells":100000,"rows_first":2000,"rows_last":500,"rows_between":2000,"halvings":0,"cell_chars":16384,"cell_head_chars":4096},"cells_cut":0,"cells_raw":0,"read":"whole","date_system":"1900"}

{"sheet":"Data_Sheet","index":0,"n_rows":99,"n_cols":15,"rows_kept":99,"cut":false,"hidden":false,"merged":[[1,0,1,4],[3,0,3,4],[8,2,8,3],[5,4,5,5],[5,0,6,1],[5,2,6,2],[16,0,16,4],[7,2,7,3],[14,0,14,4],[19,0,21,0],[19,1,21,1],[19,4,21,4],[19,2,21,2],[19,3,21,3],[9,2,9,3],[10,2,10,3],[75,1,75,4],[76,1,76,4],[77,1,77,4],[78,1,78,4],[79,1,79,4],[83,0,83,1],[87,0,87,1],[87,2,87,3],[83,2,83,3],[80,1,80,4],[81,1,81,4]]}
[]
["Jyothi Engineering College, Cheruthuruthy"]
[]
["Department of Electrical & Electronics Engineering"]
[]
["Total No of Students : ",null,50,"Date :","2019-10-04"]
[null,null,null,"Semester","S7"]
["Sub Code : ","Subject Name : ","Academic Year :",null,"2019-20","CO1","S1","CE","Department of Civil Engineering"]
["EC407","Computer Communication","Total Marks(Int) : ",null,50,"CO2","S2","CS","Department of Computer Science Engineering"]
["Branch","Name of Faculty : ","Total Marks(Ext) : ",null,100,"CO3","S3","EC","Department of Electrical & Electronics Engineering"]
["EC","PONMANI RAJA M","Target Grade Point : ",null,6,"CO4","S4","EE","Department of Electronics & Communication Engineering"]
[null,null,null,null,null,"CO5","S5","ME","Department of Mechanical Engineering"]
[null,null,null,null,null,"CO6","S6","MR","Department of Mechatronics Engineering"]
[null,null,null,null,null,null,"S7"]
[{"$f":"\"CO Analysis - Internal Marks \" &\"                       \" &TEXT(E6,\"dd-mm-yy\")","v":"CO Analysis - Internal Marks                        04-10-19"},null,null,null,null,null,"S8",null,null,null,null,{"$f":"LEFT(\"CO Analysis - Internal Marks : \",LEN(\"CO Analysis - Internal Marks : \")-3) &\"                       \" &E8","v":"CO Analysis - Internal Marks                       2019-20"}]
[]
[{"$f":"E7&\" \"&A11&\"              \"&A9&\" \"&B9 &\"               \" &E8","v":"S7 EC              EC407 Computer Communication               2019-20"}]
[]
[]
["Register No.","Name of Student","University (External) Grade",{"$f":" \"University (External) Grade Point\"","v":"University (External) Grade Point"},{"$f":" \"Total Internal Marks (\" & E9& \")\"","v":"Total Internal Marks (50)"}]
[null,null,null,null,null,null,null,null,null,null,null,null,null,null,"CONCATENATE(TRANSPOSE(A29:A34)&\",\")"]
[]
[]
["Column1","Column2","Column3","Column4","Column32"]
["JEC16EC051","LANA KOLLATH","B",{"$f":"IF(C25=\"O\",10,IF(C25=\"A+\",9,IF(C25=\"A\",8.5,IF(C25=\"B+\",8,IF(C25=\"B\",7,IF(C25=\"C\",6,IF(C25=\"P\",5,0)))))))","v":7},39.6]
["JEC16EC052","MANU JENSON","C",6,33.4]
["JEC16EC053","MAREENA MARIYA ABRAHAM","A",8.5,44]
["JEC16EC054","MARIAN DAVIS KATTUKARAN","C",6,35.400000000000006]
["JEC16EC055","MARY JEETHU A J","A+",9,43.5]
["JEC16EC056","MUBASHIRA K M","A+",9,46]
["JEC16EC057","MUHAMMED ARSHAD","C",6,33.099999999999994]
["JEC16EC058","NANDANA K","B",7,42]
["JEC16EC059","NARAYANAN M B","C",6,30.200000000000003]
["JEC16EC061","NIKHIL KJ","C",6,30.1]
["JEC16EC062","NIMISHA M S","B",7,36.400000000000006]
["JEC16EC063","NIMISHA TONY","B",7,40.299999999999997]
["JEC16EC064","NITHIN","C",6,38.4]
["JEC16EC065","OLIVIA NELSON","C",6,38.6]
["JEC16EC066","PAVITHRA.P","C",6,45.5]
["JEC16EC067","P.DHANYA RAJ","B",7,40]
["JEC16EC068","POOJA.P","B+",8,44.3]
["JEC16EC069","PRANAV","C",6,32.700000000000003]
["JEC16EC070","PRASOBH KP","B",7,36.200000000000003]
["JEC16EC071","PRINCE BENNY","B",7,38.700000000000003]
["JEC16EC072","PRIYA.K","B+",8,39.6]
["JEC16EC073","RADHIKA","B+",8,46.4]
["JEC16EC074","RINOSHA.K.R","B",7,40.799999999999997]
["JEC16EC075","RIYA ALBERT","C",6,33.200000000000003]
["JEC16EC076","RIYA PS","C",6,35.1]
["JEC16EC077","ROSHNI J NAIR","B",7,41.6]
["JEC16EC079","SAFNA M","C",6,38.5]
["JEC16EC080","SAJIN SHAJI","B",7,36]
["JEC16EC081","SANDHRA .S","F",0,25.1]
["JEC16EC082","SANGAMITHRA","B",7,39.799999999999997]
["JEC16EC083","SARANYA.M.NAIR","B",7,38.4]
["JEC16EC084","SARATHRAJ","C",6,34.4]
["JEC16EC085","SHAHAN FATHIMA K","C",{"$f":"IF(C57=\"O\",10,IF(C57=\"A+\",9,IF(C57=\"A\",8.5,IF(C57=\"B+\",8,IF(C57=\"B\",7,IF(C57=\"C\",6,IF(C57=\"P\",5,0)))))))","v":6},34.700000000000003]
["JEC16EC086","SHAHLA.P.MOHAMMED","C",6,36]
["JEC16EC087","SHAMSEENA T A","Absent",0,23.2]
["JEC16EC088","SHARAN SHASHINDRAN A","F",0,24.7]
["JEC16EC089","SIBIN KRISHNA C","C",6,33.5]
["JEC16EC090","SREEJITH VIJAYAKUMAR","Absent",0,0]
["JEC16EC091","SREELAKSHMI.R","A+",9,45.2]
["JEC16EC092","SREERAG K M","C",6,35.900000000000006]
["JEC16EC093","SREERAG T K","Absent",0,0]
["JEC16EC094","SREERAG V.V","C",6,32.700000000000003]
["JEC16EC095","SRUTHIMOL.N.T","Absent",0,0]
["JEC16EC096","SRUTHISHA SASI","A",8.5,45.6]
["JEC16EC097","SUCHITHRA.TS","C",6,31.1]
["JEC16EC098","SWETHA SARA GEORGE","B",7,40]
["JEC16EC099","VISHNU K","B",7,39.5]
["JEC16EC100","VISHNU PRAKASH","F",0,29.4]
["JEC16EC101","VISHNU V","C",6,28.6]
["LJEC16EC102","CHRISTEENA PAULSON","B",7,40.700000000000003]
[null,null,{"$f":"ROUND(100*D75/COUNTA(C25:INDIRECT(\"C\"&A95)),2)","v":86},{"$f":"COUNTIF(D25:INDIRECT(D95),\">=\"&E11)","v":43},{"$f":"IF(C75>=K91,3,IF(C75>=K90,2,IF(C75>=K89,1,0)))","v":3}]
["CO's","Definition of CO's"]
["CO1","The students will have a thorough understanding of; Different types of network topologies and protocols."]
["CO2","The layers of the OSI model and TCP/IP with their functions."]
["CO3","The concept of subnetting and routing mechanisms."]
["CO4","The basic protocols of computer networks, and how they can be used to assist in network design and implementation."]
["CO5","Security aspects in designing a trusted computer communication system."]
["CO6","CO6 Statement"]
[]
["Internal Analysis",null,"Weightage",null,30,null,null,null,null,null,"Target %","%Students"]
[{"$f":"\"Attainment Level 1: \"&$L$85&\"% students scoring more than \"&$K$85&\"% of the Total Marks\"","v":"Attainment Level 1: 60% students scoring more than 60% of the Total Marks"},null,null,null,null,null,null,null,null,null,60,60]
[{"$f":"\"Attainment Level 2: \"&$L$86&\"% students scoring more than \"&$K$85&\"% of the Total Marks\"","v":"Attainment Level 2: 70% students scoring more than 60% of the Total Marks"},null,null,null,null,null,null,null,null,null,null,70]
[{"$f":"\"Attainment Level 3: \"&$L$87&\"% students scoring more than \"&$K$85&\"% of the Total Marks\"","v":"Attainment Level 3: 80% students scoring more than 60% of the Total Marks"},null,null,null,null,null,null,null,null,null,null,80]
["External Analysis",null,"Weightage",null,70,null,null,null,null,null,"%Students"]
[{"$f":"\"Attainment Level 1: \"&K89&\"% students scoring more than the Target Grade Point\"","v":"Attainment Level 1: 60% students scoring more than the Target Grade Point"},null,null,null,null,null,null,null,null,null,60]
[{"$f":"\"Attainment Level 2: \"&K90&\"% students scoring more than the Target Grade Point\"","v":"Attainment Level 2: 70% students scoring more than the Target Grade Point"},null,null,null,null,null,null,null,null,null,70]
[{"$f":"\"Attainment Level 3: \"&K91&\"% students scoring more than the Target Grade Point\"","v":"Attainment Level 3: 80% students scoring more than the Target Grade Point"},null,null,null,null,null,null,null,null,null,80]
[]
[null,{"$f":"B10","v":"Name of Faculty : "},{"$f":"B11","v":"PONMANI RAJA M"}]
[null,"Dated Signature :  "]
[{"$f":"ROW(A76)-2","v":74},null,{"$f":"\"$C$\"&A95","v":"$C$74"},{"$f":"\"$D$\"&A95","v":"$D$74"}]
[]
[]
[]
[null,"Last Row Count",{"$f":"ROW(A76)-2","v":74},{"$f":"\"D\"&$C$99","v":"D74"}]

{"sheet":"Internal_Analysis","index":1,"n_rows":89,"n_cols":5,"rows_kept":89,"cut":false,"hidden":false,"merged":[[2,0,2,3],[4,0,4,3],[6,0,6,3],[8,0,8,3]]}
[]
[]
[{"$f":"Data_Sheet!A2","v":"Jyothi Engineering College, Cheruthuruthy"}]
[]
[{"$f":"Data_Sheet!A4","v":"Department of Electrical & Electronics Engineering"}]
[]
[{"$f":"Data_Sheet!A15","v":"CO Analysis - Internal Marks                        04-10-19"}]
[]
[{"$f":"Data_Sheet!A17","v":"S7 EC              EC407 Computer Communication               2019-20"}]
[]
[]
[]
[]
[]
[]
[]
[]
[]
[]
[]
[]
[{"$f":"'T1'!A18","v":"Register No."},{"$f":"'T1'!B18","v":"Name of Student"},{"$f":"'T1'!J18","v":"Total Marks (50)"},"Category"]
[]
["Column1","Column2","Column3","Column4"]
[{"$f":"Data_Sheet!A25","v":"JEC16EC051"},{"$f":"Data_Sheet!B25","v":"LANA KOLLATH"},{"$f":"Data_Sheet!E25","v":39.6},{"$f":"IF(C25=\"A\",\"ABSENT\",IF(C25>=Data_Sheet!$E$9*$E$82/100,\"EXCELLENT\",IF(C25>=Data_Sheet!$E$9*$E$81/100,\"GOOD\",IF(C25>=Data_Sheet!$E$9*$E$80/100,\"AVERAGE\",\"POOR\"))))","v":"GOOD"}]
[{"$f":"Data_Sheet!A26","v":"JEC16EC052"},{"$f":"Data_Sheet!B26","v":"MANU JENSON"},{"$f":"Data_Sheet!E26","v":33.4},{"$f":"IF(C26=\"A\",\"ABSENT\",IF(C26>=Data_Sheet!$E$9*$E$82/100,\"EXCELLENT\",IF(C26>=Data_Sheet!$E$9*$E$81/100,\"GOOD\",IF(C26>=Data_Sheet!$E$9*$E$80/100,\"AVERAGE\",\"POOR\"))))","v":"GOOD"}]
[{"$f":"Data_Sheet!A27","v":"JEC16EC053"},{"$f":"Data_Sheet!B27","v":"MAREENA MARIYA ABRAHAM"},{"$f":"Data_Sheet!E27","v":44},{"$f":"IF(C27=\"A\",\"ABSENT\",IF(C27>=Data_Sheet!$E$9*$E$82/100,\"EXCELLENT\",IF(C27>=Data_Sheet!$E$9*$E$81/100,\"GOOD\",IF(C27>=Data_Sheet!$E$9*$E$80/100,\"AVERAGE\",\"POOR\"))))","v":"EXCELLENT"}]
[{"$f":"Data_Sheet!A28","v":"JEC16EC054"},{"$f":"Data_Sheet!B28","v":"MARIAN DAVIS KATTUKARAN"},{"$f":"Data_Sheet!E28","v":35.400000000000006},{"$f":"IF(C28=\"A\",\"ABSENT\",IF(C28>=Data_Sheet!$E$9*$E$82/100,\"EXCELLENT\",IF(C28>=Data_Sheet!$E$9*$E$81/100,\"GOOD\",IF(C28>=Data_Sheet!$E$9*$E$80/100,\"AVERAGE\",\"POOR\"))))","v":"GOOD"}]
[{"$f":"Data_Sheet!A29","v":"JEC16EC055"},{"$f":"Data_Sheet!B29","v":"MARY JEETHU A J"},{"$f":"Data_Sheet!E29","v":43.5},{"$f":"IF(C29=\"A\",\"ABSENT\",IF(C29>=Data_Sheet!$E$9*$E$82/100,\"EXCELLENT\",IF(C29>=Data_Sheet!$E$9*$E$81/100,\"GOOD\",IF(C29>=Data_Sheet!$E$9*$E$80/100,\"AVERAGE\",\"POOR\"))))","v":"EXCELLENT"}]
[{"$f":"Data_Sheet!A30","v":"JEC16EC056"},{"$f":"Data_Sheet!B30","v":"MUBASHIRA K M"},{"$f":"Data_Sheet!E30","v":46},{"$f":"IF(C30=\"A\",\"ABSENT\",IF(C30>=Data_Sheet!$E$9*$E$82/100,\"EXCELLENT\",IF(C30>=Data_Sheet!$E$9*$E$81/100,\"GOOD\",IF(C30>=Data_Sheet!$E$9*$E$80/100,\"AVERAGE\",\"POOR\"))))","v":"EXCELLENT"}]
[{"$f":"Data_Sheet!A31","v":"JEC16EC057"},{"$f":"Data_Sheet!B31","v":"MUHAMMED ARSHAD"},{"$f":"Data_Sheet!E31","v":33.099999999999994},{"$f":"IF(C31=\"A\",\"ABSENT\",IF(C31>=Data_Sheet!$E$9*$E$82/100,\"EXCELLENT\",IF(C31>=Data_Sheet!$E$9*$E$81/100,\"GOOD\",IF(C31>=Data_Sheet!$E$9*$E$80/100,\"AVERAGE\",\"POOR\"))))","v":"GOOD"}]
[{"$f":"Data_Sheet!A32","v":"JEC16EC058"},{"$f":"Data_Sheet!B32","v":"NANDANA K"},{"$f":"Data_Sheet!E32","v":42},{"$f":"IF(C32=\"A\",\"ABSENT\",IF(C32>=Data_Sheet!$E$9*$E$82/100,\"EXCELLENT\",IF(C32>=Data_Sheet!$E$9*$E$81/100,\"GOOD\",IF(C32>=Data_Sheet!$E$9*$E$80/100,\"AVERAGE\",\"POOR\"))))","v":"EXCELLENT"}]
[{"$f":"Data_Sheet!A33","v":"JEC16EC059"},{"$f":"Data_Sheet!B33","v":"NARAYANAN M B"},{"$f":"Data_Sheet!E33","v":30.200000000000003},{"$f":"IF(C33=\"A\",\"ABSENT\",IF(C33>=Data_Sheet!$E$9*$E$82/100,\"EXCELLENT\",IF(C33>=Data_Sheet!$E$9*$E$81/100,\"GOOD\",IF(C33>=Data_Sheet!$E$9*$E$80/100,\"AVERAGE\",\"POOR\"))))","v":"GOOD"}]
[{"$f":"Data_Sheet!A34","v":"JEC16EC061"},{"$f":"Data_Sheet!B34","v":"NIKHIL KJ"},{"$f":"Data_Sheet!E34","v":30.1},{"$f":"IF(C34=\"A\",\"ABSENT\",IF(C34>=Data_Sheet!$E$9*$E$82/100,\"EXCELLENT\",IF(C34>=Data_Sheet!$E$9*$E$81/100,\"GOOD\",IF(C34>=Data_Sheet!$E$9*$E$80/100,\"AVERAGE\",\"POOR\"))))","v":"GOOD"}]
[{"$f":"Data_Sheet!A35","v":"JEC16EC062"},{"$f":"Data_Sheet!B35","v":"NIMISHA M S"},{"$f":"Data_Sheet!E35","v":36.400000000000006},{"$f":"IF(C35=\"A\",\"ABSENT\",IF(C35>=Data_Sheet!$E$9*$E$82/100,\"EXCELLENT\",IF(C35>=Data_Sheet!$E$9*$E$81/100,\"GOOD\",IF(C35>=Data_Sheet!$E$9*$E$80/100,\"AVERAGE\",\"POOR\"))))","v":"GOOD"}]
[{"$f":"Data_Sheet!A36","v":"JEC16EC063"},{"$f":"Data_Sheet!B36","v":"NIMISHA TONY"},{"$f":"Data_Sheet!E36","v":40.299999999999997},{"$f":"IF(C36=\"A\",\"ABSENT\",IF(C36>=Data_Sheet!$E$9*$E$82/100,\"EXCELLENT\",IF(C36>=Data_Sheet!$E$9*$E$81/100,\"GOOD\",IF(C36>=Data_Sheet!$E$9*$E$80/100,\"AVERAGE\",\"POOR\"))))","v":"EXCELLENT"}]
[{"$f":"Data_Sheet!A37","v":"JEC16EC064"},{"$f":"Data_Sheet!B37","v":"NITHIN"},{"$f":"Data_Sheet!E37","v":38.4},{"$f":"IF(C37=\"A\",\"ABSENT\",IF(C37>=Data_Sheet!$E$9*$E$82/100,\"EXCELLENT\",IF(C37>=Data_Sheet!$E$9*$E$81/100,\"GOOD\",IF(C37>=Data_Sheet!$E$9*$E$80/100,\"AVERAGE\",\"POOR\"))))","v":"GOOD"}]
[{"$f":"Data_Sheet!A38","v":"JEC16EC065"},{"$f":"Data_Sheet!B38","v":"OLIVIA NELSON"},{"$f":"Data_Sheet!E38","v":38.6},{"$f":"IF(C38=\"A\",\"ABSENT\",IF(C38>=Data_Sheet!$E$9*$E$82/100,\"EXCELLENT\",IF(C38>=Data_Sheet!$E$9*$E$81/100,\"GOOD\",IF(C38>=Data_Sheet!$E$9*$E$80/100,\"AVERAGE\",\"POOR\"))))","v":"GOOD"}]
[{"$f":"Data_Sheet!A39","v":"JEC16EC066"},{"$f":"Data_Sheet!B39","v":"PAVITHRA.P"},{"$f":"Data_Sheet!E39","v":45.5},{"$f":"IF(C39=\"A\",\"ABSENT\",IF(C39>=Data_Sheet!$E$9*$E$82/100,\"EXCELLENT\",IF(C39>=Data_Sheet!$E$9*$E$81/100,\"GOOD\",IF(C39>=Data_Sheet!$E$9*$E$80/100,\"AVERAGE\",\"POOR\"))))","v":"EXCELLENT"}]
[{"$f":"Data_Sheet!A40","v":"JEC16EC067"},{"$f":"Data_Sheet!B40","v":"P.DHANYA RAJ"},{"$f":"Data_Sheet!E40","v":40},{"$f":"IF(C40=\"A\",\"ABSENT\",IF(C40>=Data_Sheet!$E$9*$E$82/100,\"EXCELLENT\",IF(C40>=Data_Sheet!$E$9*$E$81/100,\"GOOD\",IF(C40>=Data_Sheet!$E$9*$E$80/100,\"AVERAGE\",\"POOR\"))))","v":"EXCELLENT"}]
[{"$f":"Data_Sheet!A41","v":"JEC16EC068"},{"$f":"Data_Sheet!B41","v":"POOJA.P"},{"$f":"Data_Sheet!E41","v":44.3},{"$f":"IF(C41=\"A\",\"ABSENT\",IF(C41>=Data_Sheet!$E$9*$E$82/100,\"EXCELLENT\",IF(C41>=Data_Sheet!$E$9*$E$81/100,\"GOOD\",IF(C41>=Data_Sheet!$E$9*$E$80/100,\"AVERAGE\",\"POOR\"))))","v":"EXCELLENT"}]
[{"$f":"Data_Sheet!A42","v":"JEC16EC069"},{"$f":"Data_Sheet!B42","v":"PRANAV"},{"$f":"Data_Sheet!E42","v":32.700000000000003},{"$f":"IF(C42=\"A\",\"ABSENT\",IF(C42>=Data_Sheet!$E$9*$E$82/100,\"EXCELLENT\",IF(C42>=Data_Sheet!$E$9*$E$81/100,\"GOOD\",IF(C42>=Data_Sheet!$E$9*$E$80/100,\"AVERAGE\",\"POOR\"))))","v":"GOOD"}]
[{"$f":"Data_Sheet!A43","v":"JEC16EC070"},{"$f":"Data_Sheet!B43","v":"PRASOBH KP"},{"$f":"Data_Sheet!E43","v":36.200000000000003},{"$f":"IF(C43=\"A\",\"ABSENT\",IF(C43>=Data_Sheet!$E$9*$E$82/100,\"EXCELLENT\",IF(C43>=Data_Sheet!$E$9*$E$81/100,\"GOOD\",IF(C43>=Data_Sheet!$E$9*$E$80/100,\"AVERAGE\",\"POOR\"))))","v":"GOOD"}]
[{"$f":"Data_Sheet!A44","v":"JEC16EC071"},{"$f":"Data_Sheet!B44","v":"PRINCE BENNY"},{"$f":"Data_Sheet!E44","v":38.700000000000003},{"$f":"IF(C44=\"A\",\"ABSENT\",IF(C44>=Data_Sheet!$E$9*$E$82/100,\"EXCELLENT\",IF(C44>=Data_Sheet!$E$9*$E$81/100,\"GOOD\",IF(C44>=Data_Sheet!$E$9*$E$80/100,\"AVERAGE\",\"POOR\"))))","v":"GOOD"}]
[{"$f":"Data_Sheet!A45","v":"JEC16EC072"},{"$f":"Data_Sheet!B45","v":"PRIYA.K"},{"$f":"Data_Sheet!E45","v":39.6},{"$f":"IF(C45=\"A\",\"ABSENT\",IF(C45>=Data_Sheet!$E$9*$E$82/100,\"EXCELLENT\",IF(C45>=Data_Sheet!$E$9*$E$81/100,\"GOOD\",IF(C45>=Data_Sheet!$E$9*$E$80/100,\"AVERAGE\",\"POOR\"))))","v":"GOOD"}]
[{"$f":"Data_Sheet!A46","v":"JEC16EC073"},{"$f":"Data_Sheet!B46","v":"RADHIKA"},{"$f":"Data_Sheet!E46","v":46.4},{"$f":"IF(C46=\"A\",\"ABSENT\",IF(C46>=Data_Sheet!$E$9*$E$82/100,\"EXCELLENT\",IF(C46>=Data_Sheet!$E$9*$E$81/100,\"GOOD\",IF(C46>=Data_Sheet!$E$9*$E$80/100,\"AVERAGE\",\"POOR\"))))","v":"EXCELLENT"}]
[{"$f":"Data_Sheet!A47","v":"JEC16EC074"},{"$f":"Data_Sheet!B47","v":"RINOSHA.K.R"},{"$f":"Data_Sheet!E47","v":40.799999999999997},{"$f":"IF(C47=\"A\",\"ABSENT\",IF(C47>=Data_Sheet!$E$9*$E$82/100,\"EXCELLENT\",IF(C47>=Data_Sheet!$E$9*$E$81/100,\"GOOD\",IF(C47>=Data_Sheet!$E$9*$E$80/100,\"AVERAGE\",\"POOR\"))))","v":"EXCELLENT"}]
[{"$f":"Data_Sheet!A48","v":"JEC16EC075"},{"$f":"Data_Sheet!B48","v":"RIYA ALBERT"},{"$f":"Data_Sheet!E48","v":33.200000000000003},{"$f":"IF(C48=\"A\",\"ABSENT\",IF(C48>=Data_Sheet!$E$9*$E$82/100,\"EXCELLENT\",IF(C48>=Data_Sheet!$E$9*$E$81/100,\"GOOD\",IF(C48>=Data_Sheet!$E$9*$E$80/100,\"AVERAGE\",\"POOR\"))))","v":"GOOD"}]
[{"$f":"Data_Sheet!A49","v":"JEC16EC076"},{"$f":"Data_Sheet!B49","v":"RIYA PS"},{"$f":"Data_Sheet!E49","v":35.1},{"$f":"IF(C49=\"A\",\"ABSENT\",IF(C49>=Data_Sheet!$E$9*$E$82/100,\"EXCELLENT\",IF(C49>=Data_Sheet!$E$9*$E$81/100,\"GOOD\",IF(C49>=Data_Sheet!$E$9*$E$80/100,\"AVERAGE\",\"POOR\"))))","v":"GOOD"}]
[{"$f":"Data_Sheet!A50","v":"JEC16EC077"},{"$f":"Data_Sheet!B50","v":"ROSHNI J NAIR"},{"$f":"Data_Sheet!E50","v":41.6},{"$f":"IF(C50=\"A\",\"ABSENT\",IF(C50>=Data_Sheet!$E$9*$E$82/100,\"EXCELLENT\",IF(C50>=Data_Sheet!$E$9*$E$81/100,\"GOOD\",IF(C50>=Data_Sheet!$E$9*$E$80/100,\"AVERAGE\",\"POOR\"))))","v":"EXCELLENT"}]
[{"$f":"Data_Sheet!A51","v":"JEC16EC079"},{"$f":"Data_Sheet!B51","v":"SAFNA M"},{"$f":"Data_Sheet!E51","v":38.5},{"$f":"IF(C51=\"A\",\"ABSENT\",IF(C51>=Data_Sheet!$E$9*$E$82/100,\"EXCELLENT\",IF(C51>=Data_Sheet!$E$9*$E$81/100,\"GOOD\",IF(C51>=Data_Sheet!$E$9*$E$80/100,\"AVERAGE\",\"POOR\"))))","v":"GOOD"}]
[{"$f":"Data_Sheet!A52","v":"JEC16EC080"},{"$f":"Data_Sheet!B52","v":"SAJIN SHAJI"},{"$f":"Data_Sheet!E52","v":36},{"$f":"IF(C52=\"A\",\"ABSENT\",IF(C52>=Data_Sheet!$E$9*$E$82/100,\"EXCELLENT\",IF(C52>=Data_Sheet!$E$9*$E$81/100,\"GOOD\",IF(C52>=Data_Sheet!$E$9*$E$80/100,\"AVERAGE\",\"POOR\"))))","v":"GOOD"}]
[{"$f":"Data_Sheet!A53","v":"JEC16EC081"},{"$f":"Data_Sheet!B53","v":"SANDHRA .S"},{"$f":"Data_Sheet!E53","v":25.1},{"$f":"IF(C53=\"A\",\"ABSENT\",IF(C53>=Data_Sheet!$E$9*$E$82/100,\"EXCELLENT\",IF(C53>=Data_Sheet!$E$9*$E$81/100,\"GOOD\",IF(C53>=Data_Sheet!$E$9*$E$80/100,\"AVERAGE\",\"POOR\"))))","v":"AVERAGE"}]
[{"$f":"Data_Sheet!A54","v":"JEC16EC082"},{"$f":"Data_Sheet!B54","v":"SANGAMITHRA"},{"$f":"Data_Sheet!E54","v":39.799999999999997},{"$f":"IF(C54=\"A\",\"ABSENT\",IF(C54>=Data_Sheet!$E$9*$E$82/100,\"EXCELLENT\",IF(C54>=Data_Sheet!$E$9*$E$81/100,\"GOOD\",IF(C54>=Data_Sheet!$E$9*$E$80/100,\"AVERAGE\",\"POOR\"))))","v":"GOOD"}]
[{"$f":"Data_Sheet!A55","v":"JEC16EC083"},{"$f":"Data_Sheet!B55","v":"SARANYA.M.NAIR"},{"$f":"Data_Sheet!E55","v":38.4},{"$f":"IF(C55=\"A\",\"ABSENT\",IF(C55>=Data_Sheet!$E$9*$E$82/100,\"EXCELLENT\",IF(C55>=Data_Sheet!$E$9*$E$81/100,\"GOOD\",IF(C55>=Data_Sheet!$E$9*$E$80/100,\"AVERAGE\",\"POOR\"))))","v":"GOOD"}]
[{"$f":"Data_Sheet!A56","v":"JEC16EC084"},{"$f":"Data_Sheet!B56","v":"SARATHRAJ"},{"$f":"Data_Sheet!E56","v":34.4},{"$f":"IF(C56=\"A\",\"ABSENT\",IF(C56>=Data_Sheet!$E$9*$E$82/100,\"EXCELLENT\",IF(C56>=Data_Sheet!$E$9*$E$81/100,\"GOOD\",IF(C56>=Data_Sheet!$E$9*$E$80/100,\"AVERAGE\",\"POOR\"))))","v":"GOOD"}]
[{"$f":"Data_Sheet!A57","v":"JEC16EC085"},{"$f":"Data_Sheet!B57","v":"SHAHAN FATHIMA K"},{"$f":"Data_Sheet!E57","v":34.700000000000003},{"$f":"IF(C57=\"A\",\"ABSENT\",IF(C57>=Data_Sheet!$E$9*$E$82/100,\"EXCELLENT\",IF(C57>=Data_Sheet!$E$9*$E$81/100,\"GOOD\",IF(C57>=Data_Sheet!$E$9*$E$80/100,\"AVERAGE\",\"POOR\"))))","v":"GOOD"}]
[{"$f":"Data_Sheet!A58","v":"JEC16EC086"},{"$f":"Data_Sheet!B58","v":"SHAHLA.P.MOHAMMED"},{"$f":"Data_Sheet!E58","v":36},{"$f":"IF(C58=\"A\",\"ABSENT\",IF(C58>=Data_Sheet!$E$9*$E$82/100,\"EXCELLENT\",IF(C58>=Data_Sheet!$E$9*$E$81/100,\"GOOD\",IF(C58>=Data_Sheet!$E$9*$E$80/100,\"AVERAGE\",\"POOR\"))))","v":"GOOD"}]
[{"$f":"Data_Sheet!A59","v":"JEC16EC087"},{"$f":"Data_Sheet!B59","v":"SHAMSEENA T A"},{"$f":"Data_Sheet!E59","v":23.2},{"$f":"IF(C59=\"A\",\"ABSENT\",IF(C59>=Data_Sheet!$E$9*$E$82/100,\"EXCELLENT\",IF(C59>=Data_Sheet!$E$9*$E$81/100,\"GOOD\",IF(C59>=Data_Sheet!$E$9*$E$80/100,\"AVERAGE\",\"POOR\"))))","v":"AVERAGE"}]
[{"$f":"Data_Sheet!A60","v":"JEC16EC088"},{"$f":"Data_Sheet!B60","v":"SHARAN SHASHINDRAN A"},{"$f":"Data_Sheet!E60","v":24.7},{"$f":"IF(C60=\"A\",\"ABSENT\",IF(C60>=Data_Sheet!$E$9*$E$82/100,\"EXCELLENT\",IF(C60>=Data_Sheet!$E$9*$E$81/100,\"GOOD\",IF(C60>=Data_Sheet!$E$9*$E$80/100,\"AVERAGE\",\"POOR\"))))","v":"AVERAGE"}]
[{"$f":"Data_Sheet!A61","v":"JEC16EC089"},{"$f":"Data_Sheet!B61","v":"SIBIN KRISHNA C"},{"$f":"Data_Sheet!E61","v":33.5},{"$f":"IF(C61=\"A\",\"ABSENT\",IF(C61>=Data_Sheet!$E$9*$E$82/100,\"EXCELLENT\",IF(C61>=Data_Sheet!$E$9*$E$81/100,\"GOOD\",IF(C61>=Data_Sheet!$E$9*$E$80/100,\"AVERAGE\",\"POOR\"))))","v":"GOOD"}]
[{"$f":"Data_Sheet!A62","v":"JEC16EC090"},{"$f":"Data_Sheet!B62","v":"SREEJITH VIJAYAKUMAR"},{"$f":"Data_Sheet!E62","v":0},{"$f":"IF(C62=\"A\",\"ABSENT\",IF(C62>=Data_Sheet!$E$9*$E$82/100,\"EXCELLENT\",IF(C62>=Data_Sheet!$E$9*$E$81/100,\"GOOD\",IF(C62>=Data_Sheet!$E$9*$E$80/100,\"AVERAGE\",\"POOR\"))))","v":"POOR"}]
[{"$f":"Data_Sheet!A63","v":"JEC16EC091"},{"$f":"Data_Sheet!B63","v":"SREELAKSHMI.R"},{"$f":"Data_Sheet!E63","v":45.2},{"$f":"IF(C63=\"A\",\"ABSENT\",IF(C63>=Data_Sheet!$E$9*$E$82/100,\"EXCELLENT\",IF(C63>=Data_Sheet!$E$9*$E$81/100,\"GOOD\",IF(C63>=Data_Sheet!$E$9*$E$80/100,\"AVERAGE\",\"POOR\"))))","v":"EXCELLENT"}]
[{"$f":"Data_Sheet!A64","v":"JEC16EC092"},{"$f":"Data_Sheet!B64","v":"SREERAG K M"},{"$f":"Data_Sheet!E64","v":35.900000000000006},{"$f":"IF(C64=\"A\",\"ABSENT\",IF(C64>=Data_Sheet!$E$9*$E$82/100,\"EXCELLENT\",IF(C64>=Data_Sheet!$E$9*$E$81/100,\"GOOD\",IF(C64>=Data_Sheet!$E$9*$E$80/100,\"AVERAGE\",\"POOR\"))))","v":"GOOD"}]
[{"$f":"Data_Sheet!A65","v":"JEC16EC093"},{"$f":"Data_Sheet!B65","v":"SREERAG T K"},{"$f":"Data_Sheet!E65","v":0},{"$f":"IF(C65=\"A\",\"ABSENT\",IF(C65>=Data_Sheet!$E$9*$E$82/100,\"EXCELLENT\",IF(C65>=Data_Sheet!$E$9*$E$81/100,\"GOOD\",IF(C65>=Data_Sheet!$E$9*$E$80/100,\"AVERAGE\",\"POOR\"))))","v":"POOR"}]
[{"$f":"Data_Sheet!A66","v":"JEC16EC094"},{"$f":"Data_Sheet!B66","v":"SREERAG V.V"},{"$f":"Data_Sheet!E66","v":32.700000000000003},{"$f":"IF(C66=\"A\",\"ABSENT\",IF(C66>=Data_Sheet!$E$9*$E$82/100,\"EXCELLENT\",IF(C66>=Data_Sheet!$E$9*$E$81/100,\"GOOD\",IF(C66>=Data_Sheet!$E$9*$E$80/100,\"AVERAGE\",\"POOR\"))))","v":"GOOD"}]
[{"$f":"Data_Sheet!A67","v":"JEC16EC095"},{"$f":"Data_Sheet!B67","v":"SRUTHIMOL.N.T"},{"$f":"Data_Sheet!E67","v":0},{"$f":"IF(C67=\"A\",\"ABSENT\",IF(C67>=Data_Sheet!$E$9*$E$82/100,\"EXCELLENT\",IF(C67>=Data_Sheet!$E$9*$E$81/100,\"GOOD\",IF(C67>=Data_Sheet!$E$9*$E$80/100,\"AVERAGE\",\"POOR\"))))","v":"POOR"}]
[{"$f":"Data_Sheet!A68","v":"JEC16EC096"},{"$f":"Data_Sheet!B68","v":"SRUTHISHA SASI"},{"$f":"Data_Sheet!E68","v":45.6},{"$f":"IF(C68=\"A\",\"ABSENT\",IF(C68>=Data_Sheet!$E$9*$E$82/100,\"EXCELLENT\",IF(C68>=Data_Sheet!$E$9*$E$81/100,\"GOOD\",IF(C68>=Data_Sheet!$E$9*$E$80/100,\"AVERAGE\",\"POOR\"))))","v":"EXCELLENT"}]
[{"$f":"Data_Sheet!A69","v":"JEC16EC097"},{"$f":"Data_Sheet!B69","v":"SUCHITHRA.TS"},{"$f":"Data_Sheet!E69","v":31.1},{"$f":"IF(C69=\"A\",\"ABSENT\",IF(C69>=Data_Sheet!$E$9*$E$82/100,\"EXCELLENT\",IF(C69>=Data_Sheet!$E$9*$E$81/100,\"GOOD\",IF(C69>=Data_Sheet!$E$9*$E$80/100,\"AVERAGE\",\"POOR\"))))","v":"GOOD"}]
[{"$f":"Data_Sheet!A70","v":"JEC16EC098"},{"$f":"Data_Sheet!B70","v":"SWETHA SARA GEORGE"},{"$f":"Data_Sheet!E70","v":40},{"$f":"IF(C70=\"A\",\"ABSENT\",IF(C70>=Data_Sheet!$E$9*$E$82/100,\"EXCELLENT\",IF(C70>=Data_Sheet!$E$9*$E$81/100,\"GOOD\",IF(C70>=Data_Sheet!$E$9*$E$80/100,\"AVERAGE\",\"POOR\"))))","v":"EXCELLENT"}]
[{"$f":"Data_Sheet!A71","v":"JEC16EC099"},{"$f":"Data_Sheet!B71","v":"VISHNU K"},{"$f":"Data_Sheet!E71","v":39.5},{"$f":"IF(C71=\"A\",\"ABSENT\",IF(C71>=Data_Sheet!$E$9*$E$82/100,\"EXCELLENT\",IF(C71>=Data_Sheet!$E$9*$E$81/100,\"GOOD\",IF(C71>=Data_Sheet!$E$9*$E$80/100,\"AVERAGE\",\"POOR\"))))","v":"GOOD"}]
[{"$f":"Data_Sheet!A72","v":"JEC16EC100"},{"$f":"Data_Sheet!B72","v":"VISHNU PRAKASH"},{"$f":"Data_Sheet!E72","v":29.4},{"$f":"IF(C72=\"A\",\"ABSENT\",IF(C72>=Data_Sheet!$E$9*$E$82/100,\"EXCELLENT\",IF(C72>=Data_Sheet!$E$9*$E$81/100,\"GOOD\",IF(C72>=Data_Sheet!$E$9*$E$80/100,\"AVERAGE\",\"POOR\"))))","v":"AVERAGE"}]
[{"$f":"Data_Sheet!A73","v":"JEC16EC101"},{"$f":"Data_Sheet!B73","v":"VISHNU V"},{"$f":"Data_Sheet!E73","v":28.6},{"$f":"IF(C73=\"A\",\"ABSENT\",IF(C73>=Data_Sheet!$E$9*$E$82/100,\"EXCELLENT\",IF(C73>=Data_Sheet!$E$9*$E$81/100,\"GOOD\",IF(C73>=Data_Sheet!$E$9*$E$80/100,\"AVERAGE\",\"POOR\"))))","v":"AVERAGE"}]
[{"$f":"Data_Sheet!A74","v":"LJEC16EC102"},{"$f":"Data_Sheet!B74","v":"CHRISTEENA PAULSON"},{"$f":"Data_Sheet!E74","v":40.700000000000003},{"$f":"IF(C74=\"A\",\"ABSENT\",IF(C74>=Data_Sheet!$E$9*$E$82/100,\"EXCELLENT\",IF(C74>=Data_Sheet!$E$9*$E$81/100,\"GOOD\",IF(C74>=Data_Sheet!$E$9*$E$80/100,\"AVERAGE\",\"POOR\"))))","v":"EXCELLENT"}]
[]
["Total Number of Students",null,{"$f":"Data_Sheet!$C$6","v":50}]
["Number of Students Absent",null,{"$f":"IF(COUNTIF(C25:INDIRECT(C89),\"=A\"),COUNTIF(C25:INDIRECT(C89),\"=A\"),0)","v":0}]
["Total Number of Students attended",null,{"$f":"C76-C77","v":50}]
[{"$f":"\"Number of Students with Marks less than \"&E80&\"%\"","v":"Number of Students with Marks less than 45%"},null,{"$f":"IF(COUNTIF(D25:INDIRECT(D89),\"=POOR\"),COUNTIF(D25:INDIRECT(D89),\"=POOR\"),0)","v":3},"POOR","Range"]
[{"$f":"\"Number of Students with Marks betweeen \"&E80&\"% to \"&E81&\"%\"","v":"Number of Students with Marks betweeen 45% to 60%"},null,{"$f":"IF(COUNTIF(D25:INDIRECT(D89),\"=AVERAGE\"),COUNTIF(D25:INDIRECT(D89),\"=AVERAGE\"),0)","v":5},"AVERAGE",45]
[{"$f":"\"Number of Students with Marks betweeen \"&E81&\"% to \"&E82&\"%\"","v":"Number of Students with Marks betweeen 60% to 80%"},null,{"$f":"IF(COUNTIF(D25:INDIRECT(D89),\"=GOOD\"),COUNTIF(D25:INDIRECT(D89),\"=GOOD\"),0)","v":27},"GOOD",60]
[{"$f":"\"Number of Students with Marks greater than \"&E82&\"%\"","v":"Number of Students with Marks greater than 80%"},null,{"$f":"IF(COUNTIF(D25:INDIRECT(D89),\"=EXCELLENT\"),COUNTIF(D25:INDIRECT(D89),\"=EXCELLENT\"),0)","v":15},"EXCELLENT",80]
["Class Average",null,{"$f":"ROUND(AVERAGE(C25:INDIRECT(C89)),2)","v":34.76}]
["Pass Percentage",null,{"$f":"ROUND(((C78-C79)/C78)*100,2)","v":94}]
[]
[null,{"$f":"Data_Sheet!B10","v":"Name of Faculty : "},{"$f":"Data_Sheet!B11","v":"PONMANI RAJA M"}]
[null,{"$f":"Data_Sheet!B94","v":"Dated Signature :  "}]
[]
[{"$f":"ROW(A76)-2","v":74},"Last Row Count",{"$f":"\"$C$\"&$A$89","v":"$C$74"},{"$f":"\"$D$\"&$A$89","v":"$D$74"}]

{"sheet":"T1","index":2,"n_rows":139,"n_cols":20,"rows_kept":139,"cut":false,"hidden":false,"merged":[[17,12,21,12],[2,6,2,8],[3,6,3,8],[2,0,4,1],[4,2,4,4],[2,2,2,5],[3,2,3,5],[6,0,6,9],[8,0,8,9],[10,0,10,9],[12,0,12,9],[17,0,21,0],[17,1,21,1],[17,9,21,9],[79,0,79,2],[75,0,75,2],[76,0,76,2],[77,0,77,2],[78,0,78,2],[105,16,110,16],[112,16,117,16],[119,16,124,16],[126,16,131,16],[98,16,103,16]]}
[]
[]
["Add questions one by one as needed..",null,"Assessment Category",null,null,null,"Date : ",null,null,null,"CO1","First Internal Exam"]
[null,null,"First Internal Exam",null,null,null,"2019-09-16",null,null,null,"CO2","Second Internal Exam",null,null,{"$f":"TEXT(G4,\"dd-mm-yy\")","v":"16-09-19"}]
[null,null,"Total Marks : ",null,null,50,null,null,null,null,"CO3","Assessment Exam - 1"]
[null,null,null,null,null,null,null,null,null,null,"CO4","Assessment Exam - 2"]
[{"$f":"Data_Sheet!A2","v":"Jyothi Engineering College, Cheruthuruthy"},null,null,null,null,null,null,null,null,null,"CO5","Assignment - 1"]
[null,null,null,null,null,null,null,null,null,null,"CO6","Assignment - 2"]
[{"$f":"Data_Sheet!A4","v":"Department of Electrical & Electronics Engineering"},null,null,null,null,null,null,null,null,null,null,"Retest"]
[null,null,null,null,null,null,null,null,null,null,1]
[{"$f":"\"CO Analysis - Internal Marks : \"&C4 &\"                       \" &TEXT(G4,\"dd-mm-yy\")","v":"CO Analysis - Internal Marks : First Internal Exam                       16-09-19"},null,null,null,null,null,null,null,null,null,2]
[null,null,null,null,null,null,null,null,null,null,3]
[{"$f":"Internal_Analysis!A9","v":"S7 EC              EC407 Computer Communication               2019-20"},null,null,null,null,null,null,null,null,null,4]
[null,null,null,null,null,null,null,null,null,null,5]
[null,null,null,null,null,null,null,null,null,null,6]
[]
[]
["Register No.","Name of Student","Qn. No.",1,2,3,4,5,6,{"$f":" \"Total Marks (\" &F5 & \")\"","v":"Total Marks (50)"},null,null,"Calculated Total Marks (50)"]
[null,null,"CO's","CO1, CO4, CO2","CO2, CO1","CO1, CO3, CO4, CO5","CO1, CO3, CO5","CO3, CO4","CO1, CO4, CO5"]
[null,null,"Blooms Taxonomy Lavel","1, 2","1, 6","2, 6","1, 2",2,"2, 3"]
[null,null,"Max. Marks",15,5,15,15,20,20]
[null,null,"Difficulty Level in %",60,60,60,60,60,60]
[]
["Column1","Column2","Column3","Column4","Column5","Column6","Column7","Column4","Column8","Column32"]
[{"$f":"Data_Sheet!A25","v":"JEC16EC051"},{"$f":"Data_Sheet!B25","v":"LANA KOLLATH"},null,12,null,9,null,13,null,34]
[{"$f":"Data_Sheet!A26","v":"JEC16EC052"},{"$f":"Data_Sheet!B26","v":"MANU JENSON"},null,9,null,10,null,13,null,32]
[{"$f":"Data_Sheet!A27","v":"JEC16EC053"},{"$f":"Data_Sheet!B27","v":"MAREENA MARIYA ABRAHAM"},null,null,12,null,13,null,12,37]
[{"$f":"Data_Sheet!A28","v":"JEC16EC054"},{"$f":"Data_Sheet!B28","v":"MARIAN DAVIS KATTUKARAN"},null,8,null,null,8,null,7,23]
[{"$f":"Data_Sheet!A29","v":"JEC16EC055"},{"$f":"Data_Sheet!B29","v":"MARY JEETHU A J"},null,13,null,12,null,15,null,40]
[{"$f":"Data_Sheet!A30","v":"JEC16EC056"},{"$f":"Data_Sheet!B30","v":"MUBASHIRA K M"},null,null,15,null,15,null,16,46]
[{"$f":"Data_Sheet!A31","v":"JEC16EC057"},{"$f":"Data_Sheet!B31","v":"MUHAMMED ARSHAD"},null,7,null,7,null,null,9,23]
[{"$f":"Data_Sheet!A32","v":"JEC16EC058"},{"$f":"Data_Sheet!B32","v":"NANDANA K"},null,null,10,null,12,null,17,39]
[{"$f":"Data_Sheet!A33","v":"JEC16EC059"},{"$f":"Data_Sheet!B33","v":"NARAYANAN M B"},null,7,null,3,null,14,null,24]
[{"$f":"Data_Sheet!A34","v":"JEC16EC061"},{"$f":"Data_Sheet!B34","v":"NIKHIL KJ"},null,null,13,null,7,null,11,31]
[{"$f":"Data_Sheet!A35","v":"JEC16EC062"},{"$f":"Data_Sheet!B35","v":"NIMISHA M S"},null,8,null,null,4,11,null,23]
[{"$f":"Data_Sheet!A36","v":"JEC16EC063"},{"$f":"Data_Sheet!B36","v":"NIMISHA TONY"},null,15,null,null,null,18,null,33]
[{"$f":"Data_Sheet!A37","v":"JEC16EC064"},{"$f":"Data_Sheet!B37","v":"NITHIN"},null,12,null,5,null,16,null,33]
[{"$f":"Data_Sheet!A38","v":"JEC16EC065"},{"$f":"Data_Sheet!B38","v":"OLIVIA NELSON"},null,null,13,null,9,null,12,34]
[{"$f":"Data_Sheet!A39","v":"JEC16EC066"},{"$f":"Data_Sheet!B39","v":"PAVITHRA.P"},null,14,null,null,12,19,null,45]
[{"$f":"Data_Sheet!A40","v":"JEC16EC067"},{"$f":"Data_Sheet!B40","v":"P.DHANYA RAJ"},null,null,13,null,14,null,16,43]
[{"$f":"Data_Sheet!A41","v":"JEC16EC068"},{"$f":"Data_Sheet!B41","v":"POOJA.P"},null,null,14,null,12,null,15,41]
[{"$f":"Data_Sheet!A42","v":"JEC16EC069"},{"$f":"Data_Sheet!B42","v":"PRANAV"},null,11,null,7,null,10,null,28]
[{"$f":"Data_Sheet!A43","v":"JEC16EC070"},{"$f":"Data_Sheet!B43","v":"PRASOBH KP"},null,null,12,null,7,null,12,31]
[{"$f":"Data_Sheet!A44","v":"JEC16EC071"},{"$f":"Data_Sheet!B44","v":"PRINCE BENNY"},null,12,null,13,null,12,null,37]
[{"$f":"Data_Sheet!A45","v":"JEC16EC072"},{"$f":"Data_Sheet!B45","v":"PRIYA.K"},null,null,7,null,8,null,12,27]
[{"$f":"Data_Sheet!A46","v":"JEC16EC073"},{"$f":"Data_Sheet!B46","v":"RADHIKA"},null,null,13,null,14,18,null,45]
[{"$f":"Data_Sheet!A47","v":"JEC16EC074"},{"$f":"Data_Sheet!B47","v":"RINOSHA.K.R"},null,9,null,7,null,null,16,32]
[{"$f":"Data_Sheet!A48","v":"JEC16EC075"},{"$f":"Data_Sheet!B48","v":"RIYA ALBERT"},null,null,8,null,4,13,null,25]
[{"$f":"Data_Sheet!A49","v":"JEC16EC076"},{"$f":"Data_Sheet!B49","v":"RIYA PS"},null,9,null,8,null,null,13,30]
[{"$f":"Data_Sheet!A50","v":"JEC16EC077"},{"$f":"Data_Sheet!B50","v":"ROSHNI J NAIR"},null,13,null,8,null,16,null,37]
[{"$f":"Data_Sheet!A51","v":"JEC16EC079"},{"$f":"Data_Sheet!B51","v":"SAFNA M"},null,null,12,null,8,null,13,33]
[{"$f":"Data_Sheet!A52","v":"JEC16EC080"},{"$f":"Data_Sheet!B52","v":"SAJIN SHAJI"},null,6,null,6,null,11,null,23]
[{"$f":"Data_Sheet!A53","v":"JEC16EC081"},{"$f":"Data_Sheet!B53","v":"SANDHRA .S"},null,8,null,null,4,null,8,20]
[{"$f":"Data_Sheet!A54","v":"JEC16EC082"},{"$f":"Data_Sheet!B54","v":"SANGAMITHRA"},null,12,null,8,null,12,null,32]
[{"$f":"Data_Sheet!A55","v":"JEC16EC083"},{"$f":"Data_Sheet!B55","v":"SARANYA.M.NAIR"},null,null,9,null,8,null,12,29]
[{"$f":"Data_Sheet!A56","v":"JEC16EC084"},{"$f":"Data_Sheet!B56","v":"SARATHRAJ"},null,null,6,null,8,null,11,25]
[{"$f":"Data_Sheet!A57","v":"JEC16EC085"},{"$f":"Data_Sheet!B57","v":"SHAHAN FATHIMA K"},null,8,null,4,null,10,null,22]
[{"$f":"Data_Sheet!A58","v":"JEC16EC086"},{"$f":"Data_Sheet!B58","v":"SHAHLA.P.MOHAMMED"},null,11,null,8,null,9,null,28]
[{"$f":"Data_Sheet!A59","v":"JEC16EC087"},{"$f":"Data_Sheet!B59","v":"SHAMSEENA T A"},null,null,7,null,8,3,null,18]
[{"$f":"Data_Sheet!A60","v":"JEC16EC088"},{"$f":"Data_Sheet!B60","v":"SHARAN SHASHINDRAN A"},null,null,4,null,3,null,5,12]
[{"$f":"Data_Sheet!A61","v":"JEC16EC089"},{"$f":"Data_Sheet!B61","v":"SIBIN KRISHNA C"},null,11,null,8,null,14,null,33]
[{"$f":"Data_Sheet!A62","v":"JEC16EC090"},{"$f":"Data_Sheet!B62","v":"SREEJITH VIJAYAKUMAR"},null,null,null,null,null,null,null,0]
[{"$f":"Data_Sheet!A63","v":"JEC16EC091"},{"$f":"Data_Sheet!B63","v":"SREELAKSHMI.R"},null,13,null,14,null,17,null,44]
[{"$f":"Data_Sheet!A64","v":"JEC16EC092"},{"$f":"Data_Sheet!B64","v":"SREERAG K M"},null,9,null,11,null,11,null,31]
[{"$f":"Data_Sheet!A65","v":"JEC16EC093"},{"$f":"Data_Sheet!B65","v":"SREERAG T K"},null,null,3,3,null,null,2,8]
[{"$f":"Data_Sheet!A66","v":"JEC16EC094"},{"$f":"Data_Sheet!B66","v":"SREERAG V.V"},null,8,null,3,null,null,12,23]
[{"$f":"Data_Sheet!A67","v":"JEC16EC095"},{"$f":"Data_Sheet!B67","v":"SRUTHIMOL.N.T"},null,null,null,null,null,null,null,0]
[{"$f":"Data_Sheet!A68","v":"JEC16EC096"},{"$f":"Data_Sheet!B68","v":"SRUTHISHA SASI"},null,13,null,14,null,13,null,40]
[{"$f":"Data_Sheet!A69","v":"JEC16EC097"},{"$f":"Data_Sheet!B69","v":"SUCHITHRA.TS"},null,null,7,null,5,null,11,23]
[{"$f":"Data_Sheet!A70","v":"JEC16EC098"},{"$f":"Data_Sheet!B70","v":"SWETHA SARA GEORGE"},null,13,null,12,null,null,13,38]
[{"$f":"Data_Sheet!A71","v":"JEC16EC099"},{"$f":"Data_Sheet!B71","v":"VISHNU K"},null,12,null,8,null,12,null,32]
[{"$f":"Data_Sheet!A72","v":"JEC16EC100"},{"$f":"Data_Sheet!B72","v":"VISHNU PRAKASH"},null,null,8,null,7,null,8,23]
[{"$f":"Data_Sheet!A73","v":"JEC16EC101"},{"$f":"Data_Sheet!B73","v":"VISHNU V"},null,6,null,3,null,9,null,18]
[{"$f":"Data_Sheet!A74","v":"LJEC16EC102"},{"$f":"Data_Sheet!B74","v":"CHRISTEENA PAULSON"},null,null,14,null,12,12,null,38]
[]
["Total Marks scored for the Question",null,null,{"$f":"IF(D$22<>\"\",IF(SUM(D25:INDIRECT(D96))>=0,SUM(D25:INDIRECT(D96)),\"\"),\"\")","v":289},{"$f":"IF(E$22<>\"\",IF(SUM(E25:INDIRECT(E96))>=0,SUM(E25:INDIRECT(E96)),\"\"),\"\")","v":200},{"$f":"IF(F$22<>\"\",IF(SUM(F25:INDIRECT(F96))>=0,SUM(F25:INDIRECT(F96)),\"\"),\"\")","v":191},{"$f":"IF(G$22<>\"\",IF(SUM(G25:INDIRECT(G96))>=0,SUM(G25:INDIRECT(G96)),\"\"),\"\")","v":202},{"$f":"IF(H$22<>\"\",IF(SUM(H25:INDIRECT(H96))>=0,SUM(H25:INDIRECT(H96)),\"\"),\"\")","v":321},{"$f":"IF(I$22<>\"\",IF(SUM(I25:INDIRECT(I96))>=0,SUM(I25:INDIRECT(I96)),\"\"),\"\")","v":263}]
["No. of Students who attended the Question",null,null,{"$f":"IF(D$22<>\"\",IF(COUNT(D25:INDIRECT(D96))>=0,COUNT(D25:INDIRECT(D96)),\"\"),\"\")","v":28},{"$f":"IF(E$22<>\"\",IF(COUNT(E25:INDIRECT(E96))>=0,COUNT(E25:INDIRECT(E96)),\"\"),\"\")","v":20},{"$f":"IF(F$22<>\"\",IF(COUNT(F25:INDIRECT(F96))>=0,COUNT(F25:INDIRECT(F96)),\"\"),\"\")","v":24},{"$f":"IF(G$22<>\"\",IF(COUNT(G25:INDIRECT(G96))>=0,COUNT(G25:INDIRECT(G96)),\"\"),\"\")","v":23},{"$f":"IF(H$22<>\"\",IF(COUNT(H25:INDIRECT(H96))>=0,COUNT(H25:INDIRECT(H96)),\"\"),\"\")","v":25},{"$f":"IF(I$22<>\"\",IF(COUNT(I25:INDIRECT(I96))>=0,COUNT(I25:INDIRECT(I96)),\"\"),\"\")","v":23}]
["Difficulty Level marks of the Question",null,null,{"$f":"IF(D21*D22/100=0,\"\",D21*D22/100)","v":9},3,9,9,{"$f":"IF(H21*H22/100=0,\"\",H21*H22/100)","v":12},{"$f":"IF(I21*I22/100=0,\"\",I21*I22/100)","v":12}]
["No. of Students who scored above the Difficulty Level",null,null,{"$f":"IF(COUNTIF(D25:INDIRECT(D96),\">=\"&D78)=0,\"\",COUNTIF(D25:INDIRECT(D96),\">=\"&D78))","v":19},{"$f":"IF(COUNTIF(E25:INDIRECT(E96),\">=\"&E78)=0,\"\",COUNTIF(E25:INDIRECT(E96),\">=\"&E78))","v":20},{"$f":"IF(COUNTIF(F25:INDIRECT(F96),\">=\"&F78)=0,\"\",COUNTIF(F25:INDIRECT(F96),\">=\"&F78))","v":8},{"$f":"IF(COUNTIF(G25:INDIRECT(G96),\">=\"&G78)=0,\"\",COUNTIF(G25:INDIRECT(G96),\">=\"&G78))","v":9},{"$f":"IF(COUNTIF(H25:INDIRECT(H96),\">=\"&H78)=0,\"\",COUNTIF(H25:INDIRECT(H96),\">=\"&H78))","v":17},{"$f":"IF(COUNTIF(I25:INDIRECT(I96),\">=\"&I78)=0,\"\",COUNTIF(I25:INDIRECT(I96),\">=\"&I78))","v":14}]
["% of Students who scored above the Difficulty Level",null,null,{"$f":"IFERROR(ROUND(D79/D77*100,2),\"\")","v":67.86},100,33.33,39.130000000000003,68,60.87]
[null,null,null,{"$f":"IF(D80=\"\",0,IF(D80>=80,3,IF(D80>=70,2,IF(D80>=60,1,0))))","v":1},3,0,0,1,1,"Marks",null,null,null,"T_Marks","S_Marks","Students","Level","Above","Above %","Attainment"]
[null,{"$f":"IF(Data_Sheet!A77<>\"\",\"Total Attainment level for \"&Data_Sheet!A77&\" :\",\"\")","v":"Total Attainment level for CO1 :"},{"$f":"IF(Data_Sheet!A77<>\"\",M82,\"\")","v":0.71},{"$f":"IFERROR((IF(ISNUMBER(SEARCH(\"1\", D$19)),D$21,\"0\")),\"0\")*D81","v":15},15,0,0,0,20,{"$f":"J99","v":70},null,null,{"$f":"IF(J82=0,\"\",ROUND(SUM(D82:I82)/J82,2))","v":0.71},{"$f":"J99","v":70},{"$f":"J106","v":1145},{"$f":"J113","v":118},{"$f":"J120","v":42},{"$f":"J127","v":70},{"$f":"IFERROR(ROUND(R82/P82*100,2),\"\")","v":59.32},{"$f":"IF(S82=\"\",\"\",IF(S82>=80,3,IF(S82>=70,2,IF(S82>=60,1,0))))","v":0}]
[null,{"$f":"IF(Data_Sheet!A78<>\"\",\"Total Attainment level for \"&Data_Sheet!A78&\" :\",\"\")","v":"Total Attainment level for CO2 :"},{"$f":"IF(Data_Sheet!A78<>\"\",M83,\"\")","v":1.5},{"$f":"IFERROR((IF(ISNUMBER(SEARCH(\"2\", D$19)),D$21,\"0\")),\"0\")*D81","v":15},15,0,0,0,0,20,null,null,1.5,20,489,48,12,39,81.25,3]
[null,{"$f":"IF(Data_Sheet!A79<>\"\",\"Total Attainment level for \"&Data_Sheet!A79&\" :\",\"\")","v":"Total Attainment level for CO3 :"},{"$f":"IF(Data_Sheet!A79<>\"\",M84,\"\")","v":0.4},{"$f":"IFERROR((IF(ISNUMBER(SEARCH(\"3\", D$19)),D$21,\"0\")),\"0\")*D81","v":0},0,0,0,20,0,50,null,null,0.4,50,714,72,30,34,47.22,0]
[null,{"$f":"IF(Data_Sheet!A80<>\"\",\"Total Attainment level for \"&Data_Sheet!A80&\" :\",\"\")","v":"Total Attainment level for CO4 :"},{"$f":"IF(Data_Sheet!A80<>\"\",M85,\"\")","v":0.79},{"$f":"IFERROR((IF(ISNUMBER(SEARCH(\"4\", D$19)),D$21,\"0\")),\"0\")*D81","v":15},0,0,0,20,20,70,null,null,0.79,70,1064,100,42,58,58,0]
[null,{"$f":"IF(Data_Sheet!A81<>\"\",\"Total Attainment level for \"&Data_Sheet!A81&\" :\",\"\")","v":"Total Attainment level for CO5 :"},{"$f":"IF(Data_Sheet!A81<>\"\",M86,\"\")","v":0.4},{"$f":"IFERROR((IF(ISNUMBER(SEARCH(\"5\", D$19)),D$21,\"0\")),\"0\")*D81","v":0},0,0,0,0,20,50,null,null,0.4,50,656,70,30,31,44.29,0]
[null,{"$f":"IF(Data_Sheet!A82<>\"\",\"Total Attainment level for \"&Data_Sheet!A82&\" :\",\"\")","v":"Total Attainment level for CO6 :"},{"$f":"IF(Data_Sheet!A82<>\"\",M87,\"\")","v":""},{"$f":"IFERROR((IF(ISNUMBER(SEARCH(\"6\", D$19)),D$21,\"0\")),\"0\")*D81","v":0},0,0,0,0,0,0,null,null,"",0,0,0,0,0,"",""]
[]
[{"$f":"Data_Sheet!A85","v":"Attainment Level 1: 60% students scoring more than 60% of the Total Marks"}]
[{"$f":"Data_Sheet!A86","v":"Attainment Level 2: 70% students scoring more than 60% of the Total Marks"}]
[{"$f":"Data_Sheet!A87","v":"Attainment Level 3: 80% students scoring more than 60% of the Total Marks"}]
[]
[null,{"$f":"Data_Sheet!B10","v":"Name of Faculty : "},{"$f":"Data_Sheet!B11","v":"PONMANI RAJA M"}]
[null,{"$f":"Data_Sheet!B94","v":"Dated Signature :  "}]
[]
[null,"Last Row Count",{"$f":"ROW(A76)-2","v":74},{"$f":"SUBSTITUTE(ADDRESS(1,COLUMN(D1),2),\"1\",\"\")&$C$96","v":"D$74"},{"$f":"\"E\"&$C$96","v":"E74"},{"$f":"SUBSTITUTE(ADDRESS(1,COLUMN(F1),2),\"1\",\"\")&$C$96","v":"F$74"},{"$f":"SUBSTITUTE(ADDRESS(1,COLUMN(G1),2),\"1\",\"\")&$C$96","v":"G$74"},{"$f":"SUBSTITUTE(ADDRESS(1,COLUMN(H1),2),\"1\",\"\")&$C$96","v":"H$74"},{"$f":"SUBSTITUTE(ADDRESS(1,COLUMN(I1),2),\"1\",\"\")&$C$96","v":"I$74"}]
[]
[]
[null,null,"CO1",{"$f":"IFERROR((IF(ISNUMBER(SEARCH(\"1\", D$19)),D$21,\"0\")),\"0\")","v":15},5,15,15,"0",20,{"$f":"IFERROR(SUM($D99:INDIRECT($M99)),\"0\")","v":70},null,null,{"$f":"SUBSTITUTE(ADDRESS(1,O99,4),1,\"\")&ROW($J99)","v":"I99"},{"$f":"COUNTIF($D$19:INDIRECT($P99),\"*1*\")","v":5},{"$f":"COLUMN($J$18)-1","v":9},{"$f":"SUBSTITUTE(ADDRESS(1,O99,4),1,\"\")&ROW($J$18)+1","v":"I19"},"Total Marks"]
[null,null,"CO2",{"$f":"IFERROR((IF(ISNUMBER(SEARCH(\"2\", D$19)),D$21,\"0\")),\"0\")","v":15},5,"0","0","0","0",{"$f":"IFERROR(SUM($D100:INDIRECT($M100)),\"0\")","v":20},null,null,"I100",{"$f":"COUNTIF($D$19:INDIRECT($P100),\"*2*\")","v":2},9,{"$f":"SUBSTITUTE(ADDRESS(1,O100,4),1,\"\")&ROW($J$18)+1","v":"I19"}]
[null,null,"CO3",{"$f":"IFERROR((IF(ISNUMBER(SEARCH(\"3\", D$19)),D$21,\"0\")),\"0\")","v":"0"},"0",15,15,20,"0",{"$f":"IFERROR(SUM($D101:INDIRECT($M101)),\"0\")","v":50},null,null,"I101",{"$f":"COUNTIF($D$19:INDIRECT($P101),\"*3*\")","v":3},9,"I19"]
[null,null,"CO4",{"$f":"IFERROR((IF(ISNUMBER(SEARCH(\"4\", D$19)),D$21,\"0\")),\"0\")","v":15},"0",15,"0",20,20,{"$f":"IFERROR(SUM($D102:INDIRECT($M102)),\"0\")","v":70},null,null,"I102",{"$f":"COUNTIF($D$19:INDIRECT($P102),\"*4*\")","v":4},9,"I19"]
[null,null,"CO5",{"$f":"IFERROR((IF(ISNUMBER(SEARCH(\"5\", D$19)),D$21,\"0\")),\"0\")","v":"0"},"0",15,15,"0",20,{"$f":"IFERROR(SUM($D103:INDIRECT($M103)),\"0\")","v":50},null,null,"I103",{"$f":"COUNTIF($D$19:INDIRECT($P103),\"*5*\")","v":3},9,"I19"]
[null,null,"CO6",{"$f":"IFERROR((IF(ISNUMBER(SEARCH(\"6\", D$19)),D$21,\"0\")),\"0\")","v":"0"},"0","0","0","0","0",{"$f":"IFERROR(SUM($D104:INDIRECT($M104)),\"0\")","v":0},null,null,"I104",{"$f":"COUNTIF($D$19:INDIRECT($P104),\"*6*\")","v":0},9,"I19"]
[]
[null,null,"CO1",{"$f":"IFERROR((IF(ISNUMBER(SEARCH(\"1\", D$19)),D$76,\"0\")),\"0\")","v":289},200,191,202,"0",263,{"$f":"IFERROR(SUM($D106:INDIRECT($M106)),\"0\")","v":1145},null,null,{"$f":"SUBSTITUTE(ADDRESS(1,O106,4),1,\"\")&ROW($J106)","v":"I106"},{"$f":"COUNTIF($D$19:INDIRECT($P106),\"*1*\")","v":5},{"$f":"COLUMN($J$18)-1","v":9},{"$f":"SUBSTITUTE(ADDRESS(1,O106,4),1,\"\")&ROW($J$18)+1","v":"I19"},"Total Marks Scored"]
[null,null,"CO2",{"$f":"IFERROR((IF(ISNUMBER(SEARCH(\"2\", D$19)),D$76,\"0\")),\"0\")","v":289},200,"0","0","0","0",{"$f":"IFERROR(SUM($D107:INDIRECT($M107)),\"0\")","v":489},null,null,"I107",{"$f":"COUNTIF($D$19:INDIRECT($P107),\"*2*\")","v":2},9,{"$f":"SUBSTITUTE(ADDRESS(1,O107,4),1,\"\")&ROW($J$18)+1","v":"I19"}]
[null,null,"CO3",{"$f":"IFERROR((IF(ISNUMBER(SEARCH(\"3\", D$19)),D$76,\"0\")),\"0\")","v":"0"},"0",191,202,321,"0",{"$f":"IFERROR(SUM($D108:INDIRECT($M108)),\"0\")","v":714},null,null,"I108",{"$f":"COUNTIF($D$19:INDIRECT($P108),\"*3*\")","v":3},9,"I19"]
[null,null,"CO4",{"$f":"IFERROR((IF(ISNUMBER(SEARCH(\"4\", D$19)),D$76,\"0\")),\"0\")","v":289},"0",191,"0",321,263,{"$f":"IFERROR(SUM($D109:INDIRECT($M109)),\"0\")","v":1064},null,null,"I109",{"$f":"COUNTIF($D$19:INDIRECT($P109),\"*4*\")","v":4},9,"I19"]
[null,null,"CO5",{"$f":"IFERROR((IF(ISNUMBER(SEARCH(\"5\", D$19)),D$76,\"0\")),\"0\")","v":"0"},"0",191,202,"0",263,{"$f":"IFERROR(SUM($D110:INDIRECT($M110)),\"0\")","v":656},null,null,"I110",{"$f":"COUNTIF($D$19:INDIRECT($P110),\"*5*\")","v":3},9,"I19"]
[null,null,"CO6",{"$f":"IFERROR((IF(ISNUMBER(SEARCH(\"6\", D$19)),D$76,\"0\")),\"0\")","v":"0"},"0","0","0","0","0",{"$f":"IFERROR(SUM($D111:INDIRECT($M111)),\"0\")","v":0},null,null,"I111",{"$f":"COUNTIF($D$19:INDIRECT($P111),\"*6*\")","v":0},9,"I19"]
[]
[null,null,"CO1",{"$f":"IFERROR((IF(ISNUMBER(SEARCH(\"1\", D$19)),D$77,\"0\")),\"0\")","v":28},20,24,23,"0",23,{"$f":"IFERROR(SUM($D113:INDIRECT($M113)),\"0\")","v":118},null,null,{"$f":"SUBSTITUTE(ADDRESS(1,O113,4),1,\"\")&ROW($J113)","v":"I113"},{"$f":"COUNTIF($D$19:INDIRECT($P113),\"*1*\")","v":5},{"$f":"COLUMN($J$18)-1","v":9},{"$f":"SUBSTITUTE(ADDRESS(1,O113,4),1,\"\")&ROW($J$18)+1","v":"I19"},"No of Studdents Attended"]
[null,null,"CO2",{"$f":"IFERROR((IF(ISNUMBER(SEARCH(\"2\", D$19)),D$77,\"0\")),\"0\")","v":28},20,"0","0","0","0",{"$f":"IFERROR(SUM($D114:INDIRECT($M114)),\"0\")","v":48},null,null,"I114",{"$f":"COUNTIF($D$19:INDIRECT($P114),\"*2*\")","v":2},9,{"$f":"SUBSTITUTE(ADDRESS(1,O114,4),1,\"\")&ROW($J$18)+1","v":"I19"}]
[null,null,"CO3",{"$f":"IFERROR((IF(ISNUMBER(SEARCH(\"3\", D$19)),D$77,\"0\")),\"0\")","v":"0"},"0",24,23,25,"0",{"$f":"IFERROR(SUM($D115:INDIRECT($M115)),\"0\")","v":72},null,null,"I115",{"$f":"COUNTIF($D$19:INDIRECT($P115),\"*3*\")","v":3},9,"I19"]
[null,null,"CO4",{"$f":"IFERROR((IF(ISNUMBER(SEARCH(\"4\", D$19)),D$77,\"0\")),\"0\")","v":28},"0",24,"0",25,23,{"$f":"IFERROR(SUM($D116:INDIRECT($M116)),\"0\")","v":100},null,null,"I116",{"$f":"COUNTIF($D$19:INDIRECT($P116),\"*4*\")","v":4},9,"I19"]
[null,null,"CO5",{"$f":"IFERROR((IF(ISNUMBER(SEARCH(\"5\", D$19)),D$77,\"0\")),\"0\")","v":"0"},"0",24,23,"0",23,{"$f":"IFERROR(SUM($D117:INDIRECT($M117)),\"0\")","v":70},null,null,"I117",{"$f":"COUNTIF($D$19:INDIRECT($P117),\"*5*\")","v":3},9,"I19"]
[null,null,"CO6",{"$f":"IFERROR((IF(ISNUMBER(SEARCH(\"6\", D$19)),D$77,\"0\")),\"0\")","v":"0"},"0","0","0","0","0",{"$f":"IFERROR(SUM($D118:INDIRECT($M118)),\"0\")","v":0},null,null,"I118",{"$f":"COUNTIF($D$19:INDIRECT($P118),\"*6*\")","v":0},9,"I19"]
[]
[null,null,"CO1",{"$f":"IFERROR((IF(ISNUMBER(SEARCH(\"1\", D$19)),D$78,\"0\")),\"0\")","v":9},3,9,9,"0",12,{"$f":"IFERROR(SUM($D120:INDIRECT($M120)),\"0\")","v":42},null,null,{"$f":"SUBSTITUTE(ADDRESS(1,O120,4),1,\"\")&ROW($J120)","v":"I120"},{"$f":"COUNTIF($D$19:INDIRECT($P120),\"*1*\")","v":5},{"$f":"COLUMN($J$18)-1","v":9},{"$f":"SUBSTITUTE(ADDRESS(1,O120,4),1,\"\")&ROW($J$18)+1","v":"I19"},"Difficulty Level"]
[null,null,"CO2",{"$f":"IFERROR((IF(ISNUMBER(SEARCH(\"2\", D$19)),D$78,\"0\")),\"0\")","v":9},3,"0","0","0","0",{"$f":"IFERROR(SUM($D121:INDIRECT($M121)),\"0\")","v":12},null,null,"I121",{"$f":"COUNTIF($D$19:INDIRECT($P121),\"*2*\")","v":2},9,{"$f":"SUBSTITUTE(ADDRESS(1,O121,4),1,\"\")&ROW($J$18)+1","v":"I19"}]
[null,null,"CO3",{"$f":"IFERROR((IF(ISNUMBER(SEARCH(\"3\", D$19)),D$78,\"0\")),\"0\")","v":"0"},"0",9,9,12,"0",{"$f":"IFERROR(SUM($D122:INDIRECT($M122)),\"0\")","v":30},null,null,"I122",{"$f":"COUNTIF($D$19:INDIRECT($P122),\"*3*\")","v":3},9,"I19"]
[null,null,"CO4",{"$f":"IFERROR((IF(ISNUMBER(SEARCH(\"4\", D$19)),D$78,\"0\")),\"0\")","v":9},"0",9,"0",12,12,{"$f":"IFERROR(SUM($D123:INDIRECT($M123)),\"0\")","v":42},null,null,"I123",{"$f":"COUNTIF($D$19:INDIRECT($P123),\"*4*\")","v":4},9,"I19"]
[null,null,"CO5",{"$f":"IFERROR((IF(ISNUMBER(SEARCH(\"5\", D$19)),D$78,\"0\")),\"0\")","v":"0"},"0",9,9,"0",12,{"$f":"IFERROR(SUM($D124:INDIRECT($M124)),\"0\")","v":30},null,null,"I124",{"$f":"COUNTIF($D$19:INDIRECT($P124),\"*5*\")","v":3},9,"I19"]
[null,null,"CO6",{"$f":"IFERROR((IF(ISNUMBER(SEARCH(\"6\", D$19)),D$78,\"0\")),\"0\")","v":"0"},"0","0","0","0","0",{"$f":"IFERROR(SUM($D125:INDIRECT($M125)),\"0\")","v":0},null,null,"I125",{"$f":"COUNTIF($D$19:INDIRECT($P125),\"*6*\")","v":0},9,"I19"]
[]
[null,null,"CO1",{"$f":"IFERROR((IF(ISNUMBER(SEARCH(\"1\", D$19)),D$79,\"0\")),\"0\")","v":19},20,8,9,"0",14,{"$f":"IFERROR(SUM($D127:INDIRECT($M127)),\"0\")","v":70},null,null,{"$f":"SUBSTITUTE(ADDRESS(1,O127,4),1,\"\")&ROW($J127)","v":"I127"},{"$f":"COUNTIF($D$19:INDIRECT($P127),\"*1*\")","v":5},{"$f":"COLUMN($J$18)-1","v":9},{"$f":"SUBSTITUTE(ADDRESS(1,O127,4),1,\"\")&ROW($J$18)+1","v":"I19"},"No of Studdents Above Difficulty Level"]
[null,null,"CO2",{"$f":"IFERROR((IF(ISNUMBER(SEARCH(\"2\", D$19)),D$79,\"0\")),\"0\")","v":19},20,"0","0","0","0",{"$f":"IFERROR(SUM($D128:INDIRECT($M128)),\"0\")","v":39},null,null,"I128",{"$f":"COUNTIF($D$19:INDIRECT($P128),\"*2*\")","v":2},9,{"$f":"SUBSTITUTE(ADDRESS(1,O128,4),1,\"\")&ROW($J$18)+1","v":"I19"}]
[null,null,"CO3",{"$f":"IFERROR((IF(ISNUMBER(SEARCH(\"3\", D$19)),D$79,\"0\")),\"0\")","v":"0"},"0",8,9,17,"0",{"$f":"IFERROR(SUM($D129:INDIRECT($M129)),\"0\")","v":34},null,null,"I129",{"$f":"COUNTIF($D$19:INDIRECT($P129),\"*3*\")","v":3},9,"I19"]
[null,null,"CO4",{"$f":"IFERROR((IF(ISNUMBER(SEARCH(\"4\", D$19)),D$79,\"0\")),\"0\")","v":19},"0",8,"0",17,14,{"$f":"IFERROR(SUM($D130:INDIRECT($M130)),\"0\")","v":58},null,null,"I130",{"$f":"COUNTIF($D$19:INDIRECT($P130),\"*4*\")","v":4},9,"I19"]
[null,null,"CO5",{"$f":"IFERROR((IF(ISNUMBER(SEARCH(\"5\", D$19)),D$79,\"0\")),\"0\")","v":"0"},"0",8,9,"0",14,{"$f":"IFERROR(SUM($D131:INDIRECT($M131)),\"0\")","v":31},null,null,"I131",{"$f":"COUNTIF($D$19:INDIRECT($P131),\"*5*\")","v":3},9,"I19"]
[null,null,"CO6",{"$f":"IFERROR((IF(ISNUMBER(SEARCH(\"6\", D$19)),D$79,\"0\")),\"0\")","v":"0"},"0","0","0","0","0",{"$f":"IFERROR(SUM($D132:INDIRECT($M132)),\"0\")","v":0},null,null,"I132",{"$f":"COUNTIF($D$19:INDIRECT($P132),\"*6*\")","v":0},9,"I19"]
[]
[null,null,1,{"$f":"IFERROR((IF(ISNUMBER(SEARCH(\"1\", D$20)),D$21/IF(LEN(D20)=16,6,IF(LEN(D20)=13,5,IF(LEN(D20)=10,4,IF(LEN(D20)=7,3,IF(LEN(D20)=4,2,1))))),\"0\")),\"0\")","v":7.5},2.5,"0",7.5,"0","0",{"$f":"IFERROR(SUM($D134:INDIRECT($M134)),\"0\")","v":17.5},null,null,{"$f":"SUBSTITUTE(ADDRESS(1,O134,4),1,\"\")&ROW($J134)","v":"I134"},{"$f":"COUNTIF($D$20:INDIRECT($P134),\"1\")","v":0},{"$f":"COLUMN($J$18)-1","v":9},{"$f":"SUBSTITUTE(ADDRESS(1,O134,4),1,\"\")&ROW($J$19)+1","v":"I20"}]
[null,null,2,{"$f":"IFERROR((IF(ISNUMBER(SEARCH(\"2\", D$20)),D$21/IF(LEN(D20)=16,6,IF(LEN(D20)=13,5,IF(LEN(D20)=10,4,IF(LEN(D20)=7,3,IF(LEN(D20)=4,2,1))))),\"0\")),\"0\")","v":7.5},"0",7.5,7.5,20,10,{"$f":"IFERROR(SUM($D135:INDIRECT($M135)),\"0\")","v":52.5},null,null,{"$f":"SUBSTITUTE(ADDRESS(1,O135,4),1,\"\")&ROW($J135)","v":"I135"},{"$f":"COUNTIF($D$20:INDIRECT($P135),\"2\")","v":1},9,"I20"]
[null,null,3,{"$f":"IFERROR((IF(ISNUMBER(SEARCH(\"3\", D$20)),D$21/IF(LEN(D20)=16,6,IF(LEN(D20)=13,5,IF(LEN(D20)=10,4,IF(LEN(D20)=7,3,IF(LEN(D20)=4,2,1))))),\"0\")),\"0\")","v":"0"},"0","0","0","0",10,{"$f":"IFERROR(SUM($D136:INDIRECT($M136)),\"0\")","v":10},null,null,"I136",{"$f":"COUNTIF($D$20:INDIRECT($P136),\"3\")","v":0},9,"I20"]
[null,null,4,{"$f":"IFERROR((IF(ISNUMBER(SEARCH(\"4\", D$20)),D$21/IF(LEN(D20)=16,6,IF(LEN(D20)=13,5,IF(LEN(D20)=10,4,IF(LEN(D20)=7,3,IF(LEN(D20)=4,2,1))))),\"0\")),\"0\")","v":"0"},"0","0","0","0","0",{"$f":"IFERROR(SUM($D137:INDIRECT($M137)),\"0\")","v":0},null,null,"I137",{"$f":"COUNTIF($D$20:INDIRECT($P137),\"4\")","v":0},9,"I20"]
[null,null,5,{"$f":"IFERROR((IF(ISNUMBER(SEARCH(\"5\", D$20)),D$21/IF(LEN(D20)=16,6,IF(LEN(D20)=13,5,IF(LEN(D20)=10,4,IF(LEN(D20)=7,3,IF(LEN(D20)=4,2,1))))),\"0\")),\"0\")","v":"0"},"0","0","0","0","0",{"$f":"IFERROR(SUM($D138:INDIRECT($M138)),\"0\")","v":0},null,null,"I138",{"$f":"COUNTIF($D$20:INDIRECT($P138),\"5\")","v":0},9,"I20"]
[null,null,6,{"$f":"IFERROR((IF(ISNUMBER(SEARCH(\"6\", D$20)),D$21/IF(LEN(D20)=16,6,IF(LEN(D20)=13,5,IF(LEN(D20)=10,4,IF(LEN(D20)=7,3,IF(LEN(D20)=4,2,1))))),\"0\")),\"0\")","v":"0"},2.5,7.5,"0","0","0",{"$f":"IFERROR(SUM($D139:INDIRECT($M139)),\"0\")","v":10},null,null,"I139",{"$f":"COUNTIF($D$20:INDIRECT($P139),\"6\")","v":0},9,"I20"]

{"sheet":"T1_Analysis","index":3,"n_rows":89,"n_cols":5,"rows_kept":89,"cut":false,"hidden":false,"merged":[[2,0,2,3],[4,0,4,3],[6,0,6,3],[8,0,8,3]]}
[]
[]
[{"$f":"Data_Sheet!A2","v":"Jyothi Engineering College, Cheruthuruthy"}]
[]
[{"$f":"'T1'!A9","v":"Department of Electrical & Electronics Engineering"}]
[]
[{"$f":"'T1'!A11","v":"CO Analysis - Internal Marks : First Internal Exam                       16-09-19"}]
[]
[{"$f":"Data_Sheet!A17","v":"S7 EC              EC407 Computer Communication               2019-20"}]
[]
[]
[]
[]
[]
[]
[]
[]
[]
[]
[]
[]
[{"$f":"'T1'!A18","v":"Register No."},{"$f":"'T1'!B18","v":"Name of Student"},{"$f":"'T1'!J18","v":"Total Marks (50)"},"Category"]
[]
["Column1","Column2","Column3","Column4"]
[{"$f":"Data_Sheet!A25","v":"JEC16EC051"},{"$f":"Data_Sheet!B25","v":"LANA KOLLATH"},{"$f":"'T1'!J25","v":34},{"$f":"IF(C25=\"A\",\"ABSENT\",IF(C25>='T1'!$F$5*$E$82/100,\"EXCELLENT\",IF(C25>='T1'!$F$5*$E$81/100,\"GOOD\",IF(C25>='T1'!$F$5*$E$80/100,\"AVERAGE\",\"POOR\"))))","v":"GOOD"}]
[{"$f":"Data_Sheet!A26","v":"JEC16EC052"},{"$f":"Data_Sheet!B26","v":"MANU JENSON"},{"$f":"'T1'!J26","v":32},{"$f":"IF(C26=\"A\",\"ABSENT\",IF(C26>='T1'!$F$5*$E$82/100,\"EXCELLENT\",IF(C26>='T1'!$F$5*$E$81/100,\"GOOD\",IF(C26>='T1'!$F$5*$E$80/100,\"AVERAGE\",\"POOR\"))))","v":"GOOD"}]
[{"$f":"Data_Sheet!A27","v":"JEC16EC053"},{"$f":"Data_Sheet!B27","v":"MAREENA MARIYA ABRAHAM"},{"$f":"'T1'!J27","v":37},{"$f":"IF(C27=\"A\",\"ABSENT\",IF(C27>='T1'!$F$5*$E$82/100,\"EXCELLENT\",IF(C27>='T1'!$F$5*$E$81/100,\"GOOD\",IF(C27>='T1'!$F$5*$E$80/100,\"AVERAGE\",\"POOR\"))))","v":"GOOD"}]
[{"$f":"Data_Sheet!A28","v":"JEC16EC054"},{"$f":"Data_Sheet!B28","v":"MARIAN DAVIS KATTUKARAN"},{"$f":"'T1'!J28","v":23},{"$f":"IF(C28=\"A\",\"ABSENT\",IF(C28>='T1'!$F$5*$E$82/100,\"EXCELLENT\",IF(C28>='T1'!$F$5*$E$81/100,\"GOOD\",IF(C28>='T1'!$F$5*$E$80/100,\"AVERAGE\",\"POOR\"))))","v":"AVERAGE"}]
[{"$f":"Data_Sheet!A29","v":"JEC16EC055"},{"$f":"Data_Sheet!B29","v":"MARY JEETHU A J"},{"$f":"'T1'!J29","v":40},{"$f":"IF(C29=\"A\",\"ABSENT\",IF(C29>='T1'!$F$5*$E$82/100,\"EXCELLENT\",IF(C29>='T1'!$F$5*$E$81/100,\"GOOD\",IF(C29>='T1'!$F$5*$E$80/100,\"AVERAGE\",\"POOR\"))))","v":"EXCELLENT"}]
[{"$f":"Data_Sheet!A30","v":"JEC16EC056"},{"$f":"Data_Sheet!B30","v":"MUBASHIRA K M"},{"$f":"'T1'!J30","v":46},{"$f":"IF(C30=\"A\",\"ABSENT\",IF(C30>='T1'!$F$5*$E$82/100,\"EXCELLENT\",IF(C30>='T1'!$F$5*$E$81/100,\"GOOD\",IF(C30>='T1'!$F$5*$E$80/100,\"AVERAGE\",\"POOR\"))))","v":"EXCELLENT"}]
[{"$f":"Data_Sheet!A31","v":"JEC16EC057"},{"$f":"Data_Sheet!B31","v":"MUHAMMED ARSHAD"},{"$f":"'T1'!J31","v":23},{"$f":"IF(C31=\"A\",\"ABSENT\",IF(C31>='T1'!$F$5*$E$82/100,\"EXCELLENT\",IF(C31>='T1'!$F$5*$E$81/100,\"GOOD\",IF(C31>='T1'!$F$5*$E$80/100,\"AVERAGE\",\"POOR\"))))","v":"AVERAGE"}]
[{"$f":"Data_Sheet!A32","v":"JEC16EC058"},{"$f":"Data_Sheet!B32","v":"NANDANA K"},{"$f":"'T1'!J32","v":39},{"$f":"IF(C32=\"A\",\"ABSENT\",IF(C32>='T1'!$F$5*$E$82/100,\"EXCELLENT\",IF(C32>='T1'!$F$5*$E$81/100,\"GOOD\",IF(C32>='T1'!$F$5*$E$80/100,\"AVERAGE\",\"POOR\"))))","v":"GOOD"}]
[{"$f":"Data_Sheet!A33","v":"JEC16EC059"},{"$f":"Data_Sheet!B33","v":"NARAYANAN M B"},{"$f":"'T1'!J33","v":24},{"$f":"IF(C33=\"A\",\"ABSENT\",IF(C33>='T1'!$F$5*$E$82/100,\"EXCELLENT\",IF(C33>='T1'!$F$5*$E$81/100,\"GOOD\",IF(C33>='T1'!$F$5*$E$80/100,\"AVERAGE\",\"POOR\"))))","v":"AVERAGE"}]
[{"$f":"Data_Sheet!A34","v":"JEC16EC061"},{"$f":"Data_Sheet!B34","v":"NIKHIL KJ"},{"$f":"'T1'!J34","v":31},{"$f":"IF(C34=\"A\",\"ABSENT\",IF(C34>='T1'!$F$5*$E$82/100,\"EXCELLENT\",IF(C34>='T1'!$F$5*$E$81/100,\"GOOD\",IF(C34>='T1'!$F$5*$E$80/100,\"AVERAGE\",\"POOR\"))))","v":"GOOD"}]
[{"$f":"Data_Sheet!A35","v":"JEC16EC062"},{"$f":"Data_Sheet!B35","v":"NIMISHA M S"},{"$f":"'T1'!J35","v":23},{"$f":"IF(C35=\"A\",\"ABSENT\",IF(C35>='T1'!$F$5*$E$82/100,\"EXCELLENT\",IF(C35>='T1'!$F$5*$E$81/100,\"GOOD\",IF(C35>='T1'!$F$5*$E$80/100,\"AVERAGE\",\"POOR\"))))","v":"AVERAGE"}]
[{"$f":"Data_Sheet!A36","v":"JEC16EC063"},{"$f":"Data_Sheet!B36","v":"NIMISHA TONY"},{"$f":"'T1'!J36","v":33},{"$f":"IF(C36=\"A\",\"ABSENT\",IF(C36>='T1'!$F$5*$E$82/100,\"EXCELLENT\",IF(C36>='T1'!$F$5*$E$81/100,\"GOOD\",IF(C36>='T1'!$F$5*$E$80/100,\"AVERAGE\",\"POOR\"))))","v":"GOOD"}]
[{"$f":"Data_Sheet!A37","v":"JEC16EC064"},{"$f":"Data_Sheet!B37","v":"NITHIN"},{"$f":"'T1'!J37","v":33},{"$f":"IF(C37=\"A\",\"ABSENT\",IF(C37>='T1'!$F$5*$E$82/100,\"EXCELLENT\",IF(C37>='T1'!$F$5*$E$81/100,\"GOOD\",IF(C37>='T1'!$F$5*$E$80/100,\"AVERAGE\",\"POOR\"))))","v":"GOOD"}]
[{"$f":"Data_Sheet!A38","v":"JEC16EC065"},{"$f":"Data_Sheet!B38","v":"OLIVIA NELSON"},{"$f":"'T1'!J38","v":34},{"$f":"IF(C38=\"A\",\"ABSENT\",IF(C38>='T1'!$F$5*$E$82/100,\"EXCELLENT\",IF(C38>='T1'!$F$5*$E$81/100,\"GOOD\",IF(C38>='T1'!$F$5*$E$80/100,\"AVERAGE\",\"POOR\"))))","v":"GOOD"}]
[{"$f":"Data_Sheet!A39","v":"JEC16EC066"},{"$f":"Data_Sheet!B39","v":"PAVITHRA.P"},{"$f":"'T1'!J39","v":45},{"$f":"IF(C39=\"A\",\"ABSENT\",IF(C39>='T1'!$F$5*$E$82/100,\"EXCELLENT\",IF(C39>='T1'!$F$5*$E$81/100,\"GOOD\",IF(C39>='T1'!$F$5*$E$80/100,\"AVERAGE\",\"POOR\"))))","v":"EXCELLENT"}]
[{"$f":"Data_Sheet!A40","v":"JEC16EC067"},{"$f":"Data_Sheet!B40","v":"P.DHANYA RAJ"},{"$f":"'T1'!J40","v":43},{"$f":"IF(C40=\"A\",\"ABSENT\",IF(C40>='T1'!$F$5*$E$82/100,\"EXCELLENT\",IF(C40>='T1'!$F$5*$E$81/100,\"GOOD\",IF(C40>='T1'!$F$5*$E$80/100,\"AVERAGE\",\"POOR\"))))","v":"EXCELLENT"}]
[{"$f":"Data_Sheet!A41","v":"JEC16EC068"},{"$f":"Data_Sheet!B41","v":"POOJA.P"},{"$f":"'T1'!J41","v":41},{"$f":"IF(C41=\"A\",\"ABSENT\",IF(C41>='T1'!$F$5*$E$82/100,\"EXCELLENT\",IF(C41>='T1'!$F$5*$E$81/100,\"GOOD\",IF(C41>='T1'!$F$5*$E$80/100,\"AVERAGE\",\"POOR\"))))","v":"EXCELLENT"}]
[{"$f":"Data_Sheet!A42","v":"JEC16EC069"},{"$f":"Data_Sheet!B42","v":"PRANAV"},{"$f":"'T1'!J42","v":28},{"$f":"IF(C42=\"A\",\"ABSENT\",IF(C42>='T1'!$F$5*$E$82/100,\"EXCELLENT\",IF(C42>='T1'!$F$5*$E$81/100,\"GOOD\",IF(C42>='T1'!$F$5*$E$80/100,\"AVERAGE\",\"POOR\"))))","v":"AVERAGE"}]
[{"$f":"Data_Sheet!A43","v":"JEC16EC070"},{"$f":"Data_Sheet!B43","v":"PRASOBH KP"},{"$f":"'T1'!J43","v":31},{"$f":"IF(C43=\"A\",\"ABSENT\",IF(C43>='T1'!$F$5*$E$82/100,\"EXCELLENT\",IF(C43>='T1'!$F$5*$E$81/100,\"GOOD\",IF(C43>='T1'!$F$5*$E$80/100,\"AVERAGE\",\"POOR\"))))","v":"GOOD"}]
[{"$f":"Data_Sheet!A44","v":"JEC16EC071"},{"$f":"Data_Sheet!B44","v":"PRINCE BENNY"},{"$f":"'T1'!J44","v":37},{"$f":"IF(C44=\"A\",\"ABSENT\",IF(C44>='T1'!$F$5*$E$82/100,\"EXCELLENT\",IF(C44>='T1'!$F$5*$E$81/100,\"GOOD\",IF(C44>='T1'!$F$5*$E$80/100,\"AVERAGE\",\"POOR\"))))","v":"GOOD"}]
[{"$f":"Data_Sheet!A45","v":"JEC16EC072"},{"$f":"Data_Sheet!B45","v":"PRIYA.K"},{"$f":"'T1'!J45","v":27},{"$f":"IF(C45=\"A\",\"ABSENT\",IF(C45>='T1'!$F$5*$E$82/100,\"EXCELLENT\",IF(C45>='T1'!$F$5*$E$81/100,\"GOOD\",IF(C45>='T1'!$F$5*$E$80/100,\"AVERAGE\",\"POOR\"))))","v":"AVERAGE"}]
[{"$f":"Data_Sheet!A46","v":"JEC16EC073"},{"$f":"Data_Sheet!B46","v":"RADHIKA"},{"$f":"'T1'!J46","v":45},{"$f":"IF(C46=\"A\",\"ABSENT\",IF(C46>='T1'!$F$5*$E$82/100,\"EXCELLENT\",IF(C46>='T1'!$F$5*$E$81/100,\"GOOD\",IF(C46>='T1'!$F$5*$E$80/100,\"AVERAGE\",\"POOR\"))))","v":"EXCELLENT"}]
[{"$f":"Data_Sheet!A47","v":"JEC16EC074"},{"$f":"Data_Sheet!B47","v":"RINOSHA.K.R"},{"$f":"'T1'!J47","v":32},{"$f":"IF(C47=\"A\",\"ABSENT\",IF(C47>='T1'!$F$5*$E$82/100,\"EXCELLENT\",IF(C47>='T1'!$F$5*$E$81/100,\"GOOD\",IF(C47>='T1'!$F$5*$E$80/100,\"AVERAGE\",\"POOR\"))))","v":"GOOD"}]
[{"$f":"Data_Sheet!A48","v":"JEC16EC075"},{"$f":"Data_Sheet!B48","v":"RIYA ALBERT"},{"$f":"'T1'!J48","v":25},{"$f":"IF(C48=\"A\",\"ABSENT\",IF(C48>='T1'!$F$5*$E$82/100,\"EXCELLENT\",IF(C48>='T1'!$F$5*$E$81/100,\"GOOD\",IF(C48>='T1'!$F$5*$E$80/100,\"AVERAGE\",\"POOR\"))))","v":"AVERAGE"}]
[{"$f":"Data_Sheet!A49","v":"JEC16EC076"},{"$f":"Data_Sheet!B49","v":"RIYA PS"},{"$f":"'T1'!J49","v":30},{"$f":"IF(C49=\"A\",\"ABSENT\",IF(C49>='T1'!$F$5*$E$82/100,\"EXCELLENT\",IF(C49>='T1'!$F$5*$E$81/100,\"GOOD\",IF(C49>='T1'!$F$5*$E$80/100,\"AVERAGE\",\"POOR\"))))","v":"GOOD"}]
[{"$f":"Data_Sheet!A50","v":"JEC16EC077"},{"$f":"Data_Sheet!B50","v":"ROSHNI J NAIR"},{"$f":"'T1'!J50","v":37},{"$f":"IF(C50=\"A\",\"ABSENT\",IF(C50>='T1'!$F$5*$E$82/100,\"EXCELLENT\",IF(C50>='T1'!$F$5*$E$81/100,\"GOOD\",IF(C50>='T1'!$F$5*$E$80/100,\"AVERAGE\",\"POOR\"))))","v":"GOOD"}]
[{"$f":"Data_Sheet!A51","v":"JEC16EC079"},{"$f":"Data_Sheet!B51","v":"SAFNA M"},{"$f":"'T1'!J51","v":33},{"$f":"IF(C51=\"A\",\"ABSENT\",IF(C51>='T1'!$F$5*$E$82/100,\"EXCELLENT\",IF(C51>='T1'!$F$5*$E$81/100,\"GOOD\",IF(C51>='T1'!$F$5*$E$80/100,\"AVERAGE\",\"POOR\"))))","v":"GOOD"}]
[{"$f":"Data_Sheet!A52","v":"JEC16EC080"},{"$f":"Data_Sheet!B52","v":"SAJIN SHAJI"},{"$f":"'T1'!J52","v":23},{"$f":"IF(C52=\"A\",\"ABSENT\",IF(C52>='T1'!$F$5*$E$82/100,\"EXCELLENT\",IF(C52>='T1'!$F$5*$E$81/100,\"GOOD\",IF(C52>='T1'!$F$5*$E$80/100,\"AVERAGE\",\"POOR\"))))","v":"AVERAGE"}]
[{"$f":"Data_Sheet!A53","v":"JEC16EC081"},{"$f":"Data_Sheet!B53","v":"SANDHRA .S"},{"$f":"'T1'!J53","v":20},{"$f":"IF(C53=\"A\",\"ABSENT\",IF(C53>='T1'!$F$5*$E$82/100,\"EXCELLENT\",IF(C53>='T1'!$F$5*$E$81/100,\"GOOD\",IF(C53>='T1'!$F$5*$E$80/100,\"AVERAGE\",\"POOR\"))))","v":"POOR"}]
[{"$f":"Data_Sheet!A54","v":"JEC16EC082"},{"$f":"Data_Sheet!B54","v":"SANGAMITHRA"},{"$f":"'T1'!J54","v":32},{"$f":"IF(C54=\"A\",\"ABSENT\",IF(C54>='T1'!$F$5*$E$82/100,\"EXCELLENT\",IF(C54>='T1'!$F$5*$E$81/100,\"GOOD\",IF(C54>='T1'!$F$5*$E$80/100,\"AVERAGE\",\"POOR\"))))","v":"GOOD"}]
[{"$f":"Data_Sheet!A55","v":"JEC16EC083"},{"$f":"Data_Sheet!B55","v":"SARANYA.M.NAIR"},{"$f":"'T1'!J55","v":29},{"$f":"IF(C55=\"A\",\"ABSENT\",IF(C55>='T1'!$F$5*$E$82/100,\"EXCELLENT\",IF(C55>='T1'!$F$5*$E$81/100,\"GOOD\",IF(C55>='T1'!$F$5*$E$80/100,\"AVERAGE\",\"POOR\"))))","v":"AVERAGE"}]
[{"$f":"Data_Sheet!A56","v":"JEC16EC084"},{"$f":"Data_Sheet!B56","v":"SARATHRAJ"},{"$f":"'T1'!J56","v":25},{"$f":"IF(C56=\"A\",\"ABSENT\",IF(C56>='T1'!$F$5*$E$82/100,\"EXCELLENT\",IF(C56>='T1'!$F$5*$E$81/100,\"GOOD\",IF(C56>='T1'!$F$5*$E$80/100,\"AVERAGE\",\"POOR\"))))","v":"AVERAGE"}]
[{"$f":"Data_Sheet!A57","v":"JEC16EC085"},{"$f":"Data_Sheet!B57","v":"SHAHAN FATHIMA K"},{"$f":"'T1'!J57","v":22},{"$f":"IF(C57=\"A\",\"ABSENT\",IF(C57>='T1'!$F$5*$E$82/100,\"EXCELLENT\",IF(C57>='T1'!$F$5*$E$81/100,\"GOOD\",IF(C57>='T1'!$F$5*$E$80/100,\"AVERAGE\",\"POOR\"))))","v":"POOR"}]
[{"$f":"Data_Sheet!A58","v":"JEC16EC086"},{"$f":"Data_Sheet!B58","v":"SHAHLA.P.MOHAMMED"},{"$f":"'T1'!J58","v":28},{"$f":"IF(C58=\"A\",\"ABSENT\",IF(C58>='T1'!$F$5*$E$82/100,\"EXCELLENT\",IF(C58>='T1'!$F$5*$E$81/100,\"GOOD\",IF(C58>='T1'!$F$5*$E$80/100,\"AVERAGE\",\"POOR\"))))","v":"AVERAGE"}]
[{"$f":"Data_Sheet!A59","v":"JEC16EC087"},{"$f":"Data_Sheet!B59","v":"SHAMSEENA T A"},{"$f":"'T1'!J59","v":18},{"$f":"IF(C59=\"A\",\"ABSENT\",IF(C59>='T1'!$F$5*$E$82/100,\"EXCELLENT\",IF(C59>='T1'!$F$5*$E$81/100,\"GOOD\",IF(C59>='T1'!$F$5*$E$80/100,\"AVERAGE\",\"POOR\"))))","v":"POOR"}]
[{"$f":"Data_Sheet!A60","v":"JEC16EC088"},{"$f":"Data_Sheet!B60","v":"SHARAN SHASHINDRAN A"},{"$f":"'T1'!J60","v":12},{"$f":"IF(C60=\"A\",\"ABSENT\",IF(C60>='T1'!$F$5*$E$82/100,\"EXCELLENT\",IF(C60>='T1'!$F$5*$E$81/100,\"GOOD\",IF(C60>='T1'!$F$5*$E$80/100,\"AVERAGE\",\"POOR\"))))","v":"POOR"}]
[{"$f":"Data_Sheet!A61","v":"JEC16EC089"},{"$f":"Data_Sheet!B61","v":"SIBIN KRISHNA C"},{"$f":"'T1'!J61","v":33},{"$f":"IF(C61=\"A\",\"ABSENT\",IF(C61>='T1'!$F$5*$E$82/100,\"EXCELLENT\",IF(C61>='T1'!$F$5*$E$81/100,\"GOOD\",IF(C61>='T1'!$F$5*$E$80/100,\"AVERAGE\",\"POOR\"))))","v":"GOOD"}]
[{"$f":"Data_Sheet!A62","v":"JEC16EC090"},{"$f":"Data_Sheet!B62","v":"SREEJITH VIJAYAKUMAR"},{"$f":"'T1'!J62","v":0},{"$f":"IF(C62=\"A\",\"ABSENT\",IF(C62>='T1'!$F$5*$E$82/100,\"EXCELLENT\",IF(C62>='T1'!$F$5*$E$81/100,\"GOOD\",IF(C62>='T1'!$F$5*$E$80/100,\"AVERAGE\",\"POOR\"))))","v":"POOR"}]
[{"$f":"Data_Sheet!A63","v":"JEC16EC091"},{"$f":"Data_Sheet!B63","v":"SREELAKSHMI.R"},{"$f":"'T1'!J63","v":44},{"$f":"IF(C63=\"A\",\"ABSENT\",IF(C63>='T1'!$F$5*$E$82/100,\"EXCELLENT\",IF(C63>='T1'!$F$5*$E$81/100,\"GOOD\",IF(C63>='T1'!$F$5*$E$80/100,\"AVERAGE\",\"POOR\"))))","v":"EXCELLENT"}]
[{"$f":"Data_Sheet!A64","v":"JEC16EC092"},{"$f":"Data_Sheet!B64","v":"SREERAG K M"},{"$f":"'T1'!J64","v":31},{"$f":"IF(C64=\"A\",\"ABSENT\",IF(C64>='T1'!$F$5*$E$82/100,\"EXCELLENT\",IF(C64>='T1'!$F$5*$E$81/100,\"GOOD\",IF(C64>='T1'!$F$5*$E$80/100,\"AVERAGE\",\"POOR\"))))","v":"GOOD"}]
[{"$f":"Data_Sheet!A65","v":"JEC16EC093"},{"$f":"Data_Sheet!B65","v":"SREERAG T K"},{"$f":"'T1'!J65","v":8},{"$f":"IF(C65=\"A\",\"ABSENT\",IF(C65>='T1'!$F$5*$E$82/100,\"EXCELLENT\",IF(C65>='T1'!$F$5*$E$81/100,\"GOOD\",IF(C65>='T1'!$F$5*$E$80/100,\"AVERAGE\",\"POOR\"))))","v":"POOR"}]
[{"$f":"Data_Sheet!A66","v":"JEC16EC094"},{"$f":"Data_Sheet!B66","v":"SREERAG V.V"},{"$f":"'T1'!J66","v":23},{"$f":"IF(C66=\"A\",\"ABSENT\",IF(C66>='T1'!$F$5*$E$82/100,\"EXCELLENT\",IF(C66>='T1'!$F$5*$E$81/100,\"GOOD\",IF(C66>='T1'!$F$5*$E$80/100,\"AVERAGE\",\"POOR\"))))","v":"AVERAGE"}]
[{"$f":"Data_Sheet!A67","v":"JEC16EC095"},{"$f":"Data_Sheet!B67","v":"SRUTHIMOL.N.T"},{"$f":"'T1'!J67","v":0},{"$f":"IF(C67=\"A\",\"ABSENT\",IF(C67>='T1'!$F$5*$E$82/100,\"EXCELLENT\",IF(C67>='T1'!$F$5*$E$81/100,\"GOOD\",IF(C67>='T1'!$F$5*$E$80/100,\"AVERAGE\",\"POOR\"))))","v":"POOR"}]
[{"$f":"Data_Sheet!A68","v":"JEC16EC096"},{"$f":"Data_Sheet!B68","v":"SRUTHISHA SASI"},{"$f":"'T1'!J68","v":40},{"$f":"IF(C68=\"A\",\"ABSENT\",IF(C68>='T1'!$F$5*$E$82/100,\"EXCELLENT\",IF(C68>='T1'!$F$5*$E$81/100,\"GOOD\",IF(C68>='T1'!$F$5*$E$80/100,\"AVERAGE\",\"POOR\"))))","v":"EXCELLENT"}]
[{"$f":"Data_Sheet!A69","v":"JEC16EC097"},{"$f":"Data_Sheet!B69","v":"SUCHITHRA.TS"},{"$f":"'T1'!J69","v":23},{"$f":"IF(C69=\"A\",\"ABSENT\",IF(C69>='T1'!$F$5*$E$82/100,\"EXCELLENT\",IF(C69>='T1'!$F$5*$E$81/100,\"GOOD\",IF(C69>='T1'!$F$5*$E$80/100,\"AVERAGE\",\"POOR\"))))","v":"AVERAGE"}]
[{"$f":"Data_Sheet!A70","v":"JEC16EC098"},{"$f":"Data_Sheet!B70","v":"SWETHA SARA GEORGE"},{"$f":"'T1'!J70","v":38},{"$f":"IF(C70=\"A\",\"ABSENT\",IF(C70>='T1'!$F$5*$E$82/100,\"EXCELLENT\",IF(C70>='T1'!$F$5*$E$81/100,\"GOOD\",IF(C70>='T1'!$F$5*$E$80/100,\"AVERAGE\",\"POOR\"))))","v":"GOOD"}]
[{"$f":"Data_Sheet!A71","v":"JEC16EC099"},{"$f":"Data_Sheet!B71","v":"VISHNU K"},{"$f":"'T1'!J71","v":32},{"$f":"IF(C71=\"A\",\"ABSENT\",IF(C71>='T1'!$F$5*$E$82/100,\"EXCELLENT\",IF(C71>='T1'!$F$5*$E$81/100,\"GOOD\",IF(C71>='T1'!$F$5*$E$80/100,\"AVERAGE\",\"POOR\"))))","v":"GOOD"}]
[{"$f":"Data_Sheet!A72","v":"JEC16EC100"},{"$f":"Data_Sheet!B72","v":"VISHNU PRAKASH"},{"$f":"'T1'!J72","v":23},{"$f":"IF(C72=\"A\",\"ABSENT\",IF(C72>='T1'!$F$5*$E$82/100,\"EXCELLENT\",IF(C72>='T1'!$F$5*$E$81/100,\"GOOD\",IF(C72>='T1'!$F$5*$E$80/100,\"AVERAGE\",\"POOR\"))))","v":"AVERAGE"}]
[{"$f":"Data_Sheet!A73","v":"JEC16EC101"},{"$f":"Data_Sheet!B73","v":"VISHNU V"},{"$f":"'T1'!J73","v":18},{"$f":"IF(C73=\"A\",\"ABSENT\",IF(C73>='T1'!$F$5*$E$82/100,\"EXCELLENT\",IF(C73>='T1'!$F$5*$E$81/100,\"GOOD\",IF(C73>='T1'!$F$5*$E$80/100,\"AVERAGE\",\"POOR\"))))","v":"POOR"}]
[{"$f":"Data_Sheet!A74","v":"LJEC16EC102"},{"$f":"Data_Sheet!B74","v":"CHRISTEENA PAULSON"},{"$f":"'T1'!J74","v":38},{"$f":"IF(C74=\"A\",\"ABSENT\",IF(C74>='T1'!$F$5*$E$82/100,\"EXCELLENT\",IF(C74>='T1'!$F$5*$E$81/100,\"GOOD\",IF(C74>='T1'!$F$5*$E$80/100,\"AVERAGE\",\"POOR\"))))","v":"GOOD"}]
[]
["Total Number of Students",null,{"$f":"Data_Sheet!$C$6","v":50}]
["Number of Students Absent",null,{"$f":"IF(COUNTIF(C25:INDIRECT(C89),\"=A\"),COUNTIF(C25:INDIRECT(C89),\"=A\"),0)","v":0}]
["Total Number of Students attended",null,{"$f":"C76-C77","v":50}]
[{"$f":"\"Number of Students with Marks less than \"&E80&\"%\"","v":"Number of Students with Marks less than 45%"},null,{"$f":"IF(COUNTIF(D25:INDIRECT(D89),\"=POOR\"),COUNTIF(D25:INDIRECT(D89),\"=POOR\"),0)","v":8},"POOR","Range"]
[{"$f":"\"Number of Students with Marks betweeen \"&E80&\"% to \"&E81&\"%\"","v":"Number of Students with Marks betweeen 45% to 60%"},null,{"$f":"IF(COUNTIF(D25:INDIRECT(D89),\"=AVERAGE\"),COUNTIF(D25:INDIRECT(D89),\"=AVERAGE\"),0)","v":14},"AVERAGE",45]
[{"$f":"\"Number of Students with Marks betweeen \"&E81&\"% to \"&E82&\"%\"","v":"Number of Students with Marks betweeen 60% to 80%"},null,{"$f":"IF(COUNTIF(D25:INDIRECT(D89),\"=GOOD\"),COUNTIF(D25:INDIRECT(D89),\"=GOOD\"),0)","v":20},"GOOD",60]
[{"$f":"\"Number of Students with Marks greater than \"&E82&\"%\"","v":"Number of Students with Marks greater than 80%"},null,{"$f":"IF(COUNTIF(D25:INDIRECT(D89),\"=EXCELLENT\"),COUNTIF(D25:INDIRECT(D89),\"=EXCELLENT\"),0)","v":8},"EXCELLENT",80]
["Class Average",null,{"$f":"ROUND(AVERAGE(C25:INDIRECT(C89)),2)","v":29.32}]
["Pass Percentage",null,{"$f":"ROUND(((C78-C79)/C78)*100,2)","v":84}]
[]
[null,{"$f":"Data_Sheet!B10","v":"Name of Faculty : "},{"$f":"Data_Sheet!B11","v":"PONMANI RAJA M"}]
[null,{"$f":"Data_Sheet!B94","v":"Dated Signature :  "}]
[]
[{"$f":"ROW(A76)-2","v":74},"Last Row Count",{"$f":"\"$C$\"&$A$89","v":"$C$74"},{"$f":"\"$D$\"&$A$89","v":"$D$74"}]

{"sheet":"T2","index":4,"n_rows":139,"n_cols":20,"rows_kept":139,"cut":false,"hidden":false,"merged":[[2,0,4,1],[2,2,2,5],[2,6,2,8],[3,2,3,5],[3,6,3,8],[4,2,4,4],[6,0,6,9],[8,0,8,9],[10,0,10,9],[12,0,12,9],[75,0,75,2],[17,0,21,0],[17,1,21,1],[17,9,21,9],[126,16,131,16],[98,16,103,16],[105,16,110,16],[112,16,117,16],[119,16,124,16],[76,0,76,2],[77,0,77,2],[78,0,78,2],[79,0,79,2],[17,12,21,12]]}
[]
[]
["Add questions one by one as needed..",null,"Assessment Category",null,null,null,"Date : ",null,null,null,"CO1","First Internal Exam"]
[null,null,"Second Internal Exam",null,null,null,"14-03-18",null,null,null,"CO2","Second Internal Exam"]
[null,null,"Total Marks : ",null,null,50,null,null,null,null,"CO3","Assessment Exam - 1"]
[null,null,null,null,null,null,null,null,null,null,"CO4","Assessment Exam - 2"]
[{"$f":"Data_Sheet!A2","v":"Jyothi Engineering College, Cheruthuruthy"},null,null,null,null,null,null,null,null,null,"CO5","Assignment - 1"]
[null,null,null,null,null,null,null,null,null,null,"CO6","Assignment - 2"]
[{"$f":"Data_Sheet!A4","v":"Department of Electrical & Electronics Engineering"},null,null,null,null,null,null,null,null,null,null,"Retest"]
[null,null,null,null,null,null,null,null,null,null,1]
[{"$f":"\"CO Analysis - Internal Marks : \"&C4 &\"                       \" &TEXT(G4,\"dd-mm-yy\")","v":"CO Analysis - Internal Marks : Second Internal Exam                       14-03-18"},null,null,null,null,null,null,null,null,null,2]
[null,null,null,null,null,null,null,null,null,null,3]
[{"$f":"Data_Sheet!A17","v":"S7 EC              EC407 Computer Communication               2019-20"},null,null,null,null,null,null,null,null,null,4]
[null,null,null,null,null,null,null,null,null,null,5]
[null,null,null,null,null,null,null,null,null,null,6]
[]
[]
["Register No.","Name of Student","Qn. No.",1,2,3,4,5,6,{"$f":" \"Total Marks (\" &F5 & \")\"","v":"Total Marks (50)"},null,null,"Calculated Total Marks (50)"]
[null,null,"CO's","CO1, CO4, CO2","CO2, CO1","CO1, CO3, CO4, CO5","CO1, CO3, CO5","CO3, CO4","CO1, CO4, CO5"]
[null,null,"Blooms Taxonomy Lavel","1, 2","1, 6","2, 6","1, 2",2,"2, 3"]
[null,null,"Max. Marks",15,5,15,15,20,20]
[null,null,"Difficulty Level in %",60,60,60,60,60,60]
[]
["Column1","Column2","Column3","Column4","Column5","Column6","Column7","Column4","Column8","Column32"]
[{"$f":"Data_Sheet!A25","v":"JEC16EC051"},{"$f":"Data_Sheet!B25","v":"LANA KOLLATH"},null,12,null,13,null,15,null,40]
[{"$f":"Data_Sheet!A26","v":"JEC16EC052"},{"$f":"Data_Sheet!B26","v":"MANU JENSON"},null,9,null,null,8,null,12,29]
[{"$f":"Data_Sheet!A27","v":"JEC16EC053"},{"$f":"Data_Sheet!B27","v":"MAREENA MARIYA ABRAHAM"},null,null,14,null,14,null,20,48]
[{"$f":"Data_Sheet!A28","v":"JEC16EC054"},{"$f":"Data_Sheet!B28","v":"MARIAN DAVIS KATTUKARAN"},null,null,13,12,null,18,null,43]
[{"$f":"Data_Sheet!A29","v":"JEC16EC055"},{"$f":"Data_Sheet!B29","v":"MARY JEETHU A J"},null,13,null,14,null,18,null,45]
[{"$f":"Data_Sheet!A30","v":"JEC16EC056"},{"$f":"Data_Sheet!B30","v":"MUBASHIRA K M"},null,14,null,14,null,null,16,44]
[{"$f":"Data_Sheet!A31","v":"JEC16EC057"},{"$f":"Data_Sheet!B31","v":"MUHAMMED ARSHAD"},null,11,null,12,null,13,null,36]
[{"$f":"Data_Sheet!A32","v":"JEC16EC058"},{"$f":"Data_Sheet!B32","v":"NANDANA K"},null,13,null,null,12,null,16,41]
[{"$f":"Data_Sheet!A33","v":"JEC16EC059"},{"$f":"Data_Sheet!B33","v":"NARAYANAN M B"},null,null,9,9,null,11,null,29]
[{"$f":"Data_Sheet!A34","v":"JEC16EC061"},{"$f":"Data_Sheet!B34","v":"NIKHIL KJ"},null,8,null,null,9,null,6,23]
[{"$f":"Data_Sheet!A35","v":"JEC16EC062"},{"$f":"Data_Sheet!B35","v":"NIMISHA M S"},null,null,13,14,null,16,null,43]
[{"$f":"Data_Sheet!A36","v":"JEC16EC063"},{"$f":"Data_Sheet!B36","v":"NIMISHA TONY"},null,13,null,null,12,null,19,44]
[{"$f":"Data_Sheet!A37","v":"JEC16EC064"},{"$f":"Data_Sheet!B37","v":"NITHIN"},null,14,null,12,null,null,12,38]
[{"$f":"Data_Sheet!A38","v":"JEC16EC065"},{"$f":"Data_Sheet!B38","v":"OLIVIA NELSON"},null,null,13,null,14,13,null,40]
[{"$f":"Data_Sheet!A39","v":"JEC16EC066"},{"$f":"Data_Sheet!B39","v":"PAVITHRA.P"},null,13,null,null,14,null,18,45]
[{"$f":"Data_Sheet!A40","v":"JEC16EC067"},{"$f":"Data_Sheet!B40","v":"P.DHANYA RAJ"},null,null,8,null,9,null,15,32]
[{"$f":"Data_Sheet!A41","v":"JEC16EC068"},{"$f":"Data_Sheet!B41","v":"POOJA.P"},null,13,null,null,14,19,null,46]
[{"$f":"Data_Sheet!A42","v":"JEC16EC069"},{"$f":"Data_Sheet!B42","v":"PRANAV"},null,null,9,11,null,10,null,30]
[{"$f":"Data_Sheet!A43","v":"JEC16EC070"},{"$f":"Data_Sheet!B43","v":"PRASOBH KP"},null,null,12,null,13,null,12,37]
[{"$f":"Data_Sheet!A44","v":"JEC16EC071"},{"$f":"Data_Sheet!B44","v":"PRINCE BENNY"},null,null,12,14,null,10,null,36]
[{"$f":"Data_Sheet!A45","v":"JEC16EC072"},{"$f":"Data_Sheet!B45","v":"PRIYA.K"},null,14,null,null,14,19,null,47]
[{"$f":"Data_Sheet!A46","v":"JEC16EC073"},{"$f":"Data_Sheet!B46","v":"RADHIKA"},null,null,13,null,15,null,18,46]
[{"$f":"Data_Sheet!A47","v":"JEC16EC074"},{"$f":"Data_Sheet!B47","v":"RINOSHA.K.R"},null,null,15,null,12,null,18,45]
[{"$f":"Data_Sheet!A48","v":"JEC16EC075"},{"$f":"Data_Sheet!B48","v":"RIYA ALBERT"},null,8,null,10,null,null,15,33]
[{"$f":"Data_Sheet!A49","v":"JEC16EC076"},{"$f":"Data_Sheet!B49","v":"RIYA PS"},null,null,null,2,13,null,19,34]
[{"$f":"Data_Sheet!A50","v":"JEC16EC077"},{"$f":"Data_Sheet!B50","v":"ROSHNI J NAIR"},null,13,null,14,null,15,null,42]
[{"$f":"Data_Sheet!A51","v":"JEC16EC079"},{"$f":"Data_Sheet!B51","v":"SAFNA M"},null,null,14,14,null,14,null,42]
[{"$f":"Data_Sheet!A52","v":"JEC16EC080"},{"$f":"Data_Sheet!B52","v":"SAJIN SHAJI"},null,11,null,15,null,null,16,42]
[{"$f":"Data_Sheet!A53","v":"JEC16EC081"},{"$f":"Data_Sheet!B53","v":"SANDHRA .S"},null,13,null,null,2,null,4,19]
[{"$f":"Data_Sheet!A54","v":"JEC16EC082"},{"$f":"Data_Sheet!B54","v":"SANGAMITHRA"},null,13,null,14,null,null,18,45]
[{"$f":"Data_Sheet!A55","v":"JEC16EC083"},{"$f":"Data_Sheet!B55","v":"SARANYA.M.NAIR"},null,null,10,null,14,18,null,42]
[{"$f":"Data_Sheet!A56","v":"JEC16EC084"},{"$f":"Data_Sheet!B56","v":"SARATHRAJ"},null,10,null,null,11,15,null,36]
[{"$f":"Data_Sheet!A57","v":"JEC16EC085"},{"$f":"Data_Sheet!B57","v":"SHAHAN FATHIMA K"},null,null,14,11,null,16,null,41]
[{"$f":"Data_Sheet!A58","v":"JEC16EC086"},{"$f":"Data_Sheet!B58","v":"SHAHLA.P.MOHAMMED"},null,12,null,8,null,null,17,37]
[{"$f":"Data_Sheet!A59","v":"JEC16EC087"},{"$f":"Data_Sheet!B59","v":"SHAMSEENA T A"},null,null,7,null,8,5,null,20]
[{"$f":"Data_Sheet!A60","v":"JEC16EC088"},{"$f":"Data_Sheet!B60","v":"SHARAN SHASHINDRAN A"},null,6,null,null,8,null,12,26]
[{"$f":"Data_Sheet!A61","v":"JEC16EC089"},{"$f":"Data_Sheet!B61","v":"SIBIN KRISHNA C"},null,null,8,9,null,10,null,27]
[{"$f":"Data_Sheet!A62","v":"JEC16EC090"},{"$f":"Data_Sheet!B62","v":"SREEJITH VIJAYAKUMAR"},null,null,null,null,null,null,null,0]
[{"$f":"Data_Sheet!A63","v":"JEC16EC091"},{"$f":"Data_Sheet!B63","v":"SREELAKSHMI.R"},null,null,13,null,14,17,null,44]
[{"$f":"Data_Sheet!A64","v":"JEC16EC092"},{"$f":"Data_Sheet!B64","v":"SREERAG K M"},null,8,null,10,null,null,17,35]
[{"$f":"Data_Sheet!A65","v":"JEC16EC093"},{"$f":"Data_Sheet!B65","v":"SREERAG T K"},null,null,null,null,null,null,null,0]
[{"$f":"Data_Sheet!A66","v":"JEC16EC094"},{"$f":"Data_Sheet!B66","v":"SREERAG V.V"},null,null,10,null,9,16,null,35]
[{"$f":"Data_Sheet!A67","v":"JEC16EC095"},{"$f":"Data_Sheet!B67","v":"SRUTHIMOL.N.T"},null,null,null,null,null,null,null,0]
[{"$f":"Data_Sheet!A68","v":"JEC16EC096"},{"$f":"Data_Sheet!B68","v":"SRUTHISHA SASI"},null,15,null,15,null,null,19,49]
[{"$f":"Data_Sheet!A69","v":"JEC16EC097"},{"$f":"Data_Sheet!B69","v":"SUCHITHRA.TS"},null,null,8,9,null,14,null,31]
[{"$f":"Data_Sheet!A70","v":"JEC16EC098"},{"$f":"Data_Sheet!B70","v":"SWETHA SARA GEORGE"},null,9,null,11,null,null,17,37]
[{"$f":"Data_Sheet!A71","v":"JEC16EC099"},{"$f":"Data_Sheet!B71","v":"VISHNU K"},null,null,12,null,14,17,null,43]
[{"$f":"Data_Sheet!A72","v":"JEC16EC100"},{"$f":"Data_Sheet!B72","v":"VISHNU PRAKASH"},null,6,null,9,null,null,13,28]
[{"$f":"Data_Sheet!A73","v":"JEC16EC101"},{"$f":"Data_Sheet!B73","v":"VISHNU V"},null,null,11,12,null,8,null,31]
[{"$f":"Data_Sheet!A74","v":"LJEC16EC102"},{"$f":"Data_Sheet!B74","v":"CHRISTEENA PAULSON"},null,13,null,null,13,14,null,40]
[]
["Total Marks scored for the Question",null,null,{"$f":"IF(D$22<>\"\",IF(SUM(D25:INDIRECT(D96))>=0,SUM(D25:INDIRECT(D96)),\"\"),\"\")","v":284},{"$f":"IF(E$22<>\"\",IF(SUM(E25:INDIRECT(E96))>=0,SUM(E25:INDIRECT(E96)),\"\"),\"\")","v":238},{"$f":"IF(F$22<>\"\",IF(SUM(F25:INDIRECT(F96))>=0,SUM(F25:INDIRECT(F96)),\"\"),\"\")","v":288},{"$f":"IF(G$22<>\"\",IF(SUM(G25:INDIRECT(G96))>=0,SUM(G25:INDIRECT(G96)),\"\"),\"\")","v":266},{"$f":"IF(H$22<>\"\",IF(SUM(H25:INDIRECT(H96))>=0,SUM(H25:INDIRECT(H96)),\"\"),\"\")","v":341},{"$f":"IF(I$22<>\"\",IF(SUM(I25:INDIRECT(I96))>=0,SUM(I25:INDIRECT(I96)),\"\"),\"\")","v":349}]
["No. of Students who attended the Question",null,null,{"$f":"IF(D$22<>\"\",IF(COUNT(D25:INDIRECT(D96))>=0,COUNT(D25:INDIRECT(D96)),\"\"),\"\")","v":25},{"$f":"IF(E$22<>\"\",IF(COUNT(E25:INDIRECT(E96))>=0,COUNT(E25:INDIRECT(E96)),\"\"),\"\")","v":21},{"$f":"IF(F$22<>\"\",IF(COUNT(F25:INDIRECT(F96))>=0,COUNT(F25:INDIRECT(F96)),\"\"),\"\")","v":25},{"$f":"IF(G$22<>\"\",IF(COUNT(G25:INDIRECT(G96))>=0,COUNT(G25:INDIRECT(G96)),\"\"),\"\")","v":23},{"$f":"IF(H$22<>\"\",IF(COUNT(H25:INDIRECT(H96))>=0,COUNT(H25:INDIRECT(H96)),\"\"),\"\")","v":24},{"$f":"IF(I$22<>\"\",IF(COUNT(I25:INDIRECT(I96))>=0,COUNT(I25:INDIRECT(I96)),\"\"),\"\")","v":23}]
["Difficulty Level marks of the Question",null,null,{"$f":"IF(D21*D22/100=0,\"\",D21*D22/100)","v":9},3,9,9,{"$f":"IF(H21*H22/100=0,\"\",H21*H22/100)","v":12},12]
["No. of Students who scored above the Difficulty Level",null,null,{"$f":"IF(COUNTIF(D25:INDIRECT(D96),\">=\"&D78)=0,\"\",COUNTIF(D25:INDIRECT(D96),\">=\"&D78))","v":20},{"$f":"IF(COUNTIF(E25:INDIRECT(E96),\">=\"&E78)=0,\"\",COUNTIF(E25:INDIRECT(E96),\">=\"&E78))","v":21},{"$f":"IF(COUNTIF(F25:INDIRECT(F96),\">=\"&F78)=0,\"\",COUNTIF(F25:INDIRECT(F96),\">=\"&F78))","v":23},{"$f":"IF(COUNTIF(G25:INDIRECT(G96),\">=\"&G78)=0,\"\",COUNTIF(G25:INDIRECT(G96),\">=\"&G78))","v":19},{"$f":"IF(COUNTIF(H25:INDIRECT(H96),\">=\"&H78)=0,\"\",COUNTIF(H25:INDIRECT(H96),\">=\"&H78))","v":18},{"$f":"IF(COUNTIF(I25:INDIRECT(I96),\">=\"&I78)=0,\"\",COUNTIF(I25:INDIRECT(I96),\">=\"&I78))","v":21}]
["% of Students who scored above the Difficulty Level",null,null,{"$f":"IFERROR(ROUND(D79/D77*100,2),\"\")","v":80},100,92,82.61,75,91.3]
[null,null,null,{"$f":"IF(D80=\"\",0,IF(D80>=80,3,IF(D80>=70,2,IF(D80>=60,1,0))))","v":3},3,3,3,2,3,"Marks",null,null,null,"T_Marks","S_Marks","Students","Level","Above","Above %","Attainment"]
[null,{"$f":"IF(Data_Sheet!A77<>\"\",\"Total Attainment level for \"&Data_Sheet!A77&\" :\",\"\")","v":"Total Attainment level for CO1 :"},{"$f":"IF(Data_Sheet!A77<>\"\",M82,\"\")","v":3},{"$f":"IFERROR((IF(ISNUMBER(SEARCH(\"1\", D$19)),D$21,\"0\")),\"0\")*D81","v":45},15,45,45,0,60,{"$f":"J99","v":70},null,null,{"$f":"IF(J82=0,\"\",ROUND(SUM(D82:I82)/J82,2))","v":3},{"$f":"J99","v":70},{"$f":"J106","v":1425},{"$f":"J113","v":117},{"$f":"J120","v":42},{"$f":"J127","v":104},{"$f":"IFERROR(ROUND(R82/P82*100,2),\"\")","v":88.89},{"$f":"IF(S82=\"\",\"\",IF(S82>=80,3,IF(S82>=70,2,IF(S82>=60,1,0))))","v":3}]
[null,{"$f":"IF(Data_Sheet!A78<>\"\",\"Total Attainment level for \"&Data_Sheet!A78&\" :\",\"\")","v":"Total Attainment level for CO2 :"},{"$f":"IF(Data_Sheet!A78<>\"\",M83,\"\")","v":3},{"$f":"IFERROR((IF(ISNUMBER(SEARCH(\"2\", D$19)),D$21,\"0\")),\"0\")*D81","v":45},15,0,0,0,0,20,null,null,3,20,522,46,12,41,89.13,3]
[null,{"$f":"IF(Data_Sheet!A79<>\"\",\"Total Attainment level for \"&Data_Sheet!A79&\" :\",\"\")","v":"Total Attainment level for CO3 :"},{"$f":"IF(Data_Sheet!A79<>\"\",M84,\"\")","v":2.6},{"$f":"IFERROR((IF(ISNUMBER(SEARCH(\"3\", D$19)),D$21,\"0\")),\"0\")*D81","v":0},0,45,45,40,0,50,null,null,2.6,50,895,72,30,60,83.33,3]
[null,{"$f":"IF(Data_Sheet!A80<>\"\",\"Total Attainment level for \"&Data_Sheet!A80&\" :\",\"\")","v":"Total Attainment level for CO4 :"},{"$f":"IF(Data_Sheet!A80<>\"\",M85,\"\")","v":2.71},{"$f":"IFERROR((IF(ISNUMBER(SEARCH(\"4\", D$19)),D$21,\"0\")),\"0\")*D81","v":45},0,45,0,40,60,70,null,null,2.71,70,1262,97,42,82,84.54,3]
[null,{"$f":"IF(Data_Sheet!A81<>\"\",\"Total Attainment level for \"&Data_Sheet!A81&\" :\",\"\")","v":"Total Attainment level for CO5 :"},{"$f":"IF(Data_Sheet!A81<>\"\",M86,\"\")","v":3},{"$f":"IFERROR((IF(ISNUMBER(SEARCH(\"5\", D$19)),D$21,\"0\")),\"0\")*D81","v":0},0,45,45,0,60,50,null,null,3,50,903,71,30,63,88.73,3]
[null,{"$f":"IF(Data_Sheet!A82<>\"\",\"Total Attainment level for \"&Data_Sheet!A82&\" :\",\"\")","v":"Total Attainment level for CO6 :"},{"$f":"IF(Data_Sheet!A82<>\"\",M87,\"\")","v":""},{"$f":"IFERROR((IF(ISNUMBER(SEARCH(\"6\", D$19)),D$21,\"0\")),\"0\")*D81","v":0},0,0,0,0,0,0,null,null,"",0,0,0,0,0,"",""]
[]
[{"$f":"Data_Sheet!A85","v":"Attainment Level 1: 60% students scoring more than 60% of the Total Marks"}]
[{"$f":"Data_Sheet!A86","v":"Attainment Level 2: 70% students scoring more than 60% of the Total Marks"}]
[{"$f":"Data_Sheet!A87","v":"Attainment Level 3: 80% students scoring more than 60% of the Total Marks"}]
[]
[null,{"$f":"Data_Sheet!B10","v":"Name of Faculty : "},{"$f":"Data_Sheet!B11","v":"PONMANI RAJA M"}]
[null,{"$f":"Data_Sheet!B94","v":"Dated Signature :  "}]
[]
[null,"Last Row Count",{"$f":"ROW(A76)-2","v":74},{"$f":"SUBSTITUTE(ADDRESS(1,COLUMN(D1),2),\"1\",\"\")&$C$96","v":"D$74"},{"$f":"\"E\"&$C$96","v":"E74"},{"$f":"SUBSTITUTE(ADDRESS(1,COLUMN(F1),2),\"1\",\"\")&$C$96","v":"F$74"},{"$f":"SUBSTITUTE(ADDRESS(1,COLUMN(G1),2),\"1\",\"\")&$C$96","v":"G$74"},{"$f":"SUBSTITUTE(ADDRESS(1,COLUMN(H1),2),\"1\",\"\")&$C$96","v":"H$74"},{"$f":"SUBSTITUTE(ADDRESS(1,COLUMN(I1),2),\"1\",\"\")&$C$96","v":"I$74"}]
[]
[]
[null,null,"CO1",{"$f":"IFERROR((IF(ISNUMBER(SEARCH(\"1\", D$19)),D$21,\"0\")),\"0\")","v":15},{"$f":"IFERROR((IF(ISNUMBER(SEARCH(\"1\", E$19)),E$21,\"0\")),\"0\")","v":5},{"$f":"IFERROR((IF(ISNUMBER(SEARCH(\"1\", F$19)),F$21,\"0\")),\"0\")","v":15},15,{"$f":"IFERROR((IF(ISNUMBER(SEARCH(\"1\", H$19)),H$21,\"0\")),\"0\")","v":"0"},20,{"$f":"IFERROR(SUM($D99:INDIRECT($M99)),\"0\")","v":70},null,null,{"$f":"SUBSTITUTE(ADDRESS(1,O99,4),1,\"\")&ROW($J99)","v":"I99"},{"$f":"COUNTIF($D$19:INDIRECT($P99),\"*1*\")","v":5},{"$f":"COLUMN($J$18)-1","v":9},{"$f":"SUBSTITUTE(ADDRESS(1,O99,4),1,\"\")&ROW($J$18)+1","v":"I19"},"Total Marks"]
[null,null,"CO2",{"$f":"IFERROR((IF(ISNUMBER(SEARCH(\"2\", D$19)),D$21,\"0\")),\"0\")","v":15},{"$f":"IFERROR((IF(ISNUMBER(SEARCH(\"2\", E$19)),E$21,\"0\")),\"0\")","v":5},{"$f":"IFERROR((IF(ISNUMBER(SEARCH(\"2\", F$19)),F$21,\"0\")),\"0\")","v":"0"},"0",{"$f":"IFERROR((IF(ISNUMBER(SEARCH(\"2\", H$19)),H$21,\"0\")),\"0\")","v":"0"},"0",{"$f":"IFERROR(SUM($D100:INDIRECT($M100)),\"0\")","v":20},null,null,"I100",{"$f":"COUNTIF($D$19:INDIRECT($P100),\"*2*\")","v":2},{"$f":"COLUMN($J$18)-1","v":9},{"$f":"SUBSTITUTE(ADDRESS(1,O100,4),1,\"\")&ROW($J$18)+1","v":"I19"}]
[null,null,"CO3",{"$f":"IFERROR((IF(ISNUMBER(SEARCH(\"3\", D$19)),D$21,\"0\")),\"0\")","v":"0"},{"$f":"IFERROR((IF(ISNUMBER(SEARCH(\"3\", E$19)),E$21,\"0\")),\"0\")","v":"0"},{"$f":"IFERROR((IF(ISNUMBER(SEARCH(\"3\", F$19)),F$21,\"0\")),\"0\")","v":15},15,{"$f":"IFERROR((IF(ISNUMBER(SEARCH(\"3\", H$19)),H$21,\"0\")),\"0\")","v":20},"0",{"$f":"IFERROR(SUM($D101:INDIRECT($M101)),\"0\")","v":50},null,null,"I101",{"$f":"COUNTIF($D$19:INDIRECT($P101),\"*3*\")","v":3},9,"I19"]
[null,null,"CO4",{"$f":"IFERROR((IF(ISNUMBER(SEARCH(\"4\", D$19)),D$21,\"0\")),\"0\")","v":15},{"$f":"IFERROR((IF(ISNUMBER(SEARCH(\"4\", E$19)),E$21,\"0\")),\"0\")","v":"0"},{"$f":"IFERROR((IF(ISNUMBER(SEARCH(\"4\", F$19)),F$21,\"0\")),\"0\")","v":15},"0",{"$f":"IFERROR((IF(ISNUMBER(SEARCH(\"4\", H$19)),H$21,\"0\")),\"0\")","v":20},20,{"$f":"IFERROR(SUM($D102:INDIRECT($M102)),\"0\")","v":70},null,null,"I102",{"$f":"COUNTIF($D$19:INDIRECT($P102),\"*4*\")","v":4},9,"I19"]
[null,null,"CO5",{"$f":"IFERROR((IF(ISNUMBER(SEARCH(\"5\", D$19)),D$21,\"0\")),\"0\")","v":"0"},{"$f":"IFERROR((IF(ISNUMBER(SEARCH(\"5\", E$19)),E$21,\"0\")),\"0\")","v":"0"},{"$f":"IFERROR((IF(ISNUMBER(SEARCH(\"5\", F$19)),F$21,\"0\")),\"0\")","v":15},15,{"$f":"IFERROR((IF(ISNUMBER(SEARCH(\"5\", H$19)),H$21,\"0\")),\"0\")","v":"0"},20,{"$f":"IFERROR(SUM($D103:INDIRECT($M103)),\"0\")","v":50},null,null,"I103",{"$f":"COUNTIF($D$19:INDIRECT($P103),\"*5*\")","v":3},9,"I19"]
[null,null,"CO6",{"$f":"IFERROR((IF(ISNUMBER(SEARCH(\"6\", D$19)),D$21,\"0\")),\"0\")","v":"0"},{"$f":"IFERROR((IF(ISNUMBER(SEARCH(\"6\", E$19)),E$21,\"0\")),\"0\")","v":"0"},{"$f":"IFERROR((IF(ISNUMBER(SEARCH(\"6\", F$19)),F$21,\"0\")),\"0\")","v":"0"},"0",{"$f":"IFERROR((IF(ISNUMBER(SEARCH(\"6\", H$19)),H$21,\"0\")),\"0\")","v":"0"},"0",{"$f":"IFERROR(SUM($D104:INDIRECT($M104)),\"0\")","v":0},null,null,"I104",{"$f":"COUNTIF($D$19:INDIRECT($P104),\"*6*\")","v":0},9,"I19"]
[]
[null,null,"CO1",{"$f":"IFERROR((IF(ISNUMBER(SEARCH(\"1\", D$19)),D$76,\"0\")),\"0\")","v":284},{"$f":"IFERROR((IF(ISNUMBER(SEARCH(\"1\", E$19)),E$76,\"0\")),\"0\")","v":238},288,266,{"$f":"IFERROR((IF(ISNUMBER(SEARCH(\"1\", H$19)),H$76,\"0\")),\"0\")","v":"0"},349,{"$f":"IFERROR(SUM($D106:INDIRECT($M106)),\"0\")","v":1425},null,null,{"$f":"SUBSTITUTE(ADDRESS(1,O106,4),1,\"\")&ROW($J106)","v":"I106"},{"$f":"COUNTIF($D$19:INDIRECT($P106),\"*1*\")","v":5},{"$f":"COLUMN($J$18)-1","v":9},{"$f":"SUBSTITUTE(ADDRESS(1,O106,4),1,\"\")&ROW($J$18)+1","v":"I19"},"Total Marks Scored"]
[null,null,"CO2",{"$f":"IFERROR((IF(ISNUMBER(SEARCH(\"2\", D$19)),D$76,\"0\")),\"0\")","v":284},{"$f":"IFERROR((IF(ISNUMBER(SEARCH(\"2\", E$19)),E$76,\"0\")),\"0\")","v":238},"0","0",{"$f":"IFERROR((IF(ISNUMBER(SEARCH(\"2\", H$19)),H$76,\"0\")),\"0\")","v":"0"},"0",{"$f":"IFERROR(SUM($D107:INDIRECT($M107)),\"0\")","v":522},null,null,"I107",{"$f":"COUNTIF($D$19:INDIRECT($P107),\"*2*\")","v":2},{"$f":"COLUMN($J$18)-1","v":9},{"$f":"SUBSTITUTE(ADDRESS(1,O107,4),1,\"\")&ROW($J$18)+1","v":"I19"}]
[null,null,"CO3",{"$f":"IFERROR((IF(ISNUMBER(SEARCH(\"3\", D$19)),D$76,\"0\")),\"0\")","v":"0"},{"$f":"IFERROR((IF(ISNUMBER(SEARCH(\"3\", E$19)),E$76,\"0\")),\"0\")","v":"0"},{"$f":"IFERROR((IF(ISNUMBER(SEARCH(\"3\", F$19)),F$76,\"0\")),\"0\")","v":288},266,{"$f":"IFERROR((IF(ISNUMBER(SEARCH(\"3\", H$19)),H$76,\"0\")),\"0\")","v":341},"0",{"$f":"IFERROR(SUM($D108:INDIRECT($M108)),\"0\")","v":895},null,null,"I108",{"$f":"COUNTIF($D$19:INDIRECT($P108),\"*3*\")","v":3},9,"I19"]
[null,null,"CO4",{"$f":"IFERROR((IF(ISNUMBER(SEARCH(\"4\", D$19)),D$76,\"0\")),\"0\")","v":284},{"$f":"IFERROR((IF(ISNUMBER(SEARCH(\"4\", E$19)),E$76,\"0\")),\"0\")","v":"0"},{"$f":"IFERROR((IF(ISNUMBER(SEARCH(\"4\", F$19)),F$76,\"0\")),\"0\")","v":288},{"$f":"IFERROR((IF(ISNUMBER(SEARCH(\"4\", G$19)),G$76,\"0\")),\"0\")","v":"0"},{"$f":"IFERROR((IF(ISNUMBER(SEARCH(\"4\", H$19)),H$76,\"0\")),\"0\")","v":341},349,{"$f":"IFERROR(SUM($D109:INDIRECT($M109)),\"0\")","v":1262},null,null,"I109",{"$f":"COUNTIF($D$19:INDIRECT($P109),\"*4*\")","v":4},9,"I19"]
[null,null,"CO5",{"$f":"IFERROR((IF(ISNUMBER(SEARCH(\"5\", D$19)),D$76,\"0\")),\"0\")","v":"0"},{"$f":"IFERROR((IF(ISNUMBER(SEARCH(\"5\", E$19)),E$76,\"0\")),\"0\")","v":"0"},288,266,{"$f":"IFERROR((IF(ISNUMBER(SEARCH(\"5\", H$19)),H$76,\"0\")),\"0\")","v":"0"},{"$f":"IFERROR((IF(ISNUMBER(SEARCH(\"5\", I$19)),I$76,\"0\")),\"0\")","v":349},{"$f":"IFERROR(SUM($D110:INDIRECT($M110)),\"0\")","v":903},null,null,"I110",{"$f":"COUNTIF($D$19:INDIRECT($P110),\"*5*\")","v":3},9,"I19"]
[null,null,"CO6",{"$f":"IFERROR((IF(ISNUMBER(SEARCH(\"6\", D$19)),D$76,\"0\")),\"0\")","v":"0"},{"$f":"IFERROR((IF(ISNUMBER(SEARCH(\"6\", E$19)),E$76,\"0\")),\"0\")","v":"0"},"0","0",{"$f":"IFERROR((IF(ISNUMBER(SEARCH(\"6\", H$19)),H$76,\"0\")),\"0\")","v":"0"},"0",{"$f":"IFERROR(SUM($D111:INDIRECT($M111)),\"0\")","v":0},null,null,"I111",{"$f":"COUNTIF($D$19:INDIRECT($P111),\"*6*\")","v":0},9,"I19"]
[]
[null,null,"CO1",{"$f":"IFERROR((IF(ISNUMBER(SEARCH(\"1\", D$19)),D$77,\"0\")),\"0\")","v":25},{"$f":"IFERROR((IF(ISNUMBER(SEARCH(\"1\", E$19)),E$77,\"0\")),\"0\")","v":21},25,23,{"$f":"IFERROR((IF(ISNUMBER(SEARCH(\"1\", H$19)),H$77,\"0\")),\"0\")","v":"0"},23,{"$f":"IFERROR(SUM($D113:INDIRECT($M113)),\"0\")","v":117},null,null,{"$f":"SUBSTITUTE(ADDRESS(1,O113,4),1,\"\")&ROW($J113)","v":"I113"},{"$f":"COUNTIF($D$19:INDIRECT($P113),\"*1*\")","v":5},{"$f":"COLUMN($J$18)-1","v":9},{"$f":"SUBSTITUTE(ADDRESS(1,O113,4),1,\"\")&ROW($J$18)+1","v":"I19"},"No of Studdents Attended"]
[null,null,"CO2",{"$f":"IFERROR((IF(ISNUMBER(SEARCH(\"2\", D$19)),D$77,\"0\")),\"0\")","v":25},{"$f":"IFERROR((IF(ISNUMBER(SEARCH(\"2\", E$19)),E$77,\"0\")),\"0\")","v":21},"0","0",{"$f":"IFERROR((IF(ISNUMBER(SEARCH(\"2\", H$19)),H$77,\"0\")),\"0\")","v":"0"},"0",{"$f":"IFERROR(SUM($D114:INDIRECT($M114)),\"0\")","v":46},null,null,"I114",{"$f":"COUNTIF($D$19:INDIRECT($P114),\"*2*\")","v":2},{"$f":"COLUMN($J$18)-1","v":9},{"$f":"SUBSTITUTE(ADDRESS(1,O114,4),1,\"\")&ROW($J$18)+1","v":"I19"}]
[null,null,"CO3",{"$f":"IFERROR((IF(ISNUMBER(SEARCH(\"3\", D$19)),D$77,\"0\")),\"0\")","v":"0"},{"$f":"IFERROR((IF(ISNUMBER(SEARCH(\"3\", E$19)),E$77,\"0\")),\"0\")","v":"0"},{"$f":"IFERROR((IF(ISNUMBER(SEARCH(\"3\", F$19)),F$77,\"0\")),\"0\")","v":25},23,{"$f":"IFERROR((IF(ISNUMBER(SEARCH(\"3\", H$19)),H$77,\"0\")),\"0\")","v":24},"0",{"$f":"IFERROR(SUM($D115:INDIRECT($M115)),\"0\")","v":72},null,null,"I115",{"$f":"COUNTIF($D$19:INDIRECT($P115),\"*3*\")","v":3},9,"I19"]
[null,null,"CO4",{"$f":"IFERROR((IF(ISNUMBER(SEARCH(\"4\", D$19)),D$77,\"0\")),\"0\")","v":25},{"$f":"IFERROR((IF(ISNUMBER(SEARCH(\"4\", E$19)),E$77,\"0\")),\"0\")","v":"0"},{"$f":"IFERROR((IF(ISNUMBER(SEARCH(\"4\", F$19)),F$77,\"0\")),\"0\")","v":25},{"$f":"IFERROR((IF(ISNUMBER(SEARCH(\"4\", G$19)),G$77,\"0\")),\"0\")","v":"0"},{"$f":"IFERROR((IF(ISNUMBER(SEARCH(\"4\", H$19)),H$77,\"0\")),\"0\")","v":24},23,{"$f":"IFERROR(SUM($D116:INDIRECT($M116)),\"0\")","v":97},null,null,"I116",{"$f":"COUNTIF($D$19:INDIRECT($P116),\"*4*\")","v":4},9,"I19"]
[null,null,"CO5",{"$f":"IFERROR((IF(ISNUMBER(SEARCH(\"5\", D$19)),D$77,\"0\")),\"0\")","v":"0"},{"$f":"IFERROR((IF(ISNUMBER(SEARCH(\"5\", E$19)),E$77,\"0\")),\"0\")","v":"0"},25,23,{"$f":"IFERROR((IF(ISNUMBER(SEARCH(\"5\", H$19)),H$77,\"0\")),\"0\")","v":"0"},{"$f":"IFERROR((IF(ISNUMBER(SEARCH(\"5\", I$19)),I$77,\"0\")),\"0\")","v":23},{"$f":"IFERROR(SUM($D117:INDIRECT($M117)),\"0\")","v":71},null,null,"I117",{"$f":"COUNTIF($D$19:INDIRECT($P117),\"*5*\")","v":3},9,"I19"]
[null,null,"CO6",{"$f":"IFERROR((IF(ISNUMBER(SEARCH(\"6\", D$19)),D$77,\"0\")),\"0\")","v":"0"},{"$f":"IFERROR((IF(ISNUMBER(SEARCH(\"6\", E$19)),E$77,\"0\")),\"0\")","v":"0"},"0","0",{"$f":"IFERROR((IF(ISNUMBER(SEARCH(\"6\", H$19)),H$77,\"0\")),\"0\")","v":"0"},"0",{"$f":"IFERROR(SUM($D118:INDIRECT($M118)),\"0\")","v":0},null,null,"I118",{"$f":"COUNTIF($D$19:INDIRECT($P118),\"*6*\")","v":0},9,"I19"]
[]
[null,null,"CO1",{"$f":"IFERROR((IF(ISNUMBER(SEARCH(\"1\", D$19)),D$78,\"0\")),\"0\")","v":9},{"$f":"IFERROR((IF(ISNUMBER(SEARCH(\"1\", E$19)),E$78,\"0\")),\"0\")","v":3},9,9,{"$f":"IFERROR((IF(ISNUMBER(SEARCH(\"1\", H$19)),H$78,\"0\")),\"0\")","v":"0"},12,{"$f":"IFERROR(SUM($D120:INDIRECT($M120)),\"0\")","v":42},null,null,{"$f":"SUBSTITUTE(ADDRESS(1,O120,4),1,\"\")&ROW($J120)","v":"I120"},{"$f":"COUNTIF($D$19:INDIRECT($P120),\"*1*\")","v":5},{"$f":"COLUMN($J$18)-1","v":9},{"$f":"SUBSTITUTE(ADDRESS(1,O120,4),1,\"\")&ROW($J$18)+1","v":"I19"},"Difficulty Level"]
[null,null,"CO2",{"$f":"IFERROR((IF(ISNUMBER(SEARCH(\"2\", D$19)),D$78,\"0\")),\"0\")","v":9},{"$f":"IFERROR((IF(ISNUMBER(SEARCH(\"2\", E$19)),E$78,\"0\")),\"0\")","v":3},"0","0",{"$f":"IFERROR((IF(ISNUMBER(SEARCH(\"2\", H$19)),H$78,\"0\")),\"0\")","v":"0"},"0",{"$f":"IFERROR(SUM($D121:INDIRECT($M121)),\"0\")","v":12},null,null,"I121",{"$f":"COUNTIF($D$19:INDIRECT($P121),\"*2*\")","v":2},{"$f":"COLUMN($J$18)-1","v":9},{"$f":"SUBSTITUTE(ADDRESS(1,O121,4),1,\"\")&ROW($J$18)+1","v":"I19"}]
[null,null,"CO3",{"$f":"IFERROR((IF(ISNUMBER(SEARCH(\"3\", D$19)),D$78,\"0\")),\"0\")","v":"0"},{"$f":"IFERROR((IF(ISNUMBER(SEARCH(\"3\", E$19)),E$78,\"0\")),\"0\")","v":"0"},9,9,{"$f":"IFERROR((IF(ISNUMBER(SEARCH(\"3\", H$19)),H$78,\"0\")),\"0\")","v":12},"0",{"$f":"IFERROR(SUM($D122:INDIRECT($M122)),\"0\")","v":30},null,null,"I122",{"$f":"COUNTIF($D$19:INDIRECT($P122),\"*3*\")","v":3},9,"I19"]
[null,null,"CO4",{"$f":"IFERROR((IF(ISNUMBER(SEARCH(\"4\", D$19)),D$78,\"0\")),\"0\")","v":9},{"$f":"IFERROR((IF(ISNUMBER(SEARCH(\"4\", E$19)),E$78,\"0\")),\"0\")","v":"0"},9,"0",{"$f":"IFERROR((IF(ISNUMBER(SEARCH(\"4\", H$19)),H$78,\"0\")),\"0\")","v":12},12,{"$f":"IFERROR(SUM($D123:INDIRECT($M123)),\"0\")","v":42},null,null,"I123",{"$f":"COUNTIF($D$19:INDIRECT($P123),\"*4*\")","v":4},9,"I19"]
[null,null,"CO5",{"$f":"IFERROR((IF(ISNUMBER(SEARCH(\"5\", D$19)),D$78,\"0\")),\"0\")","v":"0"},{"$f":"IFERROR((IF(ISNUMBER(SEARCH(\"5\", E$19)),E$78,\"0\")),\"0\")","v":"0"},9,9,{"$f":"IFERROR((IF(ISNUMBER(SEARCH(\"5\", H$19)),H$78,\"0\")),\"0\")","v":"0"},12,{"$f":"IFERROR(SUM($D124:INDIRECT($M124)),\"0\")","v":30},null,null,"I124",{"$f":"COUNTIF($D$19:INDIRECT($P124),\"*5*\")","v":3},9,"I19"]
[null,null,"CO6",{"$f":"IFERROR((IF(ISNUMBER(SEARCH(\"6\", D$19)),D$78,\"0\")),\"0\")","v":"0"},{"$f":"IFERROR((IF(ISNUMBER(SEARCH(\"6\", E$19)),E$78,\"0\")),\"0\")","v":"0"},"0","0",{"$f":"IFERROR((IF(ISNUMBER(SEARCH(\"6\", H$19)),H$78,\"0\")),\"0\")","v":"0"},"0",{"$f":"IFERROR(SUM($D125:INDIRECT($M125)),\"0\")","v":0},null,null,"I125",{"$f":"COUNTIF($D$19:INDIRECT($P125),\"*6*\")","v":0},9,"I19"]
[]
[null,null,"CO1",{"$f":"IFERROR((IF(ISNUMBER(SEARCH(\"1\", D$19)),D$79,\"0\")),\"0\")","v":20},{"$f":"IFERROR((IF(ISNUMBER(SEARCH(\"1\", E$19)),E$79,\"0\")),\"0\")","v":21},23,19,{"$f":"IFERROR((IF(ISNUMBER(SEARCH(\"1\", H$19)),H$79,\"0\")),\"0\")","v":"0"},21,{"$f":"IFERROR(SUM($D127:INDIRECT($M127)),\"0\")","v":104},null,null,{"$f":"SUBSTITUTE(ADDRESS(1,O127,4),1,\"\")&ROW($J127)","v":"I127"},{"$f":"COUNTIF($D$19:INDIRECT($P127),\"*1*\")","v":5},{"$f":"COLUMN($J$18)-1","v":9},{"$f":"SUBSTITUTE(ADDRESS(1,O127,4),1,\"\")&ROW($J$18)+1","v":"I19"},"No of Studdents Above Difficulty Level"]
[null,null,"CO2",{"$f":"IFERROR((IF(ISNUMBER(SEARCH(\"2\", D$19)),D$79,\"0\")),\"0\")","v":20},{"$f":"IFERROR((IF(ISNUMBER(SEARCH(\"2\", E$19)),E$79,\"0\")),\"0\")","v":21},"0","0",{"$f":"IFERROR((IF(ISNUMBER(SEARCH(\"2\", H$19)),H$79,\"0\")),\"0\")","v":"0"},"0",{"$f":"IFERROR(SUM($D128:INDIRECT($M128)),\"0\")","v":41},null,null,"I128",{"$f":"COUNTIF($D$19:INDIRECT($P128),\"*2*\")","v":2},{"$f":"COLUMN($J$18)-1","v":9},{"$f":"SUBSTITUTE(ADDRESS(1,O128,4),1,\"\")&ROW($J$18)+1","v":"I19"}]
[null,null,"CO3",{"$f":"IFERROR((IF(ISNUMBER(SEARCH(\"3\", D$19)),D$79,\"0\")),\"0\")","v":"0"},{"$f":"IFERROR((IF(ISNUMBER(SEARCH(\"3\", E$19)),E$79,\"0\")),\"0\")","v":"0"},{"$f":"IFERROR((IF(ISNUMBER(SEARCH(\"3\", F$19)),F$79,\"0\")),\"0\")","v":23},19,{"$f":"IFERROR((IF(ISNUMBER(SEARCH(\"3\", H$19)),H$79,\"0\")),\"0\")","v":18},"0",{"$f":"IFERROR(SUM($D129:INDIRECT($M129)),\"0\")","v":60},null,null,"I129",{"$f":"COUNTIF($D$19:INDIRECT($P129),\"*3*\")","v":3},9,"I19"]
[null,null,"CO4",{"$f":"IFERROR((IF(ISNUMBER(SEARCH(\"4\", D$19)),D$79,\"0\")),\"0\")","v":20},{"$f":"IFERROR((IF(ISNUMBER(SEARCH(\"4\", E$19)),E$79,\"0\")),\"0\")","v":"0"},{"$f":"IFERROR((IF(ISNUMBER(SEARCH(\"4\", F$19)),F$79,\"0\")),\"0\")","v":23},{"$f":"IFERROR((IF(ISNUMBER(SEARCH(\"4\", G$19)),G$79,\"0\")),\"0\")","v":"0"},{"$f":"IFERROR((IF(ISNUMBER(SEARCH(\"4\", H$19)),H$79,\"0\")),\"0\")","v":18},21,{"$f":"IFERROR(SUM($D130:INDIRECT($M130)),\"0\")","v":82},null,null,"I130",{"$f":"COUNTIF($D$19:INDIRECT($P130),\"*4*\")","v":4},9,"I19"]
[null,null,"CO5",{"$f":"IFERROR((IF(ISNUMBER(SEARCH(\"5\", D$19)),D$79,\"0\")),\"0\")","v":"0"},{"$f":"IFERROR((IF(ISNUMBER(SEARCH(\"5\", E$19)),E$79,\"0\")),\"0\")","v":"0"},23,19,{"$f":"IFERROR((IF(ISNUMBER(SEARCH(\"5\", H$19)),H$79,\"0\")),\"0\")","v":"0"},{"$f":"IFERROR((IF(ISNUMBER(SEARCH(\"5\", I$19)),I$79,\"0\")),\"0\")","v":21},{"$f":"IFERROR(SUM($D131:INDIRECT($M131)),\"0\")","v":63},null,null,"I131",{"$f":"COUNTIF($D$19:INDIRECT($P131),\"*5*\")","v":3},9,"I19"]
[null,null,"CO6",{"$f":"IFERROR((IF(ISNUMBER(SEARCH(\"6\", D$19)),D$79,\"0\")),\"0\")","v":"0"},{"$f":"IFERROR((IF(ISNUMBER(SEARCH(\"6\", E$19)),E$79,\"0\")),\"0\")","v":"0"},"0","0",{"$f":"IFERROR((IF(ISNUMBER(SEARCH(\"6\", H$19)),H$79,\"0\")),\"0\")","v":"0"},"0",{"$f":"IFERROR(SUM($D132:INDIRECT($M132)),\"0\")","v":0},null,null,"I132",{"$f":"COUNTIF($D$19:INDIRECT($P132),\"*6*\")","v":0},9,"I19"]
[]
[null,null,1,{"$f":"IFERROR((IF(ISNUMBER(SEARCH(\"1\", D$20)),D$21/IF(LEN(D20)=16,6,IF(LEN(D20)=13,5,IF(LEN(D20)=10,4,IF(LEN(D20)=7,3,IF(LEN(D20)=4,2,1))))),\"0\")),\"0\")","v":7.5},2.5,"0",7.5,"0","0",{"$f":"IFERROR(SUM($D134:INDIRECT($M134)),\"0\")","v":17.5},null,null,{"$f":"SUBSTITUTE(ADDRESS(1,O134,4),1,\"\")&ROW($J134)","v":"I134"},{"$f":"COUNTIF($D$20:INDIRECT($P134),\"1\")","v":0},{"$f":"COLUMN($J$18)-1","v":9},{"$f":"SUBSTITUTE(ADDRESS(1,O134,4),1,\"\")&ROW($J$19)+1","v":"I20"}]
[null,null,2,{"$f":"IFERROR((IF(ISNUMBER(SEARCH(\"2\", D$20)),D$21/IF(LEN(D20)=16,6,IF(LEN(D20)=13,5,IF(LEN(D20)=10,4,IF(LEN(D20)=7,3,IF(LEN(D20)=4,2,1))))),\"0\")),\"0\")","v":7.5},"0",7.5,7.5,20,10,{"$f":"IFERROR(SUM($D135:INDIRECT($M135)),\"0\")","v":52.5},null,null,{"$f":"SUBSTITUTE(ADDRESS(1,O135,4),1,\"\")&ROW($J135)","v":"I135"},{"$f":"COUNTIF($D$20:INDIRECT($P135),\"2\")","v":1},9,"I20"]
[null,null,3,{"$f":"IFERROR((IF(ISNUMBER(SEARCH(\"3\", D$20)),D$21/IF(LEN(D20)=16,6,IF(LEN(D20)=13,5,IF(LEN(D20)=10,4,IF(LEN(D20)=7,3,IF(LEN(D20)=4,2,1))))),\"0\")),\"0\")","v":"0"},"0","0","0","0",10,{"$f":"IFERROR(SUM($D136:INDIRECT($M136)),\"0\")","v":10},null,null,"I136",{"$f":"COUNTIF($D$20:INDIRECT($P136),\"3\")","v":0},9,"I20"]
[null,null,4,{"$f":"IFERROR((IF(ISNUMBER(SEARCH(\"4\", D$20)),D$21/IF(LEN(D20)=16,6,IF(LEN(D20)=13,5,IF(LEN(D20)=10,4,IF(LEN(D20)=7,3,IF(LEN(D20)=4,2,1))))),\"0\")),\"0\")","v":"0"},"0","0","0","0","0",{"$f":"IFERROR(SUM($D137:INDIRECT($M137)),\"0\")","v":0},null,null,"I137",{"$f":"COUNTIF($D$20:INDIRECT($P137),\"4\")","v":0},9,"I20"]
[null,null,5,{"$f":"IFERROR((IF(ISNUMBER(SEARCH(\"5\", D$20)),D$21/IF(LEN(D20)=16,6,IF(LEN(D20)=13,5,IF(LEN(D20)=10,4,IF(LEN(D20)=7,3,IF(LEN(D20)=4,2,1))))),\"0\")),\"0\")","v":"0"},"0","0","0","0","0",{"$f":"IFERROR(SUM($D138:INDIRECT($M138)),\"0\")","v":0},null,null,"I138",{"$f":"COUNTIF($D$20:INDIRECT($P138),\"5\")","v":0},9,"I20"]
[null,null,6,{"$f":"IFERROR((IF(ISNUMBER(SEARCH(\"6\", D$20)),D$21/IF(LEN(D20)=16,6,IF(LEN(D20)=13,5,IF(LEN(D20)=10,4,IF(LEN(D20)=7,3,IF(LEN(D20)=4,2,1))))),\"0\")),\"0\")","v":"0"},2.5,7.5,"0","0","0",{"$f":"IFERROR(SUM($D139:INDIRECT($M139)),\"0\")","v":10},null,null,"I139",{"$f":"COUNTIF($D$20:INDIRECT($P139),\"6\")","v":0},9,"I20"]

{"sheet":"T2_Analysis","index":5,"n_rows":89,"n_cols":5,"rows_kept":89,"cut":false,"hidden":false,"merged":[[2,0,2,3],[4,0,4,3],[6,0,6,3],[8,0,8,3]]}
[]
[]
[{"$f":"Data_Sheet!A2","v":"Jyothi Engineering College, Cheruthuruthy"}]
[]
[{"$f":"Data_Sheet!A4","v":"Department of Electrical & Electronics Engineering"}]
[]
[{"$f":"'T2'!A11","v":"CO Analysis - Internal Marks : Second Internal Exam                       14-03-18"}]
[]
[{"$f":"Data_Sheet!A17","v":"S7 EC              EC407 Computer Communication               2019-20"}]
[]
[]
[]
[]
[]
[]
[]
[]
[]
[]
[]
[]
[{"$f":"'T1'!A18","v":"Register No."},{"$f":"'T1'!B18","v":"Name of Student"},{"$f":"'T2'!J18","v":"Total Marks (50)"},"Category"]
[]
["Column1","Column2","Column3","Column4"]
[{"$f":"Data_Sheet!A25","v":"JEC16EC051"},{"$f":"Data_Sheet!B25","v":"LANA KOLLATH"},{"$f":"'T2'!J25","v":40},{"$f":"IF(C25=\"A\",\"ABSENT\",IF(C25>='T2'!$F$5*$E$82/100,\"EXCELLENT\",IF(C25>='T2'!$F$5*$E$81/100,\"GOOD\",IF(C25>='T2'!$F$5*$E$80/100,\"AVERAGE\",\"POOR\"))))","v":"EXCELLENT"}]
[{"$f":"Data_Sheet!A26","v":"JEC16EC052"},{"$f":"Data_Sheet!B26","v":"MANU JENSON"},{"$f":"'T2'!J26","v":29},{"$f":"IF(C26=\"A\",\"ABSENT\",IF(C26>='T2'!$F$5*$E$82/100,\"EXCELLENT\",IF(C26>='T2'!$F$5*$E$81/100,\"GOOD\",IF(C26>='T2'!$F$5*$E$80/100,\"AVERAGE\",\"POOR\"))))","v":"AVERAGE"}]
[{"$f":"Data_Sheet!A27","v":"JEC16EC053"},{"$f":"Data_Sheet!B27","v":"MAREENA MARIYA ABRAHAM"},{"$f":"'T2'!J27","v":48},{"$f":"IF(C27=\"A\",\"ABSENT\",IF(C27>='T2'!$F$5*$E$82/100,\"EXCELLENT\",IF(C27>='T2'!$F$5*$E$81/100,\"GOOD\",IF(C27>='T2'!$F$5*$E$80/100,\"AVERAGE\",\"POOR\"))))","v":"EXCELLENT"}]
[{"$f":"Data_Sheet!A28","v":"JEC16EC054"},{"$f":"Data_Sheet!B28","v":"MARIAN DAVIS KATTUKARAN"},{"$f":"'T2'!J28","v":43},{"$f":"IF(C28=\"A\",\"ABSENT\",IF(C28>='T2'!$F$5*$E$82/100,\"EXCELLENT\",IF(C28>='T2'!$F$5*$E$81/100,\"GOOD\",IF(C28>='T2'!$F$5*$E$80/100,\"AVERAGE\",\"POOR\"))))","v":"EXCELLENT"}]
[{"$f":"Data_Sheet!A29","v":"JEC16EC055"},{"$f":"Data_Sheet!B29","v":"MARY JEETHU A J"},{"$f":"'T2'!J29","v":45},{"$f":"IF(C29=\"A\",\"ABSENT\",IF(C29>='T2'!$F$5*$E$82/100,\"EXCELLENT\",IF(C29>='T2'!$F$5*$E$81/100,\"GOOD\",IF(C29>='T2'!$F$5*$E$80/100,\"AVERAGE\",\"POOR\"))))","v":"EXCELLENT"}]
[{"$f":"Data_Sheet!A30","v":"JEC16EC056"},{"$f":"Data_Sheet!B30","v":"MUBASHIRA K M"},{"$f":"'T2'!J30","v":44},{"$f":"IF(C30=\"A\",\"ABSENT\",IF(C30>='T2'!$F$5*$E$82/100,\"EXCELLENT\",IF(C30>='T2'!$F$5*$E$81/100,\"GOOD\",IF(C30>='T2'!$F$5*$E$80/100,\"AVERAGE\",\"POOR\"))))","v":"EXCELLENT"}]
[{"$f":"Data_Sheet!A31","v":"JEC16EC057"},{"$f":"Data_Sheet!B31","v":"MUHAMMED ARSHAD"},{"$f":"'T2'!J31","v":36},{"$f":"IF(C31=\"A\",\"ABSENT\",IF(C31>='T2'!$F$5*$E$82/100,\"EXCELLENT\",IF(C31>='T2'!$F$5*$E$81/100,\"GOOD\",IF(C31>='T2'!$F$5*$E$80/100,\"AVERAGE\",\"POOR\"))))","v":"GOOD"}]
[{"$f":"Data_Sheet!A32","v":"JEC16EC058"},{"$f":"Data_Sheet!B32","v":"NANDANA K"},{"$f":"'T2'!J32","v":41},{"$f":"IF(C32=\"A\",\"ABSENT\",IF(C32>='T2'!$F$5*$E$82/100,\"EXCELLENT\",IF(C32>='T2'!$F$5*$E$81/100,\"GOOD\",IF(C32>='T2'!$F$5*$E$80/100,\"AVERAGE\",\"POOR\"))))","v":"EXCELLENT"}]
[{"$f":"Data_Sheet!A33","v":"JEC16EC059"},{"$f":"Data_Sheet!B33","v":"NARAYANAN M B"},{"$f":"'T2'!J33","v":29},{"$f":"IF(C33=\"A\",\"ABSENT\",IF(C33>='T2'!$F$5*$E$82/100,\"EXCELLENT\",IF(C33>='T2'!$F$5*$E$81/100,\"GOOD\",IF(C33>='T2'!$F$5*$E$80/100,\"AVERAGE\",\"POOR\"))))","v":"AVERAGE"}]
[{"$f":"Data_Sheet!A34","v":"JEC16EC061"},{"$f":"Data_Sheet!B34","v":"NIKHIL KJ"},{"$f":"'T2'!J34","v":23},{"$f":"IF(C34=\"A\",\"ABSENT\",IF(C34>='T2'!$F$5*$E$82/100,\"EXCELLENT\",IF(C34>='T2'!$F$5*$E$81/100,\"GOOD\",IF(C34>='T2'!$F$5*$E$80/100,\"AVERAGE\",\"POOR\"))))","v":"AVERAGE"}]
[{"$f":"Data_Sheet!A35","v":"JEC16EC062"},{"$f":"Data_Sheet!B35","v":"NIMISHA M S"},{"$f":"'T2'!J35","v":43},{"$f":"IF(C35=\"A\",\"ABSENT\",IF(C35>='T2'!$F$5*$E$82/100,\"EXCELLENT\",IF(C35>='T2'!$F$5*$E$81/100,\"GOOD\",IF(C35>='T2'!$F$5*$E$80/100,\"AVERAGE\",\"POOR\"))))","v":"EXCELLENT"}]
[{"$f":"Data_Sheet!A36","v":"JEC16EC063"},{"$f":"Data_Sheet!B36","v":"NIMISHA TONY"},{"$f":"'T2'!J36","v":44},{"$f":"IF(C36=\"A\",\"ABSENT\",IF(C36>='T2'!$F$5*$E$82/100,\"EXCELLENT\",IF(C36>='T2'!$F$5*$E$81/100,\"GOOD\",IF(C36>='T2'!$F$5*$E$80/100,\"AVERAGE\",\"POOR\"))))","v":"EXCELLENT"}]
[{"$f":"Data_Sheet!A37","v":"JEC16EC064"},{"$f":"Data_Sheet!B37","v":"NITHIN"},{"$f":"'T2'!J37","v":38},{"$f":"IF(C37=\"A\",\"ABSENT\",IF(C37>='T2'!$F$5*$E$82/100,\"EXCELLENT\",IF(C37>='T2'!$F$5*$E$81/100,\"GOOD\",IF(C37>='T2'!$F$5*$E$80/100,\"AVERAGE\",\"POOR\"))))","v":"GOOD"}]
[{"$f":"Data_Sheet!A38","v":"JEC16EC065"},{"$f":"Data_Sheet!B38","v":"OLIVIA NELSON"},{"$f":"'T2'!J38","v":40},{"$f":"IF(C38=\"A\",\"ABSENT\",IF(C38>='T2'!$F$5*$E$82/100,\"EXCELLENT\",IF(C38>='T2'!$F$5*$E$81/100,\"GOOD\",IF(C38>='T2'!$F$5*$E$80/100,\"AVERAGE\",\"POOR\"))))","v":"EXCELLENT"}]
[{"$f":"Data_Sheet!A39","v":"JEC16EC066"},{"$f":"Data_Sheet!B39","v":"PAVITHRA.P"},{"$f":"'T2'!J39","v":45},{"$f":"IF(C39=\"A\",\"ABSENT\",IF(C39>='T2'!$F$5*$E$82/100,\"EXCELLENT\",IF(C39>='T2'!$F$5*$E$81/100,\"GOOD\",IF(C39>='T2'!$F$5*$E$80/100,\"AVERAGE\",\"POOR\"))))","v":"EXCELLENT"}]
[{"$f":"Data_Sheet!A40","v":"JEC16EC067"},{"$f":"Data_Sheet!B40","v":"P.DHANYA RAJ"},{"$f":"'T2'!J40","v":32},{"$f":"IF(C40=\"A\",\"ABSENT\",IF(C40>='T2'!$F$5*$E$82/100,\"EXCELLENT\",IF(C40>='T2'!$F$5*$E$81/100,\"GOOD\",IF(C40>='T2'!$F$5*$E$80/100,\"AVERAGE\",\"POOR\"))))","v":"GOOD"}]
[{"$f":"Data_Sheet!A41","v":"JEC16EC068"},{"$f":"Data_Sheet!B41","v":"POOJA.P"},{"$f":"'T2'!J41","v":46},{"$f":"IF(C41=\"A\",\"ABSENT\",IF(C41>='T2'!$F$5*$E$82/100,\"EXCELLENT\",IF(C41>='T2'!$F$5*$E$81/100,\"GOOD\",IF(C41>='T2'!$F$5*$E$80/100,\"AVERAGE\",\"POOR\"))))","v":"EXCELLENT"}]
[{"$f":"Data_Sheet!A42","v":"JEC16EC069"},{"$f":"Data_Sheet!B42","v":"PRANAV"},{"$f":"'T2'!J42","v":30},{"$f":"IF(C42=\"A\",\"ABSENT\",IF(C42>='T2'!$F$5*$E$82/100,\"EXCELLENT\",IF(C42>='T2'!$F$5*$E$81/100,\"GOOD\",IF(C42>='T2'!$F$5*$E$80/100,\"AVERAGE\",\"POOR\"))))","v":"GOOD"}]
[{"$f":"Data_Sheet!A43","v":"JEC16EC070"},{"$f":"Data_Sheet!B43","v":"PRASOBH KP"},{"$f":"'T2'!J43","v":37},{"$f":"IF(C43=\"A\",\"ABSENT\",IF(C43>='T2'!$F$5*$E$82/100,\"EXCELLENT\",IF(C43>='T2'!$F$5*$E$81/100,\"GOOD\",IF(C43>='T2'!$F$5*$E$80/100,\"AVERAGE\",\"POOR\"))))","v":"GOOD"}]
[{"$f":"Data_Sheet!A44","v":"JEC16EC071"},{"$f":"Data_Sheet!B44","v":"PRINCE BENNY"},{"$f":"'T2'!J44","v":36},{"$f":"IF(C44=\"A\",\"ABSENT\",IF(C44>='T2'!$F$5*$E$82/100,\"EXCELLENT\",IF(C44>='T2'!$F$5*$E$81/100,\"GOOD\",IF(C44>='T2'!$F$5*$E$80/100,\"AVERAGE\",\"POOR\"))))","v":"GOOD"}]
[{"$f":"Data_Sheet!A45","v":"JEC16EC072"},{"$f":"Data_Sheet!B45","v":"PRIYA.K"},{"$f":"'T2'!J45","v":47},{"$f":"IF(C45=\"A\",\"ABSENT\",IF(C45>='T2'!$F$5*$E$82/100,\"EXCELLENT\",IF(C45>='T2'!$F$5*$E$81/100,\"GOOD\",IF(C45>='T2'!$F$5*$E$80/100,\"AVERAGE\",\"POOR\"))))","v":"EXCELLENT"}]
[{"$f":"Data_Sheet!A46","v":"JEC16EC073"},{"$f":"Data_Sheet!B46","v":"RADHIKA"},{"$f":"'T2'!J46","v":46},{"$f":"IF(C46=\"A\",\"ABSENT\",IF(C46>='T2'!$F$5*$E$82/100,\"EXCELLENT\",IF(C46>='T2'!$F$5*$E$81/100,\"GOOD\",IF(C46>='T2'!$F$5*$E$80/100,\"AVERAGE\",\"POOR\"))))","v":"EXCELLENT"}]
[{"$f":"Data_Sheet!A47","v":"JEC16EC074"},{"$f":"Data_Sheet!B47","v":"RINOSHA.K.R"},{"$f":"'T2'!J47","v":45},{"$f":"IF(C47=\"A\",\"ABSENT\",IF(C47>='T2'!$F$5*$E$82/100,\"EXCELLENT\",IF(C47>='T2'!$F$5*$E$81/100,\"GOOD\",IF(C47>='T2'!$F$5*$E$80/100,\"AVERAGE\",\"POOR\"))))","v":"EXCELLENT"}]
[{"$f":"Data_Sheet!A48","v":"JEC16EC075"},{"$f":"Data_Sheet!B48","v":"RIYA ALBERT"},{"$f":"'T2'!J48","v":33},{"$f":"IF(C48=\"A\",\"ABSENT\",IF(C48>='T2'!$F$5*$E$82/100,\"EXCELLENT\",IF(C48>='T2'!$F$5*$E$81/100,\"GOOD\",IF(C48>='T2'!$F$5*$E$80/100,\"AVERAGE\",\"POOR\"))))","v":"GOOD"}]
[{"$f":"Data_Sheet!A49","v":"JEC16EC076"},{"$f":"Data_Sheet!B49","v":"RIYA PS"},{"$f":"'T2'!J49","v":34},{"$f":"IF(C49=\"A\",\"ABSENT\",IF(C49>='T2'!$F$5*$E$82/100,\"EXCELLENT\",IF(C49>='T2'!$F$5*$E$81/100,\"GOOD\",IF(C49>='T2'!$F$5*$E$80/100,\"AVERAGE\",\"POOR\"))))","v":"GOOD"}]
[{"$f":"Data_Sheet!A50","v":"JEC16EC077"},{"$f":"Data_Sheet!B50","v":"ROSHNI J NAIR"},{"$f":"'T2'!J50","v":42},{"$f":"IF(C50=\"A\",\"ABSENT\",IF(C50>='T2'!$F$5*$E$82/100,\"EXCELLENT\",IF(C50>='T2'!$F$5*$E$81/100,\"GOOD\",IF(C50>='T2'!$F$5*$E$80/100,\"AVERAGE\",\"POOR\"))))","v":"EXCELLENT"}]
[{"$f":"Data_Sheet!A51","v":"JEC16EC079"},{"$f":"Data_Sheet!B51","v":"SAFNA M"},{"$f":"'T2'!J51","v":42},{"$f":"IF(C51=\"A\",\"ABSENT\",IF(C51>='T2'!$F$5*$E$82/100,\"EXCELLENT\",IF(C51>='T2'!$F$5*$E$81/100,\"GOOD\",IF(C51>='T2'!$F$5*$E$80/100,\"AVERAGE\",\"POOR\"))))","v":"EXCELLENT"}]
[{"$f":"Data_Sheet!A52","v":"JEC16EC080"},{"$f":"Data_Sheet!B52","v":"SAJIN SHAJI"},{"$f":"'T2'!J52","v":42},{"$f":"IF(C52=\"A\",\"ABSENT\",IF(C52>='T2'!$F$5*$E$82/100,\"EXCELLENT\",IF(C52>='T2'!$F$5*$E$81/100,\"GOOD\",IF(C52>='T2'!$F$5*$E$80/100,\"AVERAGE\",\"POOR\"))))","v":"EXCELLENT"}]
[{"$f":"Data_Sheet!A53","v":"JEC16EC081"},{"$f":"Data_Sheet!B53","v":"SANDHRA .S"},{"$f":"'T2'!J53","v":19},{"$f":"IF(C53=\"A\",\"ABSENT\",IF(C53>='T2'!$F$5*$E$82/100,\"EXCELLENT\",IF(C53>='T2'!$F$5*$E$81/100,\"GOOD\",IF(C53>='T2'!$F$5*$E$80/100,\"AVERAGE\",\"POOR\"))))","v":"POOR"}]
[{"$f":"Data_Sheet!A54","v":"JEC16EC082"},{"$f":"Data_Sheet!B54","v":"SANGAMITHRA"},{"$f":"'T2'!J54","v":45},{"$f":"IF(C54=\"A\",\"ABSENT\",IF(C54>='T2'!$F$5*$E$82/100,\"EXCELLENT\",IF(C54>='T2'!$F$5*$E$81/100,\"GOOD\",IF(C54>='T2'!$F$5*$E$80/100,\"AVERAGE\",\"POOR\"))))","v":"EXCELLENT"}]
[{"$f":"Data_Sheet!A55","v":"JEC16EC083"},{"$f":"Data_Sheet!B55","v":"SARANYA.M.NAIR"},{"$f":"'T2'!J55","v":42},{"$f":"IF(C55=\"A\",\"ABSENT\",IF(C55>='T2'!$F$5*$E$82/100,\"EXCELLENT\",IF(C55>='T2'!$F$5*$E$81/100,\"GOOD\",IF(C55>='T2'!$F$5*$E$80/100,\"AVERAGE\",\"POOR\"))))","v":"EXCELLENT"}]
[{"$f":"Data_Sheet!A56","v":"JEC16EC084"},{"$f":"Data_Sheet!B56","v":"SARATHRAJ"},{"$f":"'T2'!J56","v":36},{"$f":"IF(C56=\"A\",\"ABSENT\",IF(C56>='T2'!$F$5*$E$82/100,\"EXCELLENT\",IF(C56>='T2'!$F$5*$E$81/100,\"GOOD\",IF(C56>='T2'!$F$5*$E$80/100,\"AVERAGE\",\"POOR\"))))","v":"GOOD"}]
[{"$f":"Data_Sheet!A57","v":"JEC16EC085"},{"$f":"Data_Sheet!B57","v":"SHAHAN FATHIMA K"},{"$f":"'T2'!J57","v":41},{"$f":"IF(C57=\"A\",\"ABSENT\",IF(C57>='T2'!$F$5*$E$82/100,\"EXCELLENT\",IF(C57>='T2'!$F$5*$E$81/100,\"GOOD\",IF(C57>='T2'!$F$5*$E$80/100,\"AVERAGE\",\"POOR\"))))","v":"EXCELLENT"}]
[{"$f":"Data_Sheet!A58","v":"JEC16EC086"},{"$f":"Data_Sheet!B58","v":"SHAHLA.P.MOHAMMED"},{"$f":"'T2'!J58","v":37},{"$f":"IF(C58=\"A\",\"ABSENT\",IF(C58>='T2'!$F$5*$E$82/100,\"EXCELLENT\",IF(C58>='T2'!$F$5*$E$81/100,\"GOOD\",IF(C58>='T2'!$F$5*$E$80/100,\"AVERAGE\",\"POOR\"))))","v":"GOOD"}]
[{"$f":"Data_Sheet!A59","v":"JEC16EC087"},{"$f":"Data_Sheet!B59","v":"SHAMSEENA T A"},{"$f":"'T2'!J59","v":20},{"$f":"IF(C59=\"A\",\"ABSENT\",IF(C59>='T2'!$F$5*$E$82/100,\"EXCELLENT\",IF(C59>='T2'!$F$5*$E$81/100,\"GOOD\",IF(C59>='T2'!$F$5*$E$80/100,\"AVERAGE\",\"POOR\"))))","v":"POOR"}]
[{"$f":"Data_Sheet!A60","v":"JEC16EC088"},{"$f":"Data_Sheet!B60","v":"SHARAN SHASHINDRAN A"},{"$f":"'T2'!J60","v":26},{"$f":"IF(C60=\"A\",\"ABSENT\",IF(C60>='T2'!$F$5*$E$82/100,\"EXCELLENT\",IF(C60>='T2'!$F$5*$E$81/100,\"GOOD\",IF(C60>='T2'!$F$5*$E$80/100,\"AVERAGE\",\"POOR\"))))","v":"AVERAGE"}]
[{"$f":"Data_Sheet!A61","v":"JEC16EC089"},{"$f":"Data_Sheet!B61","v":"SIBIN KRISHNA C"},{"$f":"'T2'!J61","v":27},{"$f":"IF(C61=\"A\",\"ABSENT\",IF(C61>='T2'!$F$5*$E$82/100,\"EXCELLENT\",IF(C61>='T2'!$F$5*$E$81/100,\"GOOD\",IF(C61>='T2'!$F$5*$E$80/100,\"AVERAGE\",\"POOR\"))))","v":"AVERAGE"}]
[{"$f":"Data_Sheet!A62","v":"JEC16EC090"},{"$f":"Data_Sheet!B62","v":"SREEJITH VIJAYAKUMAR"},{"$f":"'T2'!J62","v":0},{"$f":"IF(C62=\"A\",\"ABSENT\",IF(C62>='T2'!$F$5*$E$82/100,\"EXCELLENT\",IF(C62>='T2'!$F$5*$E$81/100,\"GOOD\",IF(C62>='T2'!$F$5*$E$80/100,\"AVERAGE\",\"POOR\"))))","v":"POOR"}]
[{"$f":"Data_Sheet!A63","v":"JEC16EC091"},{"$f":"Data_Sheet!B63","v":"SREELAKSHMI.R"},{"$f":"'T2'!J63","v":44},{"$f":"IF(C63=\"A\",\"ABSENT\",IF(C63>='T2'!$F$5*$E$82/100,\"EXCELLENT\",IF(C63>='T2'!$F$5*$E$81/100,\"GOOD\",IF(C63>='T2'!$F$5*$E$80/100,\"AVERAGE\",\"POOR\"))))","v":"EXCELLENT"}]
[{"$f":"Data_Sheet!A64","v":"JEC16EC092"},{"$f":"Data_Sheet!B64","v":"SREERAG K M"},{"$f":"'T2'!J64","v":35},{"$f":"IF(C64=\"A\",\"ABSENT\",IF(C64>='T2'!$F$5*$E$82/100,\"EXCELLENT\",IF(C64>='T2'!$F$5*$E$81/100,\"GOOD\",IF(C64>='T2'!$F$5*$E$80/100,\"AVERAGE\",\"POOR\"))))","v":"GOOD"}]
[{"$f":"Data_Sheet!A65","v":"JEC16EC093"},{"$f":"Data_Sheet!B65","v":"SREERAG T K"},{"$f":"'T2'!J65","v":0},{"$f":"IF(C65=\"A\",\"ABSENT\",IF(C65>='T2'!$F$5*$E$82/100,\"EXCELLENT\",IF(C65>='T2'!$F$5*$E$81/100,\"GOOD\",IF(C65>='T2'!$F$5*$E$80/100,\"AVERAGE\",\"POOR\"))))","v":"POOR"}]
[{"$f":"Data_Sheet!A66","v":"JEC16EC094"},{"$f":"Data_Sheet!B66","v":"SREERAG V.V"},{"$f":"'T2'!J66","v":35},{"$f":"IF(C66=\"A\",\"ABSENT\",IF(C66>='T2'!$F$5*$E$82/100,\"EXCELLENT\",IF(C66>='T2'!$F$5*$E$81/100,\"GOOD\",IF(C66>='T2'!$F$5*$E$80/100,\"AVERAGE\",\"POOR\"))))","v":"GOOD"}]
[{"$f":"Data_Sheet!A67","v":"JEC16EC095"},{"$f":"Data_Sheet!B67","v":"SRUTHIMOL.N.T"},{"$f":"'T2'!J67","v":0},{"$f":"IF(C67=\"A\",\"ABSENT\",IF(C67>='T2'!$F$5*$E$82/100,\"EXCELLENT\",IF(C67>='T2'!$F$5*$E$81/100,\"GOOD\",IF(C67>='T2'!$F$5*$E$80/100,\"AVERAGE\",\"POOR\"))))","v":"POOR"}]
[{"$f":"Data_Sheet!A68","v":"JEC16EC096"},{"$f":"Data_Sheet!B68","v":"SRUTHISHA SASI"},{"$f":"'T2'!J68","v":49},{"$f":"IF(C68=\"A\",\"ABSENT\",IF(C68>='T2'!$F$5*$E$82/100,\"EXCELLENT\",IF(C68>='T2'!$F$5*$E$81/100,\"GOOD\",IF(C68>='T2'!$F$5*$E$80/100,\"AVERAGE\",\"POOR\"))))","v":"EXCELLENT"}]
[{"$f":"Data_Sheet!A69","v":"JEC16EC097"},{"$f":"Data_Sheet!B69","v":"SUCHITHRA.TS"},{"$f":"'T2'!J69","v":31},{"$f":"IF(C69=\"A\",\"ABSENT\",IF(C69>='T2'!$F$5*$E$82/100,\"EXCELLENT\",IF(C69>='T2'!$F$5*$E$81/100,\"GOOD\",IF(C69>='T2'!$F$5*$E$80/100,\"AVERAGE\",\"POOR\"))))","v":"GOOD"}]
[{"$f":"Data_Sheet!A70","v":"JEC16EC098"},{"$f":"Data_Sheet!B70","v":"SWETHA SARA GEORGE"},{"$f":"'T2'!J70","v":37},{"$f":"IF(C70=\"A\",\"ABSENT\",IF(C70>='T2'!$F$5*$E$82/100,\"EXCELLENT\",IF(C70>='T2'!$F$5*$E$81/100,\"GOOD\",IF(C70>='T2'!$F$5*$E$80/100,\"AVERAGE\",\"POOR\"))))","v":"GOOD"}]
[{"$f":"Data_Sheet!A71","v":"JEC16EC099"},{"$f":"Data_Sheet!B71","v":"VISHNU K"},{"$f":"'T2'!J71","v":43},{"$f":"IF(C71=\"A\",\"ABSENT\",IF(C71>='T2'!$F$5*$E$82/100,\"EXCELLENT\",IF(C71>='T2'!$F$5*$E$81/100,\"GOOD\",IF(C71>='T2'!$F$5*$E$80/100,\"AVERAGE\",\"POOR\"))))","v":"EXCELLENT"}]
[{"$f":"Data_Sheet!A72","v":"JEC16EC100"},{"$f":"Data_Sheet!B72","v":"VISHNU PRAKASH"},{"$f":"'T2'!J72","v":28},{"$f":"IF(C72=\"A\",\"ABSENT\",IF(C72>='T2'!$F$5*$E$82/100,\"EXCELLENT\",IF(C72>='T2'!$F$5*$E$81/100,\"GOOD\",IF(C72>='T2'!$F$5*$E$80/100,\"AVERAGE\",\"POOR\"))))","v":"AVERAGE"}]
[{"$f":"Data_Sheet!A73","v":"JEC16EC101"},{"$f":"Data_Sheet!B73","v":"VISHNU V"},{"$f":"'T2'!J73","v":31},{"$f":"IF(C73=\"A\",\"ABSENT\",IF(C73>='T2'!$F$5*$E$82/100,\"EXCELLENT\",IF(C73>='T2'!$F$5*$E$81/100,\"GOOD\",IF(C73>='T2'!$F$5*$E$80/100,\"AVERAGE\",\"POOR\"))))","v":"GOOD"}]
[{"$f":"Data_Sheet!A74","v":"LJEC16EC102"},{"$f":"Data_Sheet!B74","v":"CHRISTEENA PAULSON"},{"$f":"'T2'!J74","v":40},{"$f":"IF(C74=\"A\",\"ABSENT\",IF(C74>='T2'!$F$5*$E$82/100,\"EXCELLENT\",IF(C74>='T2'!$F$5*$E$81/100,\"GOOD\",IF(C74>='T2'!$F$5*$E$80/100,\"AVERAGE\",\"POOR\"))))","v":"EXCELLENT"}]
[]
["Total Number of Students",null,{"$f":"Data_Sheet!$C$6","v":50}]
["Number of Students Absent",null,{"$f":"IF(COUNTIF(C25:INDIRECT(C89),\"=A\"),COUNTIF(C25:INDIRECT(C89),\"=A\"),0)","v":0}]
["Total Number of Students attended",null,{"$f":"C76-C77","v":50}]
[{"$f":"\"Number of Students with Marks less than \"&E80&\"%\"","v":"Number of Students with Marks less than 45%"},null,{"$f":"IF(COUNTIF(D25:INDIRECT(D89),\"=POOR\"),COUNTIF(D25:INDIRECT(D89),\"=POOR\"),0)","v":5},"POOR","Range"]
[{"$f":"\"Number of Students with Marks betweeen \"&E80&\"% to \"&E81&\"%\"","v":"Number of Students with Marks betweeen 45% to 60%"},null,{"$f":"IF(COUNTIF(D25:INDIRECT(D89),\"=AVERAGE\"),COUNTIF(D25:INDIRECT(D89),\"=AVERAGE\"),0)","v":6},"AVERAGE",45]
[{"$f":"\"Number of Students with Marks betweeen \"&E81&\"% to \"&E82&\"%\"","v":"Number of Students with Marks betweeen 60% to 80%"},null,{"$f":"IF(COUNTIF(D25:INDIRECT(D89),\"=GOOD\"),COUNTIF(D25:INDIRECT(D89),\"=GOOD\"),0)","v":15},"GOOD",60]
[{"$f":"\"Number of Students with Marks greater than \"&E82&\"%\"","v":"Number of Students with Marks greater than 80%"},null,{"$f":"IF(COUNTIF(D25:INDIRECT(D89),\"=EXCELLENT\"),COUNTIF(D25:INDIRECT(D89),\"=EXCELLENT\"),0)","v":24},"EXCELLENT",80]
["Class Average",null,{"$f":"ROUND(AVERAGE(C25:INDIRECT(C89)),2)","v":35.32}]
["Pass Percentage",null,{"$f":"ROUND(((C78-C79)/C78)*100,2)","v":90}]
[]
[null,{"$f":"Data_Sheet!B10","v":"Name of Faculty : "},{"$f":"Data_Sheet!B11","v":"PONMANI RAJA M"}]
[null,{"$f":"Data_Sheet!B94","v":"Dated Signature :  "}]
[]
[{"$f":"ROW(A76)-2","v":74},"Last Row Count",{"$f":"\"$C$\"&$A$89","v":"$C$74"},{"$f":"\"$D$\"&$A$89","v":"$D$74"}]

{"sheet":"T3","index":6,"n_rows":139,"n_cols":19,"rows_kept":139,"cut":false,"hidden":false,"merged":[[77,0,77,2],[17,11,21,11],[78,0,78,2],[126,15,131,15],[98,15,103,15],[105,15,110,15],[112,15,117,15],[119,15,124,15],[79,0,79,2],[75,0,75,2],[76,0,76,2],[2,0,4,1],[2,2,2,5],[2,6,2,7],[3,2,3,5],[3,6,3,7],[4,2,4,4],[6,0,6,8],[8,0,8,8],[10,0,10,8],[12,0,12,8],[17,0,21,0],[17,1,21,1],[17,8,21,8]]}
[]
[]
["Add questions one by one as needed..",null,"Assessment Category",null,null,null,"Date : ",null,null,"CO1","First Internal Exam"]
[null,null,"Retest",null,null,null,"14-03-18",null,null,"CO2","Second Internal Exam"]
[null,null,"Total Marks : ",null,null,50,null,null,null,"CO3","Assessment Exam - 1"]
[null,null,null,null,null,null,null,null,null,"CO4","Assessment Exam - 2"]
[{"$f":"Data_Sheet!A2","v":"Jyothi Engineering College, Cheruthuruthy"},null,null,null,null,null,null,null,null,"CO5","Assignment - 1"]
[null,null,null,null,null,null,null,null,null,"CO6","Assignment - 2"]
[{"$f":"Data_Sheet!A4","v":"Department of Electrical & Electronics Engineering"},null,null,null,null,null,null,null,null,null,"Retest"]
[null,null,null,null,null,null,null,null,null,1]
[{"$f":"\"CO Analysis - Internal Marks : \"&C4 &\"                       \" &TEXT(G4,\"dd-mm-yy\")","v":"CO Analysis - Internal Marks : Retest                       14-03-18"},null,null,null,null,null,null,null,null,2]
[null,null,null,null,null,null,null,null,null,3]
[{"$f":"Data_Sheet!A17","v":"S7 EC              EC407 Computer Communication               2019-20"},null,null,null,null,null,null,null,null,4]
[null,null,null,null,null,null,null,null,null,5]
[null,null,null,null,null,null,null,null,null,6]
[]
[]
["Register No.","Name of Student","Qn. No.",1,2,3,4,5,{"$f":" \"Total Marks (\" &F5 & \")\"","v":"Total Marks (50)"},null,null,"Calculated Total Marks (50)"]
[null,null,"CO's","CO3","CO3","CO4","CO4","CO5"]
[null,null,"Blooms Taxonomy Lavel",5,5,5,6,6]
[null,null,"Max. Marks",5,5,5,5,5]
[null,null,"Difficulty Level in %",60,60,60,60,60]
[]
["Column1","Column2","Column3","Column4","Column5","Column6","Column7","Column8","Column32"]
[{"$f":"Data_Sheet!A25","v":"JEC16EC051"},{"$f":"Data_Sheet!B25","v":"LANA KOLLATH"}]
[{"$f":"Data_Sheet!A26","v":"JEC16EC052"},{"$f":"Data_Sheet!B26","v":"MANU JENSON"}]
[{"$f":"Data_Sheet!A27","v":"JEC16EC053"},{"$f":"Data_Sheet!B27","v":"MAREENA MARIYA ABRAHAM"}]
[{"$f":"Data_Sheet!A28","v":"JEC16EC054"},{"$f":"Data_Sheet!B28","v":"MARIAN DAVIS KATTUKARAN"}]
[{"$f":"Data_Sheet!A29","v":"JEC16EC055"},{"$f":"Data_Sheet!B29","v":"MARY JEETHU A J"}]
[{"$f":"Data_Sheet!A30","v":"JEC16EC056"},{"$f":"Data_Sheet!B30","v":"MUBASHIRA K M"}]
[{"$f":"Data_Sheet!A31","v":"JEC16EC057"},{"$f":"Data_Sheet!B31","v":"MUHAMMED ARSHAD"}]
[{"$f":"Data_Sheet!A32","v":"JEC16EC058"},{"$f":"Data_Sheet!B32","v":"NANDANA K"}]
[{"$f":"Data_Sheet!A33","v":"JEC16EC059"},{"$f":"Data_Sheet!B33","v":"NARAYANAN M B"}]
[{"$f":"Data_Sheet!A34","v":"JEC16EC061"},{"$f":"Data_Sheet!B34","v":"NIKHIL KJ"}]
[{"$f":"Data_Sheet!A35","v":"JEC16EC062"},{"$f":"Data_Sheet!B35","v":"NIMISHA M S"}]
[{"$f":"Data_Sheet!A36","v":"JEC16EC063"},{"$f":"Data_Sheet!B36","v":"NIMISHA TONY"}]
[{"$f":"Data_Sheet!A37","v":"JEC16EC064"},{"$f":"Data_Sheet!B37","v":"NITHIN"}]
[{"$f":"Data_Sheet!A38","v":"JEC16EC065"},{"$f":"Data_Sheet!B38","v":"OLIVIA NELSON"}]
[{"$f":"Data_Sheet!A39","v":"JEC16EC066"},{"$f":"Data_Sheet!B39","v":"PAVITHRA.P"}]
[{"$f":"Data_Sheet!A40","v":"JEC16EC067"},{"$f":"Data_Sheet!B40","v":"P.DHANYA RAJ"}]
[{"$f":"Data_Sheet!A41","v":"JEC16EC068"},{"$f":"Data_Sheet!B41","v":"POOJA.P"}]
[{"$f":"Data_Sheet!A42","v":"JEC16EC069"},{"$f":"Data_Sheet!B42","v":"PRANAV"}]
[{"$f":"Data_Sheet!A43","v":"JEC16EC070"},{"$f":"Data_Sheet!B43","v":"PRASOBH KP"}]
[{"$f":"Data_Sheet!A44","v":"JEC16EC071"},{"$f":"Data_Sheet!B44","v":"PRINCE BENNY"}]
[{"$f":"Data_Sheet!A45","v":"JEC16EC072"},{"$f":"Data_Sheet!B45","v":"PRIYA.K"}]
[{"$f":"Data_Sheet!A46","v":"JEC16EC073"},{"$f":"Data_Sheet!B46","v":"RADHIKA"}]
[{"$f":"Data_Sheet!A47","v":"JEC16EC074"},{"$f":"Data_Sheet!B47","v":"RINOSHA.K.R"}]
[{"$f":"Data_Sheet!A48","v":"JEC16EC075"},{"$f":"Data_Sheet!B48","v":"RIYA ALBERT"}]
[{"$f":"Data_Sheet!A49","v":"JEC16EC076"},{"$f":"Data_Sheet!B49","v":"RIYA PS"}]
[{"$f":"Data_Sheet!A50","v":"JEC16EC077"},{"$f":"Data_Sheet!B50","v":"ROSHNI J NAIR"}]
[{"$f":"Data_Sheet!A51","v":"JEC16EC079"},{"$f":"Data_Sheet!B51","v":"SAFNA M"}]
[{"$f":"Data_Sheet!A52","v":"JEC16EC080"},{"$f":"Data_Sheet!B52","v":"SAJIN SHAJI"}]
[{"$f":"Data_Sheet!A53","v":"JEC16EC081"},{"$f":"Data_Sheet!B53","v":"SANDHRA .S"}]
[{"$f":"Data_Sheet!A54","v":"JEC16EC082"},{"$f":"Data_Sheet!B54","v":"SANGAMITHRA"}]
[{"$f":"Data_Sheet!A55","v":"JEC16EC083"},{"$f":"Data_Sheet!B55","v":"SARANYA.M.NAIR"}]
[{"$f":"Data_Sheet!A56","v":"JEC16EC084"},{"$f":"Data_Sheet!B56","v":"SARATHRAJ"}]
[{"$f":"Data_Sheet!A57","v":"JEC16EC085"},{"$f":"Data_Sheet!B57","v":"SHAHAN FATHIMA K"}]
[{"$f":"Data_Sheet!A58","v":"JEC16EC086"},{"$f":"Data_Sheet!B58","v":"SHAHLA.P.MOHAMMED"}]
[{"$f":"Data_Sheet!A59","v":"JEC16EC087"},{"$f":"Data_Sheet!B59","v":"SHAMSEENA T A"}]
[{"$f":"Data_Sheet!A60","v":"JEC16EC088"},{"$f":"Data_Sheet!B60","v":"SHARAN SHASHINDRAN A"}]
[{"$f":"Data_Sheet!A61","v":"JEC16EC089"},{"$f":"Data_Sheet!B61","v":"SIBIN KRISHNA C"}]
[{"$f":"Data_Sheet!A62","v":"JEC16EC090"},{"$f":"Data_Sheet!B62","v":"SREEJITH VIJAYAKUMAR"}]
[{"$f":"Data_Sheet!A63","v":"JEC16EC091"},{"$f":"Data_Sheet!B63","v":"SREELAKSHMI.R"}]
[{"$f":"Data_Sheet!A64","v":"JEC16EC092"},{"$f":"Data_Sheet!B64","v":"SREERAG K M"}]
[{"$f":"Data_Sheet!A65","v":"JEC16EC093"},{"$f":"Data_Sheet!B65","v":"SREERAG T K"}]
[{"$f":"Data_Sheet!A66","v":"JEC16EC094"},{"$f":"Data_Sheet!B66","v":"SREERAG V.V"}]
[{"$f":"Data_Sheet!A67","v":"JEC16EC095"},{"$f":"Data_Sheet!B67","v":"SRUTHIMOL.N.T"}]
[{"$f":"Data_Sheet!A68","v":"JEC16EC096"},{"$f":"Data_Sheet!B68","v":"SRUTHISHA SASI"}]
[{"$f":"Data_Sheet!A69","v":"JEC16EC097"},{"$f":"Data_Sheet!B69","v":"SUCHITHRA.TS"}]
[{"$f":"Data_Sheet!A70","v":"JEC16EC098"},{"$f":"Data_Sheet!B70","v":"SWETHA SARA GEORGE"}]
[{"$f":"Data_Sheet!A71","v":"JEC16EC099"},{"$f":"Data_Sheet!B71","v":"VISHNU K"}]
[{"$f":"Data_Sheet!A72","v":"JEC16EC100"},{"$f":"Data_Sheet!B72","v":"VISHNU PRAKASH"}]
[{"$f":"Data_Sheet!A73","v":"JEC16EC101"},{"$f":"Data_Sheet!B73","v":"VISHNU V"}]
[{"$f":"Data_Sheet!A74","v":"LJEC16EC102"},{"$f":"Data_Sheet!B74","v":"CHRISTEENA PAULSON"}]
[]
["Total Marks scored for the Question",null,null,{"$f":"IF(D$22<>\"\",IF(SUM(D25:INDIRECT(D96))>=0,SUM(D25:INDIRECT(D96)),\"\"),\"\")","v":0},{"$f":"IF(E$22<>\"\",IF(SUM(E25:INDIRECT(E96))>=0,SUM(E25:INDIRECT(E96)),\"\"),\"\")","v":0},{"$f":"IF(F$22<>\"\",IF(SUM(F25:INDIRECT(F96))>=0,SUM(F25:INDIRECT(F96)),\"\"),\"\")","v":0},{"$f":"IF(G$22<>\"\",IF(SUM(G25:INDIRECT(G96))>=0,SUM(G25:INDIRECT(G96)),\"\"),\"\")","v":0},{"$f":"IF(H$22<>\"\",IF(SUM(H25:INDIRECT(H96))>=0,SUM(H25:INDIRECT(H96)),\"\"),\"\")","v":0}]
["No. of Students who attended the Question",null,null,{"$f":"IF(D$22<>\"\",IF(COUNT(D25:INDIRECT(D96))>=0,COUNT(D25:INDIRECT(D96)),\"\"),\"\")","v":0},{"$f":"IF(E$22<>\"\",IF(COUNT(E25:INDIRECT(E96))>=0,COUNT(E25:INDIRECT(E96)),\"\"),\"\")","v":0},{"$f":"IF(F$22<>\"\",IF(COUNT(F25:INDIRECT(F96))>=0,COUNT(F25:INDIRECT(F96)),\"\"),\"\")","v":0},{"$f":"IF(G$22<>\"\",IF(COUNT(G25:INDIRECT(G96))>=0,COUNT(G25:INDIRECT(G96)),\"\"),\"\")","v":0},{"$f":"IF(H$22<>\"\",IF(COUNT(H25:INDIRECT(H96))>=0,COUNT(H25:INDIRECT(H96)),\"\"),\"\")","v":0}]
["Difficulty Level marks of the Question",null,null,{"$f":"IF(D21*D22/100=0,\"\",D21*D22/100)","v":3},3,3,3,3]
["No. of Students who scored above the Difficulty Level",null,null,{"$f":"IF(COUNTIF(D25:INDIRECT(D96),\">=\"&D78)=0,\"\",COUNTIF(D25:INDIRECT(D96),\">=\"&D78))","v":""},{"$f":"IF(COUNTIF(E25:INDIRECT(E96),\">=\"&E78)=0,\"\",COUNTIF(E25:INDIRECT(E96),\">=\"&E78))","v":""},{"$f":"IF(COUNTIF(F25:INDIRECT(F96),\">=\"&F78)=0,\"\",COUNTIF(F25:INDIRECT(F96),\">=\"&F78))","v":""},{"$f":"IF(COUNTIF(G25:INDIRECT(G96),\">=\"&G78)=0,\"\",COUNTIF(G25:INDIRECT(G96),\">=\"&G78))","v":""},{"$f":"IF(COUNTIF(H25:INDIRECT(H96),\">=\"&H78)=0,\"\",COUNTIF(H25:INDIRECT(H96),\">=\"&H78))","v":""}]
["% of Students who scored above the Difficulty Level",null,null,{"$f":"IFERROR(ROUND(D79/D77*100,2),\"\")","v":""},{"$f":"IFERROR(ROUND(E79/E77*100,2),\"\")","v":""},{"$f":"IFERROR(ROUND(F79/F77*100,2),\"\")","v":""},{"$f":"IFERROR(ROUND(G79/G77*100,2),\"\")","v":""},{"$f":"IFERROR(ROUND(H79/H77*100,2),\"\")","v":""}]
[null,null,null,{"$f":"IF(D80=\"\",0,IF(D80>=80,3,IF(D80>=70,2,IF(D80>=60,1,0))))","v":0},{"$f":"IF(E80=\"\",0,IF(E80>=80,3,IF(E80>=70,2,IF(E80>=60,1,0))))","v":0},{"$f":"IF(F80=\"\",0,IF(F80>=80,3,IF(F80>=70,2,IF(F80>=60,1,0))))","v":0},{"$f":"IF(G80=\"\",0,IF(G80>=80,3,IF(G80>=70,2,IF(G80>=60,1,0))))","v":0},{"$f":"IF(H80=\"\",0,IF(H80>=80,3,IF(H80>=70,2,IF(H80>=60,1,0))))","v":0},"Marks",null,null,null,"T_Marks","S_Marks","Students","Level","Above","Above %","Attainment"]
[null,{"$f":"IF(Data_Sheet!A77<>\"\",\"Total Attainment level for \"&Data_Sheet!A77&\" :\",\"\")","v":"Total Attainment level for CO1 :"},{"$f":"IF(Data_Sheet!A77<>\"\",L82,\"\")","v":""},{"$f":"IFERROR((IF(ISNUMBER(SEARCH(\"1\", D$19)),D$21,\"0\")),\"0\")*D81","v":0},{"$f":"IFERROR((IF(ISNUMBER(SEARCH(\"1\", E$19)),E$21,\"0\")),\"0\")*E81","v":0},{"$f":"IFERROR((IF(ISNUMBER(SEARCH(\"1\", F$19)),F$21,\"0\")),\"0\")*F81","v":0},{"$f":"IFERROR((IF(ISNUMBER(SEARCH(\"1\", G$19)),G$21,\"0\")),\"0\")*G81","v":0},{"$f":"IFERROR((IF(ISNUMBER(SEARCH(\"1\", H$19)),H$21,\"0\")),\"0\")*H81","v":0},{"$f":"I99","v":0},null,null,{"$f":"IF(I82=0,\"\",ROUND(SUM(D82:H82)/I82,2))","v":""},{"$f":"I99","v":0},{"$f":"I106","v":0},{"$f":"I113","v":0},{"$f":"I120","v":0},{"$f":"I127","v":0},{"$f":"IFERROR(ROUND(Q82/O82*100,2),\"\")","v":""},{"$f":"IF(R82=\"\",\"\",IF(R82>=80,3,IF(R82>=70,2,IF(R82>=60,1,0))))","v":""}]
[null,{"$f":"IF(Data_Sheet!A78<>\"\",\"Total Attainment level for \"&Data_Sheet!A78&\" :\",\"\")","v":"Total Attainment level for CO2 :"},{"$f":"IF(Data_Sheet!A78<>\"\",L83,\"\")","v":""},{"$f":"IFERROR((IF(ISNUMBER(SEARCH(\"2\", D$19)),D$21,\"0\")),\"0\")*D81","v":0},{"$f":"IFERROR((IF(ISNUMBER(SEARCH(\"2\", E$19)),E$21,\"0\")),\"0\")*E81","v":0},{"$f":"IFERROR((IF(ISNUMBER(SEARCH(\"2\", F$19)),F$21,\"0\")),\"0\")*F81","v":0},{"$f":"IFERROR((IF(ISNUMBER(SEARCH(\"2\", G$19)),G$21,\"0\")),\"0\")*G81","v":0},{"$f":"IFERROR((IF(ISNUMBER(SEARCH(\"2\", H$19)),H$21,\"0\")),\"0\")*H81","v":0},0,null,null,"",0,0,0,0,0,"",""]
[null,{"$f":"IF(Data_Sheet!A79<>\"\",\"Total Attainment level for \"&Data_Sheet!A79&\" :\",\"\")","v":"Total Attainment level for CO3 :"},{"$f":"IF(Data_Sheet!A79<>\"\",L84,\"\")","v":0},{"$f":"IFERROR((IF(ISNUMBER(SEARCH(\"3\", D$19)),D$21,\"0\")),\"0\")*D81","v":0},{"$f":"IFERROR((IF(ISNUMBER(SEARCH(\"3\", E$19)),E$21,\"0\")),\"0\")*E81","v":0},{"$f":"IFERROR((IF(ISNUMBER(SEARCH(\"3\", F$19)),F$21,\"0\")),\"0\")*F81","v":0},{"$f":"IFERROR((IF(ISNUMBER(SEARCH(\"3\", G$19)),G$21,\"0\")),\"0\")*G81","v":0},{"$f":"IFERROR((IF(ISNUMBER(SEARCH(\"3\", H$19)),H$21,\"0\")),\"0\")*H81","v":0},10,null,null,0,10,0,0,6,0,"",""]
[null,{"$f":"IF(Data_Sheet!A80<>\"\",\"Total Attainment level for \"&Data_Sheet!A80&\" :\",\"\")","v":"Total Attainment level for CO4 :"},{"$f":"IF(Data_Sheet!A80<>\"\",L85,\"\")","v":0},{"$f":"IFERROR((IF(ISNUMBER(SEARCH(\"4\", D$19)),D$21,\"0\")),\"0\")*D81","v":0},{"$f":"IFERROR((IF(ISNUMBER(SEARCH(\"4\", E$19)),E$21,\"0\")),\"0\")*E81","v":0},{"$f":"IFERROR((IF(ISNUMBER(SEARCH(\"4\", F$19)),F$21,\"0\")),\"0\")*F81","v":0},{"$f":"IFERROR((IF(ISNUMBER(SEARCH(\"4\", G$19)),G$21,\"0\")),\"0\")*G81","v":0},{"$f":"IFERROR((IF(ISNUMBER(SEARCH(\"4\", H$19)),H$21,\"0\")),\"0\")*H81","v":0},10,null,null,0,10,0,0,6,0,"",""]
[null,{"$f":"IF(Data_Sheet!A81<>\"\",\"Total Attainment level for \"&Data_Sheet!A81&\" :\",\"\")","v":"Total Attainment level for CO5 :"},{"$f":"IF(Data_Sheet!A81<>\"\",L86,\"\")","v":0},{"$f":"IFERROR((IF(ISNUMBER(SEARCH(\"5\", D$19)),D$21,\"0\")),\"0\")*D81","v":0},{"$f":"IFERROR((IF(ISNUMBER(SEARCH(\"5\", E$19)),E$21,\"0\")),\"0\")*E81","v":0},{"$f":"IFERROR((IF(ISNUMBER(SEARCH(\"5\", F$19)),F$21,\"0\")),\"0\")*F81","v":0},{"$f":"IFERROR((IF(ISNUMBER(SEARCH(\"5\", G$19)),G$21,\"0\")),\"0\")*G81","v":0},{"$f":"IFERROR((IF(ISNUMBER(SEARCH(\"5\", H$19)),H$21,\"0\")),\"0\")*H81","v":0},5,null,null,0,5,0,0,3,0,"",""]
[null,{"$f":"IF(Data_Sheet!A82<>\"\",\"Total Attainment level for \"&Data_Sheet!A82&\" :\",\"\")","v":"Total Attainment level for CO6 :"},{"$f":"IF(Data_Sheet!A82<>\"\",L87,\"\")","v":""},{"$f":"IFERROR((IF(ISNUMBER(SEARCH(\"6\", D$19)),D$21,\"0\")),\"0\")*D81","v":0},{"$f":"IFERROR((IF(ISNUMBER(SEARCH(\"6\", E$19)),E$21,\"0\")),\"0\")*E81","v":0},{"$f":"IFERROR((IF(ISNUMBER(SEARCH(\"6\", F$19)),F$21,\"0\")),\"0\")*F81","v":0},{"$f":"IFERROR((IF(ISNUMBER(SEARCH(\"6\", G$19)),G$21,\"0\")),\"0\")*G81","v":0},{"$f":"IFERROR((IF(ISNUMBER(SEARCH(\"6\", H$19)),H$21,\"0\")),\"0\")*H81","v":0},0,null,null,"",0,0,0,0,0,"",""]
[]
[{"$f":"Data_Sheet!A85","v":"Attainment Level 1: 60% students scoring more than 60% of the Total Marks"}]
[{"$f":"Data_Sheet!A86","v":"Attainment Level 2: 70% students scoring more than 60% of the Total Marks"}]
[{"$f":"Data_Sheet!A87","v":"Attainment Level 3: 80% students scoring more than 60% of the Total Marks"}]
[]
[null,{"$f":"Data_Sheet!B10","v":"Name of Faculty : "},{"$f":"Data_Sheet!B11","v":"PONMANI RAJA M"}]
[null,{"$f":"Data_Sheet!B94","v":"Dated Signature :  "}]
[]
[null,"Last Row Count",{"$f":"ROW(A76)-2","v":74},{"$f":"SUBSTITUTE(ADDRESS(1,COLUMN(D1),2),\"1\",\"\")&$C$96","v":"D$74"},{"$f":"\"E\"&$C$96","v":"E74"},{"$f":"SUBSTITUTE(ADDRESS(1,COLUMN(F1),2),\"1\",\"\")&$C$96","v":"F$74"},{"$f":"SUBSTITUTE(ADDRESS(1,COLUMN(G1),2),\"1\",\"\")&$C$96","v":"G$74"},{"$f":"SUBSTITUTE(ADDRESS(1,COLUMN(H1),2),\"1\",\"\")&$C$96","v":"H$74"}]
[]
[]
[null,null,"CO1",{"$f":"IFERROR((IF(ISNUMBER(SEARCH(\"1\", D$19)),D$21,\"0\")),\"0\")","v":"0"},{"$f":"IFERROR((IF(ISNUMBER(SEARCH(\"1\", E$19)),E$21,\"0\")),\"0\")","v":"0"},"0","0","0",{"$f":"IFERROR(SUM($D99:INDIRECT($L99)),\"0\")","v":0},null,null,{"$f":"SUBSTITUTE(ADDRESS(1,N99,4),1,\"\")&ROW($I99)","v":"H99"},{"$f":"COUNTIF($D$20:INDIRECT($O99),\"*1*\")","v":0},{"$f":"COLUMN($I$19)-1","v":8},{"$f":"SUBSTITUTE(ADDRESS(1,N99,4),1,\"\")&ROW($I$19)+1","v":"H20"},"Total Marks"]
[null,null,"CO2",{"$f":"IFERROR((IF(ISNUMBER(SEARCH(\"2\", D$19)),D$21,\"0\")),\"0\")","v":"0"},{"$f":"IFERROR((IF(ISNUMBER(SEARCH(\"2\", E$19)),E$21,\"0\")),\"0\")","v":"0"},"0","0","0",{"$f":"IFERROR(SUM($D100:INDIRECT($L100)),\"0\")","v":0},null,null,"H100",{"$f":"COUNTIF($D$20:INDIRECT($O100),\"*2*\")","v":0},8,"H20"]
[null,null,"CO3",{"$f":"IFERROR((IF(ISNUMBER(SEARCH(\"3\", D$19)),D$21,\"0\")),\"0\")","v":5},{"$f":"IFERROR((IF(ISNUMBER(SEARCH(\"3\", E$19)),E$21,\"0\")),\"0\")","v":5},"0","0","0",{"$f":"IFERROR(SUM($D101:INDIRECT($L101)),\"0\")","v":10},null,null,"H101",{"$f":"COUNTIF($D$20:INDIRECT($O101),\"*3*\")","v":0},8,"H20"]
[null,null,"CO4",{"$f":"IFERROR((IF(ISNUMBER(SEARCH(\"4\", D$19)),D$21,\"0\")),\"0\")","v":"0"},{"$f":"IFERROR((IF(ISNUMBER(SEARCH(\"4\", E$19)),E$21,\"0\")),\"0\")","v":"0"},5,5,"0",{"$f":"IFERROR(SUM($D102:INDIRECT($L102)),\"0\")","v":10},null,null,"H102",{"$f":"COUNTIF($D$20:INDIRECT($O102),\"*4*\")","v":0},8,"H20"]
[null,null,"CO5",{"$f":"IFERROR((IF(ISNUMBER(SEARCH(\"5\", D$19)),D$21,\"0\")),\"0\")","v":"0"},{"$f":"IFERROR((IF(ISNUMBER(SEARCH(\"5\", E$19)),E$21,\"0\")),\"0\")","v":"0"},"0","0",5,{"$f":"IFERROR(SUM($D103:INDIRECT($L103)),\"0\")","v":5},null,null,"H103",{"$f":"COUNTIF($D$20:INDIRECT($O103),\"*5*\")","v":0},8,"H20"]
[null,null,"CO6",{"$f":"IFERROR((IF(ISNUMBER(SEARCH(\"6\", D$19)),D$21,\"0\")),\"0\")","v":"0"},{"$f":"IFERROR((IF(ISNUMBER(SEARCH(\"6\", E$19)),E$21,\"0\")),\"0\")","v":"0"},"0","0","0",{"$f":"IFERROR(SUM($D104:INDIRECT($L104)),\"0\")","v":0},null,null,"H104",{"$f":"COUNTIF($D$20:INDIRECT($O104),\"*6*\")","v":0},8,"H20"]
[]
[null,null,"CO1",{"$f":"IFERROR((IF(ISNUMBER(SEARCH(\"1\", D$19)),D$76,\"0\")),\"0\")","v":"0"},{"$f":"IFERROR((IF(ISNUMBER(SEARCH(\"1\", E$19)),E$76,\"0\")),\"0\")","v":"0"},"0","0","0",{"$f":"IFERROR(SUM($D106:INDIRECT($L106)),\"0\")","v":0},null,null,{"$f":"SUBSTITUTE(ADDRESS(1,N106,4),1,\"\")&ROW($I106)","v":"H106"},{"$f":"COUNTIF($D$20:INDIRECT($O106),\"*1*\")","v":0},{"$f":"COLUMN($I$19)-1","v":8},{"$f":"SUBSTITUTE(ADDRESS(1,N106,4),1,\"\")&ROW($I$19)+1","v":"H20"},"Total Marks Scored"]
[null,null,"CO2",{"$f":"IFERROR((IF(ISNUMBER(SEARCH(\"2\", D$19)),D$76,\"0\")),\"0\")","v":"0"},{"$f":"IFERROR((IF(ISNUMBER(SEARCH(\"2\", E$19)),E$76,\"0\")),\"0\")","v":"0"},"0","0","0",{"$f":"IFERROR(SUM($D107:INDIRECT($L107)),\"0\")","v":0},null,null,"H107",{"$f":"COUNTIF($D$20:INDIRECT($O107),\"*2*\")","v":0},8,"H20"]
[null,null,"CO3",{"$f":"IFERROR((IF(ISNUMBER(SEARCH(\"3\", D$19)),D$76,\"0\")),\"0\")","v":0},{"$f":"IFERROR((IF(ISNUMBER(SEARCH(\"3\", E$19)),E$76,\"0\")),\"0\")","v":0},"0","0","0",{"$f":"IFERROR(SUM($D108:INDIRECT($L108)),\"0\")","v":0},null,null,"H108",{"$f":"COUNTIF($D$20:INDIRECT($O108),\"*3*\")","v":0},8,"H20"]
[null,null,"CO4",{"$f":"IFERROR((IF(ISNUMBER(SEARCH(\"4\", D$19)),D$76,\"0\")),\"0\")","v":"0"},{"$f":"IFERROR((IF(ISNUMBER(SEARCH(\"4\", E$19)),E$76,\"0\")),\"0\")","v":"0"},0,0,"0",{"$f":"IFERROR(SUM($D109:INDIRECT($L109)),\"0\")","v":0},null,null,"H109",{"$f":"COUNTIF($D$20:INDIRECT($O109),\"*4*\")","v":0},8,"H20"]
[null,null,"CO5",{"$f":"IFERROR((IF(ISNUMBER(SEARCH(\"5\", D$19)),D$76,\"0\")),\"0\")","v":"0"},{"$f":"IFERROR((IF(ISNUMBER(SEARCH(\"5\", E$19)),E$76,\"0\")),\"0\")","v":"0"},"0","0",0,{"$f":"IFERROR(SUM($D110:INDIRECT($L110)),\"0\")","v":0},null,null,"H110",{"$f":"COUNTIF($D$20:INDIRECT($O110),\"*5*\")","v":0},8,"H20"]
[null,null,"CO6",{"$f":"IFERROR((IF(ISNUMBER(SEARCH(\"6\", D$19)),D$76,\"0\")),\"0\")","v":"0"},{"$f":"IFERROR((IF(ISNUMBER(SEARCH(\"6\", E$19)),E$76,\"0\")),\"0\")","v":"0"},"0","0","0",{"$f":"IFERROR(SUM($D111:INDIRECT($L111)),\"0\")","v":0},null,null,"H111",{"$f":"COUNTIF($D$20:INDIRECT($O111),\"*6*\")","v":0},8,"H20"]
[]
[null,null,"CO1",{"$f":"IFERROR((IF(ISNUMBER(SEARCH(\"1\", D$19)),D$77,\"0\")),\"0\")","v":"0"},{"$f":"IFERROR((IF(ISNUMBER(SEARCH(\"1\", E$19)),E$77,\"0\")),\"0\")","v":"0"},"0","0","0",{"$f":"IFERROR(SUM($D113:INDIRECT($L113)),\"0\")","v":0},null,null,{"$f":"SUBSTITUTE(ADDRESS(1,N113,4),1,\"\")&ROW($I113)","v":"H113"},{"$f":"COUNTIF($D$20:INDIRECT($O113),\"*1*\")","v":0},{"$f":"COLUMN($I$19)-1","v":8},{"$f":"SUBSTITUTE(ADDRESS(1,N113,4),1,\"\")&ROW($I$19)+1","v":"H20"},"No of Studdents Attended"]
[null,null,"CO2",{"$f":"IFERROR((IF(ISNUMBER(SEARCH(\"2\", D$19)),D$77,\"0\")),\"0\")","v":"0"},{"$f":"IFERROR((IF(ISNUMBER(SEARCH(\"2\", E$19)),E$77,\"0\")),\"0\")","v":"0"},"0","0","0",{"$f":"IFERROR(SUM($D114:INDIRECT($L114)),\"0\")","v":0},null,null,"H114",{"$f":"COUNTIF($D$20:INDIRECT($O114),\"*2*\")","v":0},8,"H20"]
[null,null,"CO3",{"$f":"IFERROR((IF(ISNUMBER(SEARCH(\"3\", D$19)),D$77,\"0\")),\"0\")","v":0},{"$f":"IFERROR((IF(ISNUMBER(SEARCH(\"3\", E$19)),E$77,\"0\")),\"0\")","v":0},"0","0","0",{"$f":"IFERROR(SUM($D115:INDIRECT($L115)),\"0\")","v":0},null,null,"H115",{"$f":"COUNTIF($D$20:INDIRECT($O115),\"*3*\")","v":0},8,"H20"]
[null,null,"CO4",{"$f":"IFERROR((IF(ISNUMBER(SEARCH(\"4\", D$19)),D$77,\"0\")),\"0\")","v":"0"},{"$f":"IFERROR((IF(ISNUMBER(SEARCH(\"4\", E$19)),E$77,\"0\")),\"0\")","v":"0"},0,0,"0",{"$f":"IFERROR(SUM($D116:INDIRECT($L116)),\"0\")","v":0},null,null,"H116",{"$f":"COUNTIF($D$20:INDIRECT($O116),\"*4*\")","v":0},8,"H20"]
[null,null,"CO5",{"$f":"IFERROR((IF(ISNUMBER(SEARCH(\"5\", D$19)),D$77,\"0\")),\"0\")","v":"0"},{"$f":"IFERROR((IF(ISNUMBER(SEARCH(\"5\", E$19)),E$77,\"0\")),\"0\")","v":"0"},"0","0",0,{"$f":"IFERROR(SUM($D117:INDIRECT($L117)),\"0\")","v":0},null,null,"H117",{"$f":"COUNTIF($D$20:INDIRECT($O117),\"*5*\")","v":0},8,"H20"]
[null,null,"CO6",{"$f":"IFERROR((IF(ISNUMBER(SEARCH(\"6\", D$19)),D$77,\"0\")),\"0\")","v":"0"},{"$f":"IFERROR((IF(ISNUMBER(SEARCH(\"6\", E$19)),E$77,\"0\")),\"0\")","v":"0"},"0","0","0",{"$f":"IFERROR(SUM($D118:INDIRECT($L118)),\"0\")","v":0},null,null,"H118",{"$f":"COUNTIF($D$20:INDIRECT($O118),\"*6*\")","v":0},8,"H20"]
[]
[null,null,"CO1",{"$f":"IFERROR((IF(ISNUMBER(SEARCH(\"1\", D$19)),D$78,\"0\")),\"0\")","v":"0"},{"$f":"IFERROR((IF(ISNUMBER(SEARCH(\"1\", E$19)),E$78,\"0\")),\"0\")","v":"0"},"0","0","0",{"$f":"IFERROR(SUM($D120:INDIRECT($L120)),\"0\")","v":0},null,null,{"$f":"SUBSTITUTE(ADDRESS(1,N120,4),1,\"\")&ROW($I120)","v":"H120"},{"$f":"COUNTIF($D$20:INDIRECT($O120),\"*1*\")","v":0},{"$f":"COLUMN($I$19)-1","v":8},{"$f":"SUBSTITUTE(ADDRESS(1,N120,4),1,\"\")&ROW($I$19)+1","v":"H20"},"Difficulty Level"]
[null,null,"CO2",{"$f":"IFERROR((IF(ISNUMBER(SEARCH(\"2\", D$19)),D$78,\"0\")),\"0\")","v":"0"},{"$f":"IFERROR((IF(ISNUMBER(SEARCH(\"2\", E$19)),E$78,\"0\")),\"0\")","v":"0"},"0","0","0",{"$f":"IFERROR(SUM($D121:INDIRECT($L121)),\"0\")","v":0},null,null,"H121",{"$f":"COUNTIF($D$20:INDIRECT($O121),\"*2*\")","v":0},8,"H20"]
[null,null,"CO3",{"$f":"IFERROR((IF(ISNUMBER(SEARCH(\"3\", D$19)),D$78,\"0\")),\"0\")","v":3},{"$f":"IFERROR((IF(ISNUMBER(SEARCH(\"3\", E$19)),E$78,\"0\")),\"0\")","v":3},"0","0","0",{"$f":"IFERROR(SUM($D122:INDIRECT($L122)),\"0\")","v":6},null,null,"H122",{"$f":"COUNTIF($D$20:INDIRECT($O122),\"*3*\")","v":0},8,"H20"]
[null,null,"CO4",{"$f":"IFERROR((IF(ISNUMBER(SEARCH(\"4\", D$19)),D$78,\"0\")),\"0\")","v":"0"},{"$f":"IFERROR((IF(ISNUMBER(SEARCH(\"4\", E$19)),E$78,\"0\")),\"0\")","v":"0"},3,3,"0",{"$f":"IFERROR(SUM($D123:INDIRECT($L123)),\"0\")","v":6},null,null,"H123",{"$f":"COUNTIF($D$20:INDIRECT($O123),\"*4*\")","v":0},8,"H20"]
[null,null,"CO5",{"$f":"IFERROR((IF(ISNUMBER(SEARCH(\"5\", D$19)),D$78,\"0\")),\"0\")","v":"0"},{"$f":"IFERROR((IF(ISNUMBER(SEARCH(\"5\", E$19)),E$78,\"0\")),\"0\")","v":"0"},"0","0",3,{"$f":"IFERROR(SUM($D124:INDIRECT($L124)),\"0\")","v":3},null,null,"H124",{"$f":"COUNTIF($D$20:INDIRECT($O124),\"*5*\")","v":0},8,"H20"]
[null,null,"CO6",{"$f":"IFERROR((IF(ISNUMBER(SEARCH(\"6\", D$19)),D$78,\"0\")),\"0\")","v":"0"},{"$f":"IFERROR((IF(ISNUMBER(SEARCH(\"6\", E$19)),E$78,\"0\")),\"0\")","v":"0"},"0","0","0",{"$f":"IFERROR(SUM($D125:INDIRECT($L125)),\"0\")","v":0},null,null,"H125",{"$f":"COUNTIF($D$20:INDIRECT($O125),\"*6*\")","v":0},8,"H20"]
[]
[null,null,"CO1",{"$f":"IFERROR((IF(ISNUMBER(SEARCH(\"1\", D$19)),D$79,\"0\")),\"0\")","v":"0"},{"$f":"IFERROR((IF(ISNUMBER(SEARCH(\"1\", E$19)),E$79,\"0\")),\"0\")","v":"0"},"0","0","0",{"$f":"IFERROR(SUM($D127:INDIRECT($L127)),\"0\")","v":0},null,null,{"$f":"SUBSTITUTE(ADDRESS(1,N127,4),1,\"\")&ROW($I127)","v":"H127"},{"$f":"COUNTIF($D$20:INDIRECT($O127),\"*1*\")","v":0},{"$f":"COLUMN($I$19)-1","v":8},{"$f":"SUBSTITUTE(ADDRESS(1,N127,4),1,\"\")&ROW($I$19)+1","v":"H20"},"No of Studdents Above Difficulty Level"]
[null,null,"CO2",{"$f":"IFERROR((IF(ISNUMBER(SEARCH(\"2\", D$19)),D$79,\"0\")),\"0\")","v":"0"},{"$f":"IFERROR((IF(ISNUMBER(SEARCH(\"2\", E$19)),E$79,\"0\")),\"0\")","v":"0"},"0","0","0",{"$f":"IFERROR(SUM($D128:INDIRECT($L128)),\"0\")","v":0},null,null,"H128",{"$f":"COUNTIF($D$20:INDIRECT($O128),\"*2*\")","v":0},8,"H20"]
[null,null,"CO3",{"$f":"IFERROR((IF(ISNUMBER(SEARCH(\"3\", D$19)),D$79,\"0\")),\"0\")","v":""},{"$f":"IFERROR((IF(ISNUMBER(SEARCH(\"3\", E$19)),E$79,\"0\")),\"0\")","v":""},"0","0","0",{"$f":"IFERROR(SUM($D129:INDIRECT($L129)),\"0\")","v":0},null,null,"H129",{"$f":"COUNTIF($D$20:INDIRECT($O129),\"*3*\")","v":0},8,"H20"]
[null,null,"CO4",{"$f":"IFERROR((IF(ISNUMBER(SEARCH(\"4\", D$19)),D$79,\"0\")),\"0\")","v":"0"},{"$f":"IFERROR((IF(ISNUMBER(SEARCH(\"4\", E$19)),E$79,\"0\")),\"0\")","v":"0"},"","","0",{"$f":"IFERROR(SUM($D130:INDIRECT($L130)),\"0\")","v":0},null,null,"H130",{"$f":"COUNTIF($D$20:INDIRECT($O130),\"*4*\")","v":0},8,"H20"]
[null,null,"CO5",{"$f":"IFERROR((IF(ISNUMBER(SEARCH(\"5\", D$19)),D$79,\"0\")),\"0\")","v":"0"},{"$f":"IFERROR((IF(ISNUMBER(SEARCH(\"5\", E$19)),E$79,\"0\")),\"0\")","v":"0"},"0","0","",{"$f":"IFERROR(SUM($D131:INDIRECT($L131)),\"0\")","v":0},null,null,"H131",{"$f":"COUNTIF($D$20:INDIRECT($O131),\"*5*\")","v":0},8,"H20"]
[null,null,"CO6",{"$f":"IFERROR((IF(ISNUMBER(SEARCH(\"6\", D$19)),D$79,\"0\")),\"0\")","v":"0"},{"$f":"IFERROR((IF(ISNUMBER(SEARCH(\"6\", E$19)),E$79,\"0\")),\"0\")","v":"0"},"0","0","0",{"$f":"IFERROR(SUM($D132:INDIRECT($L132)),\"0\")","v":0},null,null,"H132",{"$f":"COUNTIF($D$20:INDIRECT($O132),\"*6*\")","v":0},8,"H20"]
[]
[null,null,1,{"$f":"IFERROR((IF(ISNUMBER(SEARCH(\"1\", D$20)),D$21/IF(LEN(D20)=16,6,IF(LEN(D20)=13,5,IF(LEN(D20)=10,4,IF(LEN(D20)=7,3,IF(LEN(D20)=4,2,1))))),\"0\")),\"0\")","v":"0"},{"$f":"IFERROR((IF(ISNUMBER(SEARCH(\"1\", E$20)),E$21/IF(LEN(E20)=16,6,IF(LEN(E20)=13,5,IF(LEN(E20)=10,4,IF(LEN(E20)=7,3,IF(LEN(E20)=4,2,1))))),\"0\")),\"0\")","v":"0"},{"$f":"IFERROR((IF(ISNUMBER(SEARCH(\"1\", F$20)),F$21/IF(LEN(F20)=16,6,IF(LEN(F20)=13,5,IF(LEN(F20)=10,4,IF(LEN(F20)=7,3,IF(LEN(F20)=4,2,1))))),\"0\")),\"0\")","v":"0"},{"$f":"IFERROR((IF(ISNUMBER(SEARCH(\"1\", G$20)),G$21/IF(LEN(G20)=16,6,IF(LEN(G20)=13,5,IF(LEN(G20)=10,4,IF(LEN(G20)=7,3,IF(LEN(G20)=4,2,1))))),\"0\")),\"0\")","v":"0"},{"$f":"IFERROR((IF(ISNUMBER(SEARCH(\"1\", H$20)),H$21/IF(LEN(H20)=16,6,IF(LEN(H20)=13,5,IF(LEN(H20)=10,4,IF(LEN(H20)=7,3,IF(LEN(H20)=4,2,1))))),\"0\")),\"0\")","v":"0"},{"$f":"IFERROR(SUM($D134:INDIRECT($L134)),\"0\")","v":0},null,null,{"$f":"SUBSTITUTE(ADDRESS(1,N134,4),1,\"\")&ROW($I134)","v":"H134"},{"$f":"COUNTIF($D$20:INDIRECT($O134),\"1\")","v":0},{"$f":"COLUMN($I$18)-1","v":8},{"$f":"SUBSTITUTE(ADDRESS(1,N134,4),1,\"\")&ROW($I$19)+1","v":"H20"}]
[null,null,2,{"$f":"IFERROR((IF(ISNUMBER(SEARCH(\"2\", D$20)),D$21/IF(LEN(D20)=16,6,IF(LEN(D20)=13,5,IF(LEN(D20)=10,4,IF(LEN(D20)=7,3,IF(LEN(D20)=4,2,1))))),\"0\")),\"0\")","v":"0"},{"$f":"IFERROR((IF(ISNUMBER(SEARCH(\"2\", E$20)),E$21/IF(LEN(E20)=16,6,IF(LEN(E20)=13,5,IF(LEN(E20)=10,4,IF(LEN(E20)=7,3,IF(LEN(E20)=4,2,1))))),\"0\")),\"0\")","v":"0"},{"$f":"IFERROR((IF(ISNUMBER(SEARCH(\"2\", F$20)),F$21/IF(LEN(F20)=16,6,IF(LEN(F20)=13,5,IF(LEN(F20)=10,4,IF(LEN(F20)=7,3,IF(LEN(F20)=4,2,1))))),\"0\")),\"0\")","v":"0"},{"$f":"IFERROR((IF(ISNUMBER(SEARCH(\"2\", G$20)),G$21/IF(LEN(G20)=16,6,IF(LEN(G20)=13,5,IF(LEN(G20)=10,4,IF(LEN(G20)=7,3,IF(LEN(G20)=4,2,1))))),\"0\")),\"0\")","v":"0"},{"$f":"IFERROR((IF(ISNUMBER(SEARCH(\"2\", H$20)),H$21/IF(LEN(H20)=16,6,IF(LEN(H20)=13,5,IF(LEN(H20)=10,4,IF(LEN(H20)=7,3,IF(LEN(H20)=4,2,1))))),\"0\")),\"0\")","v":"0"},{"$f":"IFERROR(SUM($D135:INDIRECT($L135)),\"0\")","v":0},null,null,{"$f":"SUBSTITUTE(ADDRESS(1,N135,4),1,\"\")&ROW($I135)","v":"H135"},{"$f":"COUNTIF($D$20:INDIRECT($O135),\"2\")","v":0},8,"H20"]
[null,null,3,{"$f":"IFERROR((IF(ISNUMBER(SEARCH(\"3\", D$20)),D$21/IF(LEN(D20)=16,6,IF(LEN(D20)=13,5,IF(LEN(D20)=10,4,IF(LEN(D20)=7,3,IF(LEN(D20)=4,2,1))))),\"0\")),\"0\")","v":"0"},{"$f":"IFERROR((IF(ISNUMBER(SEARCH(\"3\", E$20)),E$21/IF(LEN(E20)=16,6,IF(LEN(E20)=13,5,IF(LEN(E20)=10,4,IF(LEN(E20)=7,3,IF(LEN(E20)=4,2,1))))),\"0\")),\"0\")","v":"0"},{"$f":"IFERROR((IF(ISNUMBER(SEARCH(\"3\", F$20)),F$21/IF(LEN(F20)=16,6,IF(LEN(F20)=13,5,IF(LEN(F20)=10,4,IF(LEN(F20)=7,3,IF(LEN(F20)=4,2,1))))),\"0\")),\"0\")","v":"0"},{"$f":"IFERROR((IF(ISNUMBER(SEARCH(\"3\", G$20)),G$21/IF(LEN(G20)=16,6,IF(LEN(G20)=13,5,IF(LEN(G20)=10,4,IF(LEN(G20)=7,3,IF(LEN(G20)=4,2,1))))),\"0\")),\"0\")","v":"0"},{"$f":"IFERROR((IF(ISNUMBER(SEARCH(\"3\", H$20)),H$21/IF(LEN(H20)=16,6,IF(LEN(H20)=13,5,IF(LEN(H20)=10,4,IF(LEN(H20)=7,3,IF(LEN(H20)=4,2,1))))),\"0\")),\"0\")","v":"0"},{"$f":"IFERROR(SUM($D136:INDIRECT($L136)),\"0\")","v":0},null,null,"H136",{"$f":"COUNTIF($D$20:INDIRECT($O136),\"3\")","v":0},8,"H20"]
[null,null,4,{"$f":"IFERROR((IF(ISNUMBER(SEARCH(\"4\", D$20)),D$21/IF(LEN(D20)=16,6,IF(LEN(D20)=13,5,IF(LEN(D20)=10,4,IF(LEN(D20)=7,3,IF(LEN(D20)=4,2,1))))),\"0\")),\"0\")","v":"0"},{"$f":"IFERROR((IF(ISNUMBER(SEARCH(\"4\", E$20)),E$21/IF(LEN(E20)=16,6,IF(LEN(E20)=13,5,IF(LEN(E20)=10,4,IF(LEN(E20)=7,3,IF(LEN(E20)=4,2,1))))),\"0\")),\"0\")","v":"0"},{"$f":"IFERROR((IF(ISNUMBER(SEARCH(\"4\", F$20)),F$21/IF(LEN(F20)=16,6,IF(LEN(F20)=13,5,IF(LEN(F20)=10,4,IF(LEN(F20)=7,3,IF(LEN(F20)=4,2,1))))),\"0\")),\"0\")","v":"0"},{"$f":"IFERROR((IF(ISNUMBER(SEARCH(\"4\", G$20)),G$21/IF(LEN(G20)=16,6,IF(LEN(G20)=13,5,IF(LEN(G20)=10,4,IF(LEN(G20)=7,3,IF(LEN(G20)=4,2,1))))),\"0\")),\"0\")","v":"0"},{"$f":"IFERROR((IF(ISNUMBER(SEARCH(\"4\", H$20)),H$21/IF(LEN(H20)=16,6,IF(LEN(H20)=13,5,IF(LEN(H20)=10,4,IF(LEN(H20)=7,3,IF(LEN(H20)=4,2,1))))),\"0\")),\"0\")","v":"0"},{"$f":"IFERROR(SUM($D137:INDIRECT($L137)),\"0\")","v":0},null,null,"H137",{"$f":"COUNTIF($D$20:INDIRECT($O137),\"4\")","v":0},8,"H20"]
[null,null,5,{"$f":"IFERROR((IF(ISNUMBER(SEARCH(\"5\", D$20)),D$21/IF(LEN(D20)=16,6,IF(LEN(D20)=13,5,IF(LEN(D20)=10,4,IF(LEN(D20)=7,3,IF(LEN(D20)=4,2,1))))),\"0\")),\"0\")","v":5},{"$f":"IFERROR((IF(ISNUMBER(SEARCH(\"5\", E$20)),E$21/IF(LEN(E20)=16,6,IF(LEN(E20)=13,5,IF(LEN(E20)=10,4,IF(LEN(E20)=7,3,IF(LEN(E20)=4,2,1))))),\"0\")),\"0\")","v":5},{"$f":"IFERROR((IF(ISNUMBER(SEARCH(\"5\", F$20)),F$21/IF(LEN(F20)=16,6,IF(LEN(F20)=13,5,IF(LEN(F20)=10,4,IF(LEN(F20)=7,3,IF(LEN(F20)=4,2,1))))),\"0\")),\"0\")","v":5},{"$f":"IFERROR((IF(ISNUMBER(SEARCH(\"5\", G$20)),G$21/IF(LEN(G20)=16,6,IF(LEN(G20)=13,5,IF(LEN(G20)=10,4,IF(LEN(G20)=7,3,IF(LEN(G20)=4,2,1))))),\"0\")),\"0\")","v":"0"},{"$f":"IFERROR((IF(ISNUMBER(SEARCH(\"5\", H$20)),H$21/IF(LEN(H20)=16,6,IF(LEN(H20)=13,5,IF(LEN(H20)=10,4,IF(LEN(H20)=7,3,IF(LEN(H20)=4,2,1))))),\"0\")),\"0\")","v":"0"},{"$f":"IFERROR(SUM($D138:INDIRECT($L138)),\"0\")","v":15},null,null,"H138",{"$f":"COUNTIF($D$20:INDIRECT($O138),\"5\")","v":3},8,"H20"]
[null,null,6,{"$f":"IFERROR((IF(ISNUMBER(SEARCH(\"6\", D$20)),D$21/IF(LEN(D20)=16,6,IF(LEN(D20)=13,5,IF(LEN(D20)=10,4,IF(LEN(D20)=7,3,IF(LEN(D20)=4,2,1))))),\"0\")),\"0\")","v":"0"},{"$f":"IFERROR((IF(ISNUMBER(SEARCH(\"6\", E$20)),E$21/IF(LEN(E20)=16,6,IF(LEN(E20)=13,5,IF(LEN(E20)=10,4,IF(LEN(E20)=7,3,IF(LEN(E20)=4,2,1))))),\"0\")),\"0\")","v":"0"},{"$f":"IFERROR((IF(ISNUMBER(SEARCH(\"6\", F$20)),F$21/IF(LEN(F20)=16,6,IF(LEN(F20)=13,5,IF(LEN(F20)=10,4,IF(LEN(F20)=7,3,IF(LEN(F20)=4,2,1))))),\"0\")),\"0\")","v":"0"},{"$f":"IFERROR((IF(ISNUMBER(SEARCH(\"6\", G$20)),G$21/IF(LEN(G20)=16,6,IF(LEN(G20)=13,5,IF(LEN(G20)=10,4,IF(LEN(G20)=7,3,IF(LEN(G20)=4,2,1))))),\"0\")),\"0\")","v":5},{"$f":"IFERROR((IF(ISNUMBER(SEARCH(\"6\", H$20)),H$21/IF(LEN(H20)=16,6,IF(LEN(H20)=13,5,IF(LEN(H20)=10,4,IF(LEN(H20)=7,3,IF(LEN(H20)=4,2,1))))),\"0\")),\"0\")","v":5},{"$f":"IFERROR(SUM($D139:INDIRECT($L139)),\"0\")","v":10},null,null,"H139",{"$f":"COUNTIF($D$20:INDIRECT($O139),\"6\")","v":2},8,"H20"]

{"sheet":"T3_Analysis","index":7,"n_rows":89,"n_cols":5,"rows_kept":89,"cut":false,"hidden":false,"merged":[[2,0,2,3],[4,0,4,3],[6,0,6,3],[8,0,8,3]]}
[]
[]
[{"$f":"Data_Sheet!A2","v":"Jyothi Engineering College, Cheruthuruthy"}]
[]
[{"$f":"Data_Sheet!A4","v":"Department of Electrical & Electronics Engineering"}]
[]
[{"$f":"'T3'!A11","v":"CO Analysis - Internal Marks : Retest                       14-03-18"}]
[]
[{"$f":"Data_Sheet!A17","v":"S7 EC              EC407 Computer Communication               2019-20"}]
[]
[]
[]
[]
[]
[]
[]
[]
[]
[]
[]
[]
[{"$f":"'T1'!A18","v":"Register No."},{"$f":"'T1'!B18","v":"Name of Student"},{"$f":"'T3'!I18","v":"Total Marks (50)"},"Category"]
[]
["Column1","Column2","Column3","Column4"]
[{"$f":"Data_Sheet!A25","v":"JEC16EC051"},{"$f":"Data_Sheet!B25","v":"LANA KOLLATH"},{"$f":"'T3'!I25","v":0},{"$f":"IF(C25=\"A\",\"ABSENT\",IF(C25>='T3'!$F$5*$E$82/100,\"EXCELLENT\",IF(C25>='T3'!$F$5*$E$81/100,\"GOOD\",IF(C25>='T3'!$F$5*$E$80/100,\"AVERAGE\",\"POOR\"))))","v":"POOR"}]
[{"$f":"Data_Sheet!A26","v":"JEC16EC052"},{"$f":"Data_Sheet!B26","v":"MANU JENSON"},{"$f":"'T3'!I26","v":0},{"$f":"IF(C26=\"A\",\"ABSENT\",IF(C26>='T3'!$F$5*$E$82/100,\"EXCELLENT\",IF(C26>='T3'!$F$5*$E$81/100,\"GOOD\",IF(C26>='T3'!$F$5*$E$80/100,\"AVERAGE\",\"POOR\"))))","v":"POOR"}]
[{"$f":"Data_Sheet!A27","v":"JEC16EC053"},{"$f":"Data_Sheet!B27","v":"MAREENA MARIYA ABRAHAM"},{"$f":"'T3'!I27","v":0},{"$f":"IF(C27=\"A\",\"ABSENT\",IF(C27>='T3'!$F$5*$E$82/100,\"EXCELLENT\",IF(C27>='T3'!$F$5*$E$81/100,\"GOOD\",IF(C27>='T3'!$F$5*$E$80/100,\"AVERAGE\",\"POOR\"))))","v":"POOR"}]
[{"$f":"Data_Sheet!A28","v":"JEC16EC054"},{"$f":"Data_Sheet!B28","v":"MARIAN DAVIS KATTUKARAN"},{"$f":"'T3'!I28","v":0},{"$f":"IF(C28=\"A\",\"ABSENT\",IF(C28>='T3'!$F$5*$E$82/100,\"EXCELLENT\",IF(C28>='T3'!$F$5*$E$81/100,\"GOOD\",IF(C28>='T3'!$F$5*$E$80/100,\"AVERAGE\",\"POOR\"))))","v":"POOR"}]
[{"$f":"Data_Sheet!A29","v":"JEC16EC055"},{"$f":"Data_Sheet!B29","v":"MARY JEETHU A J"},{"$f":"'T3'!I29","v":0},{"$f":"IF(C29=\"A\",\"ABSENT\",IF(C29>='T3'!$F$5*$E$82/100,\"EXCELLENT\",IF(C29>='T3'!$F$5*$E$81/100,\"GOOD\",IF(C29>='T3'!$F$5*$E$80/100,\"AVERAGE\",\"POOR\"))))","v":"POOR"}]
[{"$f":"Data_Sheet!A30","v":"JEC16EC056"},{"$f":"Data_Sheet!B30","v":"MUBASHIRA K M"},{"$f":"'T3'!I30","v":0},{"$f":"IF(C30=\"A\",\"ABSENT\",IF(C30>='T3'!$F$5*$E$82/100,\"EXCELLENT\",IF(C30>='T3'!$F$5*$E$81/100,\"GOOD\",IF(C30>='T3'!$F$5*$E$80/100,\"AVERAGE\",\"POOR\"))))","v":"POOR"}]
[{"$f":"Data_Sheet!A31","v":"JEC16EC057"},{"$f":"Data_Sheet!B31","v":"MUHAMMED ARSHAD"},{"$f":"'T3'!I31","v":0},{"$f":"IF(C31=\"A\",\"ABSENT\",IF(C31>='T3'!$F$5*$E$82/100,\"EXCELLENT\",IF(C31>='T3'!$F$5*$E$81/100,\"GOOD\",IF(C31>='T3'!$F$5*$E$80/100,\"AVERAGE\",\"POOR\"))))","v":"POOR"}]
[{"$f":"Data_Sheet!A32","v":"JEC16EC058"},{"$f":"Data_Sheet!B32","v":"NANDANA K"},{"$f":"'T3'!I32","v":0},{"$f":"IF(C32=\"A\",\"ABSENT\",IF(C32>='T3'!$F$5*$E$82/100,\"EXCELLENT\",IF(C32>='T3'!$F$5*$E$81/100,\"GOOD\",IF(C32>='T3'!$F$5*$E$80/100,\"AVERAGE\",\"POOR\"))))","v":"POOR"}]
[{"$f":"Data_Sheet!A33","v":"JEC16EC059"},{"$f":"Data_Sheet!B33","v":"NARAYANAN M B"},{"$f":"'T3'!I33","v":0},{"$f":"IF(C33=\"A\",\"ABSENT\",IF(C33>='T3'!$F$5*$E$82/100,\"EXCELLENT\",IF(C33>='T3'!$F$5*$E$81/100,\"GOOD\",IF(C33>='T3'!$F$5*$E$80/100,\"AVERAGE\",\"POOR\"))))","v":"POOR"}]
[{"$f":"Data_Sheet!A34","v":"JEC16EC061"},{"$f":"Data_Sheet!B34","v":"NIKHIL KJ"},{"$f":"'T3'!I34","v":0},{"$f":"IF(C34=\"A\",\"ABSENT\",IF(C34>='T3'!$F$5*$E$82/100,\"EXCELLENT\",IF(C34>='T3'!$F$5*$E$81/100,\"GOOD\",IF(C34>='T3'!$F$5*$E$80/100,\"AVERAGE\",\"POOR\"))))","v":"POOR"}]
[{"$f":"Data_Sheet!A35","v":"JEC16EC062"},{"$f":"Data_Sheet!B35","v":"NIMISHA M S"},{"$f":"'T3'!I35","v":0},{"$f":"IF(C35=\"A\",\"ABSENT\",IF(C35>='T3'!$F$5*$E$82/100,\"EXCELLENT\",IF(C35>='T3'!$F$5*$E$81/100,\"GOOD\",IF(C35>='T3'!$F$5*$E$80/100,\"AVERAGE\",\"POOR\"))))","v":"POOR"}]
[{"$f":"Data_Sheet!A36","v":"JEC16EC063"},{"$f":"Data_Sheet!B36","v":"NIMISHA TONY"},{"$f":"'T3'!I36","v":0},{"$f":"IF(C36=\"A\",\"ABSENT\",IF(C36>='T3'!$F$5*$E$82/100,\"EXCELLENT\",IF(C36>='T3'!$F$5*$E$81/100,\"GOOD\",IF(C36>='T3'!$F$5*$E$80/100,\"AVERAGE\",\"POOR\"))))","v":"POOR"}]
[{"$f":"Data_Sheet!A37","v":"JEC16EC064"},{"$f":"Data_Sheet!B37","v":"NITHIN"},{"$f":"'T3'!I37","v":0},{"$f":"IF(C37=\"A\",\"ABSENT\",IF(C37>='T3'!$F$5*$E$82/100,\"EXCELLENT\",IF(C37>='T3'!$F$5*$E$81/100,\"GOOD\",IF(C37>='T3'!$F$5*$E$80/100,\"AVERAGE\",\"POOR\"))))","v":"POOR"}]
[{"$f":"Data_Sheet!A38","v":"JEC16EC065"},{"$f":"Data_Sheet!B38","v":"OLIVIA NELSON"},{"$f":"'T3'!I38","v":0},{"$f":"IF(C38=\"A\",\"ABSENT\",IF(C38>='T3'!$F$5*$E$82/100,\"EXCELLENT\",IF(C38>='T3'!$F$5*$E$81/100,\"GOOD\",IF(C38>='T3'!$F$5*$E$80/100,\"AVERAGE\",\"POOR\"))))","v":"POOR"}]
[{"$f":"Data_Sheet!A39","v":"JEC16EC066"},{"$f":"Data_Sheet!B39","v":"PAVITHRA.P"},{"$f":"'T3'!I39","v":0},{"$f":"IF(C39=\"A\",\"ABSENT\",IF(C39>='T3'!$F$5*$E$82/100,\"EXCELLENT\",IF(C39>='T3'!$F$5*$E$81/100,\"GOOD\",IF(C39>='T3'!$F$5*$E$80/100,\"AVERAGE\",\"POOR\"))))","v":"POOR"}]
[{"$f":"Data_Sheet!A40","v":"JEC16EC067"},{"$f":"Data_Sheet!B40","v":"P.DHANYA RAJ"},{"$f":"'T3'!I40","v":0},{"$f":"IF(C40=\"A\",\"ABSENT\",IF(C40>='T3'!$F$5*$E$82/100,\"EXCELLENT\",IF(C40>='T3'!$F$5*$E$81/100,\"GOOD\",IF(C40>='T3'!$F$5*$E$80/100,\"AVERAGE\",\"POOR\"))))","v":"POOR"}]
[{"$f":"Data_Sheet!A41","v":"JEC16EC068"},{"$f":"Data_Sheet!B41","v":"POOJA.P"},{"$f":"'T3'!I41","v":0},{"$f":"IF(C41=\"A\",\"ABSENT\",IF(C41>='T3'!$F$5*$E$82/100,\"EXCELLENT\",IF(C41>='T3'!$F$5*$E$81/100,\"GOOD\",IF(C41>='T3'!$F$5*$E$80/100,\"AVERAGE\",\"POOR\"))))","v":"POOR"}]
[{"$f":"Data_Sheet!A42","v":"JEC16EC069"},{"$f":"Data_Sheet!B42","v":"PRANAV"},{"$f":"'T3'!I42","v":0},{"$f":"IF(C42=\"A\",\"ABSENT\",IF(C42>='T3'!$F$5*$E$82/100,\"EXCELLENT\",IF(C42>='T3'!$F$5*$E$81/100,\"GOOD\",IF(C42>='T3'!$F$5*$E$80/100,\"AVERAGE\",\"POOR\"))))","v":"POOR"}]
[{"$f":"Data_Sheet!A43","v":"JEC16EC070"},{"$f":"Data_Sheet!B43","v":"PRASOBH KP"},{"$f":"'T3'!I43","v":0},{"$f":"IF(C43=\"A\",\"ABSENT\",IF(C43>='T3'!$F$5*$E$82/100,\"EXCELLENT\",IF(C43>='T3'!$F$5*$E$81/100,\"GOOD\",IF(C43>='T3'!$F$5*$E$80/100,\"AVERAGE\",\"POOR\"))))","v":"POOR"}]
[{"$f":"Data_Sheet!A44","v":"JEC16EC071"},{"$f":"Data_Sheet!B44","v":"PRINCE BENNY"},{"$f":"'T3'!I44","v":0},{"$f":"IF(C44=\"A\",\"ABSENT\",IF(C44>='T3'!$F$5*$E$82/100,\"EXCELLENT\",IF(C44>='T3'!$F$5*$E$81/100,\"GOOD\",IF(C44>='T3'!$F$5*$E$80/100,\"AVERAGE\",\"POOR\"))))","v":"POOR"}]
[{"$f":"Data_Sheet!A45","v":"JEC16EC072"},{"$f":"Data_Sheet!B45","v":"PRIYA.K"},{"$f":"'T3'!I45","v":0},{"$f":"IF(C45=\"A\",\"ABSENT\",IF(C45>='T3'!$F$5*$E$82/100,\"EXCELLENT\",IF(C45>='T3'!$F$5*$E$81/100,\"GOOD\",IF(C45>='T3'!$F$5*$E$80/100,\"AVERAGE\",\"POOR\"))))","v":"POOR"}]
[{"$f":"Data_Sheet!A46","v":"JEC16EC073"},{"$f":"Data_Sheet!B46","v":"RADHIKA"},{"$f":"'T3'!I46","v":0},{"$f":"IF(C46=\"A\",\"ABSENT\",IF(C46>='T3'!$F$5*$E$82/100,\"EXCELLENT\",IF(C46>='T3'!$F$5*$E$81/100,\"GOOD\",IF(C46>='T3'!$F$5*$E$80/100,\"AVERAGE\",\"POOR\"))))","v":"POOR"}]
[{"$f":"Data_Sheet!A47","v":"JEC16EC074"},{"$f":"Data_Sheet!B47","v":"RINOSHA.K.R"},{"$f":"'T3'!I47","v":0},{"$f":"IF(C47=\"A\",\"ABSENT\",IF(C47>='T3'!$F$5*$E$82/100,\"EXCELLENT\",IF(C47>='T3'!$F$5*$E$81/100,\"GOOD\",IF(C47>='T3'!$F$5*$E$80/100,\"AVERAGE\",\"POOR\"))))","v":"POOR"}]
[{"$f":"Data_Sheet!A48","v":"JEC16EC075"},{"$f":"Data_Sheet!B48","v":"RIYA ALBERT"},{"$f":"'T3'!I48","v":0},{"$f":"IF(C48=\"A\",\"ABSENT\",IF(C48>='T3'!$F$5*$E$82/100,\"EXCELLENT\",IF(C48>='T3'!$F$5*$E$81/100,\"GOOD\",IF(C48>='T3'!$F$5*$E$80/100,\"AVERAGE\",\"POOR\"))))","v":"POOR"}]
[{"$f":"Data_Sheet!A49","v":"JEC16EC076"},{"$f":"Data_Sheet!B49","v":"RIYA PS"},{"$f":"'T3'!I49","v":0},{"$f":"IF(C49=\"A\",\"ABSENT\",IF(C49>='T3'!$F$5*$E$82/100,\"EXCELLENT\",IF(C49>='T3'!$F$5*$E$81/100,\"GOOD\",IF(C49>='T3'!$F$5*$E$80/100,\"AVERAGE\",\"POOR\"))))","v":"POOR"}]
[{"$f":"Data_Sheet!A50","v":"JEC16EC077"},{"$f":"Data_Sheet!B50","v":"ROSHNI J NAIR"},{"$f":"'T3'!I50","v":0},{"$f":"IF(C50=\"A\",\"ABSENT\",IF(C50>='T3'!$F$5*$E$82/100,\"EXCELLENT\",IF(C50>='T3'!$F$5*$E$81/100,\"GOOD\",IF(C50>='T3'!$F$5*$E$80/100,\"AVERAGE\",\"POOR\"))))","v":"POOR"}]
[{"$f":"Data_Sheet!A51","v":"JEC16EC079"},{"$f":"Data_Sheet!B51","v":"SAFNA M"},{"$f":"'T3'!I51","v":0},{"$f":"IF(C51=\"A\",\"ABSENT\",IF(C51>='T3'!$F$5*$E$82/100,\"EXCELLENT\",IF(C51>='T3'!$F$5*$E$81/100,\"GOOD\",IF(C51>='T3'!$F$5*$E$80/100,\"AVERAGE\",\"POOR\"))))","v":"POOR"}]
[{"$f":"Data_Sheet!A52","v":"JEC16EC080"},{"$f":"Data_Sheet!B52","v":"SAJIN SHAJI"},{"$f":"'T3'!I52","v":0},{"$f":"IF(C52=\"A\",\"ABSENT\",IF(C52>='T3'!$F$5*$E$82/100,\"EXCELLENT\",IF(C52>='T3'!$F$5*$E$81/100,\"GOOD\",IF(C52>='T3'!$F$5*$E$80/100,\"AVERAGE\",\"POOR\"))))","v":"POOR"}]
[{"$f":"Data_Sheet!A53","v":"JEC16EC081"},{"$f":"Data_Sheet!B53","v":"SANDHRA .S"},{"$f":"'T3'!I53","v":0},{"$f":"IF(C53=\"A\",\"ABSENT\",IF(C53>='T3'!$F$5*$E$82/100,\"EXCELLENT\",IF(C53>='T3'!$F$5*$E$81/100,\"GOOD\",IF(C53>='T3'!$F$5*$E$80/100,\"AVERAGE\",\"POOR\"))))","v":"POOR"}]
[{"$f":"Data_Sheet!A54","v":"JEC16EC082"},{"$f":"Data_Sheet!B54","v":"SANGAMITHRA"},{"$f":"'T3'!I54","v":0},{"$f":"IF(C54=\"A\",\"ABSENT\",IF(C54>='T3'!$F$5*$E$82/100,\"EXCELLENT\",IF(C54>='T3'!$F$5*$E$81/100,\"GOOD\",IF(C54>='T3'!$F$5*$E$80/100,\"AVERAGE\",\"POOR\"))))","v":"POOR"}]
[{"$f":"Data_Sheet!A55","v":"JEC16EC083"},{"$f":"Data_Sheet!B55","v":"SARANYA.M.NAIR"},{"$f":"'T3'!I55","v":0},{"$f":"IF(C55=\"A\",\"ABSENT\",IF(C55>='T3'!$F$5*$E$82/100,\"EXCELLENT\",IF(C55>='T3'!$F$5*$E$81/100,\"GOOD\",IF(C55>='T3'!$F$5*$E$80/100,\"AVERAGE\",\"POOR\"))))","v":"POOR"}]
[{"$f":"Data_Sheet!A56","v":"JEC16EC084"},{"$f":"Data_Sheet!B56","v":"SARATHRAJ"},{"$f":"'T3'!I56","v":0},{"$f":"IF(C56=\"A\",\"ABSENT\",IF(C56>='T3'!$F$5*$E$82/100,\"EXCELLENT\",IF(C56>='T3'!$F$5*$E$81/100,\"GOOD\",IF(C56>='T3'!$F$5*$E$80/100,\"AVERAGE\",\"POOR\"))))","v":"POOR"}]
[{"$f":"Data_Sheet!A57","v":"JEC16EC085"},{"$f":"Data_Sheet!B57","v":"SHAHAN FATHIMA K"},{"$f":"'T3'!I57","v":0},{"$f":"IF(C57=\"A\",\"ABSENT\",IF(C57>='T3'!$F$5*$E$82/100,\"EXCELLENT\",IF(C57>='T3'!$F$5*$E$81/100,\"GOOD\",IF(C57>='T3'!$F$5*$E$80/100,\"AVERAGE\",\"POOR\"))))","v":"POOR"}]
[{"$f":"Data_Sheet!A58","v":"JEC16EC086"},{"$f":"Data_Sheet!B58","v":"SHAHLA.P.MOHAMMED"},{"$f":"'T3'!I58","v":0},{"$f":"IF(C58=\"A\",\"ABSENT\",IF(C58>='T3'!$F$5*$E$82/100,\"EXCELLENT\",IF(C58>='T3'!$F$5*$E$81/100,\"GOOD\",IF(C58>='T3'!$F$5*$E$80/100,\"AVERAGE\",\"POOR\"))))","v":"POOR"}]
[{"$f":"Data_Sheet!A59","v":"JEC16EC087"},{"$f":"Data_Sheet!B59","v":"SHAMSEENA T A"},{"$f":"'T3'!I59","v":0},{"$f":"IF(C59=\"A\",\"ABSENT\",IF(C59>='T3'!$F$5*$E$82/100,\"EXCELLENT\",IF(C59>='T3'!$F$5*$E$81/100,\"GOOD\",IF(C59>='T3'!$F$5*$E$80/100,\"AVERAGE\",\"POOR\"))))","v":"POOR"}]
[{"$f":"Data_Sheet!A60","v":"JEC16EC088"},{"$f":"Data_Sheet!B60","v":"SHARAN SHASHINDRAN A"},{"$f":"'T3'!I60","v":0},{"$f":"IF(C60=\"A\",\"ABSENT\",IF(C60>='T3'!$F$5*$E$82/100,\"EXCELLENT\",IF(C60>='T3'!$F$5*$E$81/100,\"GOOD\",IF(C60>='T3'!$F$5*$E$80/100,\"AVERAGE\",\"POOR\"))))","v":"POOR"}]
[{"$f":"Data_Sheet!A61","v":"JEC16EC089"},{"$f":"Data_Sheet!B61","v":"SIBIN KRISHNA C"},{"$f":"'T3'!I61","v":0},{"$f":"IF(C61=\"A\",\"ABSENT\",IF(C61>='T3'!$F$5*$E$82/100,\"EXCELLENT\",IF(C61>='T3'!$F$5*$E$81/100,\"GOOD\",IF(C61>='T3'!$F$5*$E$80/100,\"AVERAGE\",\"POOR\"))))","v":"POOR"}]
[{"$f":"Data_Sheet!A62","v":"JEC16EC090"},{"$f":"Data_Sheet!B62","v":"SREEJITH VIJAYAKUMAR"},{"$f":"'T3'!I62","v":0},{"$f":"IF(C62=\"A\",\"ABSENT\",IF(C62>='T3'!$F$5*$E$82/100,\"EXCELLENT\",IF(C62>='T3'!$F$5*$E$81/100,\"GOOD\",IF(C62>='T3'!$F$5*$E$80/100,\"AVERAGE\",\"POOR\"))))","v":"POOR"}]
[{"$f":"Data_Sheet!A63","v":"JEC16EC091"},{"$f":"Data_Sheet!B63","v":"SREELAKSHMI.R"},{"$f":"'T3'!I63","v":0},{"$f":"IF(C63=\"A\",\"ABSENT\",IF(C63>='T3'!$F$5*$E$82/100,\"EXCELLENT\",IF(C63>='T3'!$F$5*$E$81/100,\"GOOD\",IF(C63>='T3'!$F$5*$E$80/100,\"AVERAGE\",\"POOR\"))))","v":"POOR"}]
[{"$f":"Data_Sheet!A64","v":"JEC16EC092"},{"$f":"Data_Sheet!B64","v":"SREERAG K M"},{"$f":"'T3'!I64","v":0},{"$f":"IF(C64=\"A\",\"ABSENT\",IF(C64>='T3'!$F$5*$E$82/100,\"EXCELLENT\",IF(C64>='T3'!$F$5*$E$81/100,\"GOOD\",IF(C64>='T3'!$F$5*$E$80/100,\"AVERAGE\",\"POOR\"))))","v":"POOR"}]
[{"$f":"Data_Sheet!A65","v":"JEC16EC093"},{"$f":"Data_Sheet!B65","v":"SREERAG T K"},{"$f":"'T3'!I65","v":0},{"$f":"IF(C65=\"A\",\"ABSENT\",IF(C65>='T3'!$F$5*$E$82/100,\"EXCELLENT\",IF(C65>='T3'!$F$5*$E$81/100,\"GOOD\",IF(C65>='T3'!$F$5*$E$80/100,\"AVERAGE\",\"POOR\"))))","v":"POOR"}]
[{"$f":"Data_Sheet!A66","v":"JEC16EC094"},{"$f":"Data_Sheet!B66","v":"SREERAG V.V"},{"$f":"'T3'!I66","v":0},{"$f":"IF(C66=\"A\",\"ABSENT\",IF(C66>='T3'!$F$5*$E$82/100,\"EXCELLENT\",IF(C66>='T3'!$F$5*$E$81/100,\"GOOD\",IF(C66>='T3'!$F$5*$E$80/100,\"AVERAGE\",\"POOR\"))))","v":"POOR"}]
[{"$f":"Data_Sheet!A67","v":"JEC16EC095"},{"$f":"Data_Sheet!B67","v":"SRUTHIMOL.N.T"},{"$f":"'T3'!I67","v":0},{"$f":"IF(C67=\"A\",\"ABSENT\",IF(C67>='T3'!$F$5*$E$82/100,\"EXCELLENT\",IF(C67>='T3'!$F$5*$E$81/100,\"GOOD\",IF(C67>='T3'!$F$5*$E$80/100,\"AVERAGE\",\"POOR\"))))","v":"POOR"}]
[{"$f":"Data_Sheet!A68","v":"JEC16EC096"},{"$f":"Data_Sheet!B68","v":"SRUTHISHA SASI"},{"$f":"'T3'!I68","v":0},{"$f":"IF(C68=\"A\",\"ABSENT\",IF(C68>='T3'!$F$5*$E$82/100,\"EXCELLENT\",IF(C68>='T3'!$F$5*$E$81/100,\"GOOD\",IF(C68>='T3'!$F$5*$E$80/100,\"AVERAGE\",\"POOR\"))))","v":"POOR"}]
[{"$f":"Data_Sheet!A69","v":"JEC16EC097"},{"$f":"Data_Sheet!B69","v":"SUCHITHRA.TS"},{"$f":"'T3'!I69","v":0},{"$f":"IF(C69=\"A\",\"ABSENT\",IF(C69>='T3'!$F$5*$E$82/100,\"EXCELLENT\",IF(C69>='T3'!$F$5*$E$81/100,\"GOOD\",IF(C69>='T3'!$F$5*$E$80/100,\"AVERAGE\",\"POOR\"))))","v":"POOR"}]
[{"$f":"Data_Sheet!A70","v":"JEC16EC098"},{"$f":"Data_Sheet!B70","v":"SWETHA SARA GEORGE"},{"$f":"'T3'!I70","v":0},{"$f":"IF(C70=\"A\",\"ABSENT\",IF(C70>='T3'!$F$5*$E$82/100,\"EXCELLENT\",IF(C70>='T3'!$F$5*$E$81/100,\"GOOD\",IF(C70>='T3'!$F$5*$E$80/100,\"AVERAGE\",\"POOR\"))))","v":"POOR"}]
[{"$f":"Data_Sheet!A71","v":"JEC16EC099"},{"$f":"Data_Sheet!B71","v":"VISHNU K"},{"$f":"'T3'!I71","v":0},{"$f":"IF(C71=\"A\",\"ABSENT\",IF(C71>='T3'!$F$5*$E$82/100,\"EXCELLENT\",IF(C71>='T3'!$F$5*$E$81/100,\"GOOD\",IF(C71>='T3'!$F$5*$E$80/100,\"AVERAGE\",\"POOR\"))))","v":"POOR"}]
[{"$f":"Data_Sheet!A72","v":"JEC16EC100"},{"$f":"Data_Sheet!B72","v":"VISHNU PRAKASH"},{"$f":"'T3'!I72","v":0},{"$f":"IF(C72=\"A\",\"ABSENT\",IF(C72>='T3'!$F$5*$E$82/100,\"EXCELLENT\",IF(C72>='T3'!$F$5*$E$81/100,\"GOOD\",IF(C72>='T3'!$F$5*$E$80/100,\"AVERAGE\",\"POOR\"))))","v":"POOR"}]
[{"$f":"Data_Sheet!A73","v":"JEC16EC101"},{"$f":"Data_Sheet!B73","v":"VISHNU V"},{"$f":"'T3'!I73","v":0},{"$f":"IF(C73=\"A\",\"ABSENT\",IF(C73>='T3'!$F$5*$E$82/100,\"EXCELLENT\",IF(C73>='T3'!$F$5*$E$81/100,\"GOOD\",IF(C73>='T3'!$F$5*$E$80/100,\"AVERAGE\",\"POOR\"))))","v":"POOR"}]
[{"$f":"Data_Sheet!A74","v":"LJEC16EC102"},{"$f":"Data_Sheet!B74","v":"CHRISTEENA PAULSON"},{"$f":"'T3'!I74","v":0},{"$f":"IF(C74=\"A\",\"ABSENT\",IF(C74>='T3'!$F$5*$E$82/100,\"EXCELLENT\",IF(C74>='T3'!$F$5*$E$81/100,\"GOOD\",IF(C74>='T3'!$F$5*$E$80/100,\"AVERAGE\",\"POOR\"))))","v":"POOR"}]
[]
["Total Number of Students",null,{"$f":"Data_Sheet!$C$6","v":50}]
["Number of Students Absent",null,{"$f":"IF(COUNTIF(C25:INDIRECT(C89),\"=A\"),COUNTIF(C25:INDIRECT(C89),\"=A\"),0)","v":0}]
["Total Number of Students attended",null,{"$f":"C76-C77","v":50}]
[{"$f":"\"Number of Students with Marks less than \"&E80&\"%\"","v":"Number of Students with Marks less than 45%"},null,{"$f":"IF(COUNTIF(D25:INDIRECT(D89),\"=POOR\"),COUNTIF(D25:INDIRECT(D89),\"=POOR\"),0)","v":50},"POOR","Range"]
[{"$f":"\"Number of Students with Marks betweeen \"&E80&\"% to \"&E81&\"%\"","v":"Number of Students with Marks betweeen 45% to 60%"},null,{"$f":"IF(COUNTIF(D25:INDIRECT(D89),\"=AVERAGE\"),COUNTIF(D25:INDIRECT(D89),\"=AVERAGE\"),0)","v":0},"AVERAGE",45]
[{"$f":"\"Number of Students with Marks betweeen \"&E81&\"% to \"&E82&\"%\"","v":"Number of Students with Marks betweeen 60% to 80%"},null,{"$f":"IF(COUNTIF(D25:INDIRECT(D89),\"=GOOD\"),COUNTIF(D25:INDIRECT(D89),\"=GOOD\"),0)","v":0},"GOOD",60]
[{"$f":"\"Number of Students with Marks greater than \"&E82&\"%\"","v":"Number of Students with Marks greater than 80%"},null,{"$f":"IF(COUNTIF(D25:INDIRECT(D89),\"=EXCELLENT\"),COUNTIF(D25:INDIRECT(D89),\"=EXCELLENT\"),0)","v":0},"EXCELLENT",80]
["Class Average",null,{"$f":"ROUND(AVERAGE(C25:INDIRECT(C89)),2)","v":0}]
["Pass Percentage",null,{"$f":"ROUND(((C78-C79)/C78)*100,2)","v":0}]
[]
[null,{"$f":"Data_Sheet!B10","v":"Name of Faculty : "},{"$f":"Data_Sheet!B11","v":"PONMANI RAJA M"}]
[null,{"$f":"Data_Sheet!B94","v":"Dated Signature :  "}]
[]
[{"$f":"ROW(A76)-2","v":74},"Last Row Count",{"$f":"\"$C$\"&$A$89","v":"$C$74"},{"$f":"\"$D$\"&$A$89","v":"$D$74"}]

{"sheet":"A1","index":8,"n_rows":139,"n_cols":16,"rows_kept":139,"cut":false,"hidden":false,"merged":[[2,0,4,1],[0,2,0,3],[1,2,1,3],[4,2,4,3],[3,2,3,4],[2,2,2,4],[75,0,75,2],[76,0,76,2],[77,0,77,2],[78,0,78,2],[79,0,79,2],[6,0,6,5],[8,0,8,5],[10,0,10,5],[12,0,12,5],[17,0,21,0],[17,1,21,1],[17,5,21,5],[17,8,21,8],[105,12,110,12],[112,12,117,12],[119,12,124,12],[126,12,131,12],[98,12,103,12]]}
[null,null,"Date : "]
[null,null,"2019-09-26"]
["Add questions one by one as needed..",null,"Assessment Category",null,null,null,"CO1","First Internal Exam"]
[null,null,"Assignment - 1",null,null,null,"CO2","Second Internal Exam"]
[null,null,"Total Marks : ",null,10,null,"CO3","Assessment Exam - 1"]
[null,null,null,null,null,null,"CO4","Assessment Exam - 2"]
[{"$f":"Data_Sheet!A2","v":"Jyothi Engineering College, Cheruthuruthy"},null,null,null,null,null,"CO5","Assignment - 1"]
[null,null,null,null,null,null,"CO6","Assignment - 2"]
[{"$f":"Data_Sheet!A4","v":"Department of Electrical & Electronics Engineering"},null,null,null,null,null,null,"Retest"]
[null,null,null,null,null,null,1]
[{"$f":"\"CO Analysis - Internal Marks : \"&C4 &\"                       \" &TEXT(C2,\"dd-mm-yy\")","v":"CO Analysis - Internal Marks : Assignment - 1                       26-09-19"},null,null,null,null,null,2]
[null,null,null,null,null,null,3]
[{"$f":"Data_Sheet!A17","v":"S7 EC              EC407 Computer Communication               2019-20"},null,null,null,null,null,4]
[null,null,null,null,null,null,5]
[null,null,null,null,null,null,6]
[]
[]
["Register No.","Name of Student","Qn. No.",1,2,{"$f":" \"Total Marks (\" &E5 & \")\"","v":"Total Marks (10)"},null,null,"Calculated Total Marks (10)"]
[null,null,"CO's","CO4","CO4"]
[null,null,"Blooms Taxonomy Lavel",2,2]
[null,null,"Max. Marks",5,5]
[null,null,"Difficulty Level in %",60,60]
[]
["Column1","Column2","Column3","Column4","Column5","Column32"]
[{"$f":"Data_Sheet!A25","v":"JEC16EC051"},{"$f":"Data_Sheet!B25","v":"LANA KOLLATH"},null,5,5,10]
[{"$f":"Data_Sheet!A26","v":"JEC16EC052"},{"$f":"Data_Sheet!B26","v":"MANU JENSON"},null,4,4,8]
[{"$f":"Data_Sheet!A27","v":"JEC16EC053"},{"$f":"Data_Sheet!B27","v":"MAREENA MARIYA ABRAHAM"},null,5,5,10]
[{"$f":"Data_Sheet!A28","v":"JEC16EC054"},{"$f":"Data_Sheet!B28","v":"MARIAN DAVIS KATTUKARAN"},null,4,5,9]
[{"$f":"Data_Sheet!A29","v":"JEC16EC055"},{"$f":"Data_Sheet!B29","v":"MARY JEETHU A J"},null,4,5,9]
[{"$f":"Data_Sheet!A30","v":"JEC16EC056"},{"$f":"Data_Sheet!B30","v":"MUBASHIRA K M"},null,5,5,10]
[{"$f":"Data_Sheet!A31","v":"JEC16EC057"},{"$f":"Data_Sheet!B31","v":"MUHAMMED ARSHAD"},null,5,4,9]
[{"$f":"Data_Sheet!A32","v":"JEC16EC058"},{"$f":"Data_Sheet!B32","v":"NANDANA K"},null,5,5,10]
[{"$f":"Data_Sheet!A33","v":"JEC16EC059"},{"$f":"Data_Sheet!B33","v":"NARAYANAN M B"},null,4,5,9]
[{"$f":"Data_Sheet!A34","v":"JEC16EC061"},{"$f":"Data_Sheet!B34","v":"NIKHIL KJ"},null,4,4,8]
[{"$f":"Data_Sheet!A35","v":"JEC16EC062"},{"$f":"Data_Sheet!B35","v":"NIMISHA M S"},null,5,5,10]
[{"$f":"Data_Sheet!A36","v":"JEC16EC063"},{"$f":"Data_Sheet!B36","v":"NIMISHA TONY"},null,4,5,9]
[{"$f":"Data_Sheet!A37","v":"JEC16EC064"},{"$f":"Data_Sheet!B37","v":"NITHIN"},null,5,5,10]
[{"$f":"Data_Sheet!A38","v":"JEC16EC065"},{"$f":"Data_Sheet!B38","v":"OLIVIA NELSON"},null,5,4,9]
[{"$f":"Data_Sheet!A39","v":"JEC16EC066"},{"$f":"Data_Sheet!B39","v":"PAVITHRA.P"},null,4,5,9]
[{"$f":"Data_Sheet!A40","v":"JEC16EC067"},{"$f":"Data_Sheet!B40","v":"P.DHANYA RAJ"},null,5,5,10]
[{"$f":"Data_Sheet!A41","v":"JEC16EC068"},{"$f":"Data_Sheet!B41","v":"POOJA.P"},null,4,5,9]
[{"$f":"Data_Sheet!A42","v":"JEC16EC069"},{"$f":"Data_Sheet!B42","v":"PRANAV"},null,4,5,9]
[{"$f":"Data_Sheet!A43","v":"JEC16EC070"},{"$f":"Data_Sheet!B43","v":"PRASOBH KP"},null,5,4,9]
[{"$f":"Data_Sheet!A44","v":"JEC16EC071"},{"$f":"Data_Sheet!B44","v":"PRINCE BENNY"},null,5,5,10]
[{"$f":"Data_Sheet!A45","v":"JEC16EC072"},{"$f":"Data_Sheet!B45","v":"PRIYA.K"},null,5,5,10]
[{"$f":"Data_Sheet!A46","v":"JEC16EC073"},{"$f":"Data_Sheet!B46","v":"RADHIKA"},null,5,5,10]
[{"$f":"Data_Sheet!A47","v":"JEC16EC074"},{"$f":"Data_Sheet!B47","v":"RINOSHA.K.R"},null,5,5,10]
[{"$f":"Data_Sheet!A48","v":"JEC16EC075"},{"$f":"Data_Sheet!B48","v":"RIYA ALBERT"},null,5,5,10]
[{"$f":"Data_Sheet!A49","v":"JEC16EC076"},{"$f":"Data_Sheet!B49","v":"RIYA PS"},null,4,5,9]
[{"$f":"Data_Sheet!A50","v":"JEC16EC077"},{"$f":"Data_Sheet!B50","v":"ROSHNI J NAIR"},null,5,5,10]
[{"$f":"Data_Sheet!A51","v":"JEC16EC079"},{"$f":"Data_Sheet!B51","v":"SAFNA M"},null,4,4,8]
[{"$f":"Data_Sheet!A52","v":"JEC16EC080"},{"$f":"Data_Sheet!B52","v":"SAJIN SHAJI"},null,5,5,10]
[{"$f":"Data_Sheet!A53","v":"JEC16EC081"},{"$f":"Data_Sheet!B53","v":"SANDHRA .S"},null,5,4,9]
[{"$f":"Data_Sheet!A54","v":"JEC16EC082"},{"$f":"Data_Sheet!B54","v":"SANGAMITHRA"},null,4,4,8]
[{"$f":"Data_Sheet!A55","v":"JEC16EC083"},{"$f":"Data_Sheet!B55","v":"SARANYA.M.NAIR"},null,5,5,10]
[{"$f":"Data_Sheet!A56","v":"JEC16EC084"},{"$f":"Data_Sheet!B56","v":"SARATHRAJ"},null,5,5,10]
[{"$f":"Data_Sheet!A57","v":"JEC16EC085"},{"$f":"Data_Sheet!B57","v":"SHAHAN FATHIMA K"},null,4,5,9]
[{"$f":"Data_Sheet!A58","v":"JEC16EC086"},{"$f":"Data_Sheet!B58","v":"SHAHLA.P.MOHAMMED"},null,5,5,10]
[{"$f":"Data_Sheet!A59","v":"JEC16EC087"},{"$f":"Data_Sheet!B59","v":"SHAMSEENA T A"}]
[{"$f":"Data_Sheet!A60","v":"JEC16EC088"},{"$f":"Data_Sheet!B60","v":"SHARAN SHASHINDRAN A"},null,5,4,9]
[{"$f":"Data_Sheet!A61","v":"JEC16EC089"},{"$f":"Data_Sheet!B61","v":"SIBIN KRISHNA C"},null,5,5,10]
[{"$f":"Data_Sheet!A62","v":"JEC16EC090"},{"$f":"Data_Sheet!B62","v":"SREEJITH VIJAYAKUMAR"}]
[{"$f":"Data_Sheet!A63","v":"JEC16EC091"},{"$f":"Data_Sheet!B63","v":"SREELAKSHMI.R"},null,5,5,10]
[{"$f":"Data_Sheet!A64","v":"JEC16EC092"},{"$f":"Data_Sheet!B64","v":"SREERAG K M"},null,5,5,10]
[{"$f":"Data_Sheet!A65","v":"JEC16EC093"},{"$f":"Data_Sheet!B65","v":"SREERAG T K"},null,5,5,10]
[{"$f":"Data_Sheet!A66","v":"JEC16EC094"},{"$f":"Data_Sheet!B66","v":"SREERAG V.V"},null,4,5,9]
[{"$f":"Data_Sheet!A67","v":"JEC16EC095"},{"$f":"Data_Sheet!B67","v":"SRUTHIMOL.N.T"}]
[{"$f":"Data_Sheet!A68","v":"JEC16EC096"},{"$f":"Data_Sheet!B68","v":"SRUTHISHA SASI"},null,5,5,10]
[{"$f":"Data_Sheet!A69","v":"JEC16EC097"},{"$f":"Data_Sheet!B69","v":"SUCHITHRA.TS"},null,5,5,10]
[{"$f":"Data_Sheet!A70","v":"JEC16EC098"},{"$f":"Data_Sheet!B70","v":"SWETHA SARA GEORGE"},null,5,5,10]
[{"$f":"Data_Sheet!A71","v":"JEC16EC099"},{"$f":"Data_Sheet!B71","v":"VISHNU K"},null,4,5,9]
[{"$f":"Data_Sheet!A72","v":"JEC16EC100"},{"$f":"Data_Sheet!B72","v":"VISHNU PRAKASH"},null,5,4,9]
[{"$f":"Data_Sheet!A73","v":"JEC16EC101"},{"$f":"Data_Sheet!B73","v":"VISHNU V"},null,4,5,9]
[{"$f":"Data_Sheet!A74","v":"LJEC16EC102"},{"$f":"Data_Sheet!B74","v":"CHRISTEENA PAULSON"},null,5,5,10]
[]
["Total Marks scored for the Question",null,null,{"$f":"IF(D$22<>\"\",IF(SUM(D25:INDIRECT(D96))>=0,SUM(D25:INDIRECT(D96)),\"\"),\"\")","v":219},{"$f":"IF(E$22<>\"\",IF(SUM(E25:INDIRECT(E96))>=0,SUM(E25:INDIRECT(E96)),\"\"),\"\")","v":225}]
["No. of Students who attended the Question",null,null,{"$f":"IF(D$22<>\"\",IF(COUNT(D25:INDIRECT(D96))>=0,COUNT(D25:INDIRECT(D96)),\"\"),\"\")","v":47},{"$f":"IF(E$22<>\"\",IF(COUNT(E25:INDIRECT(E96))>=0,COUNT(E25:INDIRECT(E96)),\"\"),\"\")","v":47}]
["Difficulty Level marks of the Question",null,null,{"$f":"IF(D21*D22/100=0,\"\",D21*D22/100)","v":3},3]
["No. of Students who scored above the Difficulty Level",null,null,{"$f":"IF(COUNTIF(D25:INDIRECT(D96),\">=\"&D78)=0,\"\",COUNTIF(D25:INDIRECT(D96),\">=\"&D78))","v":47},{"$f":"IF(COUNTIF(E25:INDIRECT(E96),\">=\"&E78)=0,\"\",COUNTIF(E25:INDIRECT(E96),\">=\"&E78))","v":47}]
["% of Students who scored above the Difficulty Level",null,null,{"$f":"IFERROR(ROUND(D79/D77*100,2),\"\")","v":100},100]
[null,null,null,{"$f":"IF(D80=\"\",0,IF(D80>=80,3,IF(D80>=70,2,IF(D80>=60,1,0))))","v":3},3,"Marks",null,null,null,"T_Marks","S_Marks","Students","Level","Above","Above %","Attainment"]
[null,{"$f":"IF(Data_Sheet!A77<>\"\",\"Total Attainment level for \"&Data_Sheet!A77&\" :\",\"\")","v":"Total Attainment level for CO1 :"},{"$f":"IF(Data_Sheet!A77<>\"\",I82,\"\")","v":""},{"$f":"IFERROR((IF(ISNUMBER(SEARCH(\"1\", D$19)),D$21,\"0\")),\"0\")*D81","v":0},{"$f":"IFERROR((IF(ISNUMBER(SEARCH(\"1\", E$19)),E$21,\"0\")),\"0\")*E81","v":0},{"$f":"F99","v":0},null,null,{"$f":"IF(F82=0,\"\",ROUND(SUM(D82:E82)/F82,2))","v":""},{"$f":"F99","v":0},{"$f":"F106","v":0},{"$f":"F113","v":0},{"$f":"F120","v":0},{"$f":"F127","v":0},{"$f":"IFERROR(ROUND(N82/L82*100,2),\"\")","v":""},{"$f":"IF(O82=\"\",\"\",IF(O82>=80,3,IF(O82>=70,2,IF(O82>=60,1,0))))","v":""}]
[null,{"$f":"IF(Data_Sheet!A78<>\"\",\"Total Attainment level for \"&Data_Sheet!A78&\" :\",\"\")","v":"Total Attainment level for CO2 :"},{"$f":"IF(Data_Sheet!A78<>\"\",I83,\"\")","v":""},{"$f":"IFERROR((IF(ISNUMBER(SEARCH(\"2\", D$19)),D$21,\"0\")),\"0\")*D81","v":0},{"$f":"IFERROR((IF(ISNUMBER(SEARCH(\"2\", E$19)),E$21,\"0\")),\"0\")*E81","v":0},{"$f":"F100","v":0},null,null,"",{"$f":"F100","v":0},{"$f":"F107","v":0},{"$f":"F114","v":0},{"$f":"F121","v":0},{"$f":"F128","v":0},{"$f":"IFERROR(ROUND(N83/L83*100,2),\"\")","v":""},{"$f":"IF(O83=\"\",\"\",IF(O83>=80,3,IF(O83>=70,2,IF(O83>=60,1,0))))","v":""}]
[null,{"$f":"IF(Data_Sheet!A79<>\"\",\"Total Attainment level for \"&Data_Sheet!A79&\" :\",\"\")","v":"Total Attainment level for CO3 :"},{"$f":"IF(Data_Sheet!A79<>\"\",I84,\"\")","v":""},{"$f":"IFERROR((IF(ISNUMBER(SEARCH(\"3\", D$19)),D$21,\"0\")),\"0\")*D81","v":0},{"$f":"IFERROR((IF(ISNUMBER(SEARCH(\"3\", E$19)),E$21,\"0\")),\"0\")*E81","v":0},0,null,null,"",0,0,0,0,0,"",""]
[null,{"$f":"IF(Data_Sheet!A80<>\"\",\"Total Attainment level for \"&Data_Sheet!A80&\" :\",\"\")","v":"Total Attainment level for CO4 :"},{"$f":"IF(Data_Sheet!A80<>\"\",I85,\"\")","v":3},{"$f":"IFERROR((IF(ISNUMBER(SEARCH(\"4\", D$19)),D$21,\"0\")),\"0\")*D81","v":15},{"$f":"IFERROR((IF(ISNUMBER(SEARCH(\"4\", E$19)),E$21,\"0\")),\"0\")*E81","v":15},10,null,null,3,10,444,94,6,94,100,3]
[null,{"$f":"IF(Data_Sheet!A81<>\"\",\"Total Attainment level for \"&Data_Sheet!A81&\" :\",\"\")","v":"Total Attainment level for CO5 :"},{"$f":"IF(Data_Sheet!A81<>\"\",I86,\"\")","v":""},{"$f":"IFERROR((IF(ISNUMBER(SEARCH(\"5\", D$19)),D$21,\"0\")),\"0\")*D81","v":0},{"$f":"IFERROR((IF(ISNUMBER(SEARCH(\"5\", E$19)),E$21,\"0\")),\"0\")*E81","v":0},0,null,null,"",0,0,0,0,0,"",""]
[null,{"$f":"IF(Data_Sheet!A82<>\"\",\"Total Attainment level for \"&Data_Sheet!A82&\" :\",\"\")","v":"Total Attainment level for CO6 :"},{"$f":"IF(Data_Sheet!A82<>\"\",I87,\"\")","v":""},{"$f":"IFERROR((IF(ISNUMBER(SEARCH(\"6\", D$19)),D$21,\"0\")),\"0\")*D81","v":0},{"$f":"IFERROR((IF(ISNUMBER(SEARCH(\"6\", E$19)),E$21,\"0\")),\"0\")*E81","v":0},0,null,null,"",0,0,0,0,0,"",""]
[]
[{"$f":"Data_Sheet!A85","v":"Attainment Level 1: 60% students scoring more than 60% of the Total Marks"}]
[{"$f":"Data_Sheet!A86","v":"Attainment Level 2: 70% students scoring more than 60% of the Total Marks"}]
[{"$f":"Data_Sheet!A87","v":"Attainment Level 3: 80% students scoring more than 60% of the Total Marks"}]
[]
[null,{"$f":"Data_Sheet!B10","v":"Name of Faculty : "},{"$f":"Data_Sheet!B11","v":"PONMANI RAJA M"}]
[null,{"$f":"Data_Sheet!B94","v":"Dated Signature :  "}]
[]
[null,"Last Row Count",{"$f":"ROW(A76)-2","v":74},{"$f":"SUBSTITUTE(ADDRESS(1,COLUMN(D1),2),\"1\",\"\")&$C$96","v":"D$74"},{"$f":"\"E\"&$C$96","v":"E74"}]
[]
[]
[null,null,"CO1",{"$f":"IFERROR((IF(ISNUMBER(SEARCH(\"1\", D$19)),D$21,\"0\")),\"0\")","v":"0"},{"$f":"IFERROR((IF(ISNUMBER(SEARCH(\"1\", E$19)),E$21,\"0\")),\"0\")","v":"0"},{"$f":"IFERROR(SUM($D99:INDIRECT($I99)),\"0\")","v":0},null,null,{"$f":"SUBSTITUTE(ADDRESS(1,K99,4),1,\"\")&ROW($I99)","v":"E99"},{"$f":"COUNTIF($D$20:INDIRECT($L99),\"*1*\")","v":0},{"$f":"COLUMN($F$19)-1","v":5},{"$f":"SUBSTITUTE(ADDRESS(1,K99,4),1,\"\")&ROW($I$19)+1","v":"E20"},"Total Marks"]
[null,null,"CO2",{"$f":"IFERROR((IF(ISNUMBER(SEARCH(\"2\", D$19)),D$21,\"0\")),\"0\")","v":"0"},{"$f":"IFERROR((IF(ISNUMBER(SEARCH(\"2\", E$19)),E$21,\"0\")),\"0\")","v":"0"},{"$f":"IFERROR(SUM($D100:INDIRECT($I100)),\"0\")","v":0},null,null,"E100",{"$f":"COUNTIF($D$20:INDIRECT($L100),\"*2*\")","v":0},{"$f":"COLUMN($F$19)-1","v":5},{"$f":"SUBSTITUTE(ADDRESS(1,K100,4),1,\"\")&ROW($I$19)+1","v":"E20"}]
[null,null,"CO3",{"$f":"IFERROR((IF(ISNUMBER(SEARCH(\"3\", D$19)),D$21,\"0\")),\"0\")","v":"0"},{"$f":"IFERROR((IF(ISNUMBER(SEARCH(\"3\", E$19)),E$21,\"0\")),\"0\")","v":"0"},{"$f":"IFERROR(SUM($D101:INDIRECT($I101)),\"0\")","v":0},null,null,"E101",{"$f":"COUNTIF($D$20:INDIRECT($L101),\"*2*\")","v":0},5,"E20"]
[null,null,"CO4",{"$f":"IFERROR((IF(ISNUMBER(SEARCH(\"4\", D$19)),D$21,\"0\")),\"0\")","v":5},{"$f":"IFERROR((IF(ISNUMBER(SEARCH(\"4\", E$19)),E$21,\"0\")),\"0\")","v":5},{"$f":"IFERROR(SUM($D102:INDIRECT($I102)),\"0\")","v":10},null,null,"E102",{"$f":"COUNTIF($D$20:INDIRECT($L102),\"*2*\")","v":0},5,"E20"]
[null,null,"CO5",{"$f":"IFERROR((IF(ISNUMBER(SEARCH(\"5\", D$19)),D$21,\"0\")),\"0\")","v":"0"},{"$f":"IFERROR((IF(ISNUMBER(SEARCH(\"5\", E$19)),E$21,\"0\")),\"0\")","v":"0"},{"$f":"IFERROR(SUM($D103:INDIRECT($I103)),\"0\")","v":0},null,null,"E103",{"$f":"COUNTIF($D$20:INDIRECT($L103),\"*2*\")","v":0},5,"E20"]
[null,null,"CO6",{"$f":"IFERROR((IF(ISNUMBER(SEARCH(\"6\", D$19)),D$21,\"0\")),\"0\")","v":"0"},{"$f":"IFERROR((IF(ISNUMBER(SEARCH(\"6\", E$19)),E$21,\"0\")),\"0\")","v":"0"},{"$f":"IFERROR(SUM($D104:INDIRECT($I104)),\"0\")","v":0},null,null,"E104",{"$f":"COUNTIF($D$20:INDIRECT($L104),\"*2*\")","v":0},5,"E20"]
[]
[null,null,"CO1",{"$f":"IFERROR((IF(ISNUMBER(SEARCH(\"1\", D$19)),D$76,\"0\")),\"0\")","v":"0"},{"$f":"IFERROR((IF(ISNUMBER(SEARCH(\"1\", E$19)),E$76,\"0\")),\"0\")","v":"0"},{"$f":"IFERROR(SUM($D106:INDIRECT($I106)),\"0\")","v":0},null,null,{"$f":"SUBSTITUTE(ADDRESS(1,K106,4),1,\"\")&ROW($I106)","v":"E106"},{"$f":"COUNTIF($D$20:INDIRECT($L106),\"*1*\")","v":0},{"$f":"COLUMN($F$19)-1","v":5},{"$f":"SUBSTITUTE(ADDRESS(1,K106,4),1,\"\")&ROW($I$19)+1","v":"E20"},"Total Marks Scored"]
[null,null,"CO2",{"$f":"IFERROR((IF(ISNUMBER(SEARCH(\"2\", D$19)),D$76,\"0\")),\"0\")","v":"0"},{"$f":"IFERROR((IF(ISNUMBER(SEARCH(\"2\", E$19)),E$76,\"0\")),\"0\")","v":"0"},{"$f":"IFERROR(SUM($D107:INDIRECT($I107)),\"0\")","v":0},null,null,"E107",{"$f":"COUNTIF($D$20:INDIRECT($L107),\"*2*\")","v":0},{"$f":"COLUMN($F$19)-1","v":5},{"$f":"SUBSTITUTE(ADDRESS(1,K107,4),1,\"\")&ROW($I$19)+1","v":"E20"}]
[null,null,"CO3",{"$f":"IFERROR((IF(ISNUMBER(SEARCH(\"3\", D$19)),D$76,\"0\")),\"0\")","v":"0"},{"$f":"IFERROR((IF(ISNUMBER(SEARCH(\"3\", E$19)),E$76,\"0\")),\"0\")","v":"0"},{"$f":"IFERROR(SUM($D108:INDIRECT($I108)),\"0\")","v":0},null,null,"E108",{"$f":"COUNTIF($D$20:INDIRECT($L108),\"*2*\")","v":0},5,"E20"]
[null,null,"CO4",{"$f":"IFERROR((IF(ISNUMBER(SEARCH(\"4\", D$19)),D$76,\"0\")),\"0\")","v":219},{"$f":"IFERROR((IF(ISNUMBER(SEARCH(\"4\", E$19)),E$76,\"0\")),\"0\")","v":225},{"$f":"IFERROR(SUM($D109:INDIRECT($I109)),\"0\")","v":444},null,null,"E109",{"$f":"COUNTIF($D$20:INDIRECT($L109),\"*2*\")","v":0},5,"E20"]
[null,null,"CO5",{"$f":"IFERROR((IF(ISNUMBER(SEARCH(\"5\", D$19)),D$76,\"0\")),\"0\")","v":"0"},{"$f":"IFERROR((IF(ISNUMBER(SEARCH(\"5\", E$19)),E$76,\"0\")),\"0\")","v":"0"},{"$f":"IFERROR(SUM($D110:INDIRECT($I110)),\"0\")","v":0},null,null,"E110",{"$f":"COUNTIF($D$20:INDIRECT($L110),\"*2*\")","v":0},5,"E20"]
[null,null,"CO6",{"$f":"IFERROR((IF(ISNUMBER(SEARCH(\"6\", D$19)),D$76,\"0\")),\"0\")","v":"0"},{"$f":"IFERROR((IF(ISNUMBER(SEARCH(\"6\", E$19)),E$76,\"0\")),\"0\")","v":"0"},{"$f":"IFERROR(SUM($D111:INDIRECT($I111)),\"0\")","v":0},null,null,"E111",{"$f":"COUNTIF($D$20:INDIRECT($L111),\"*2*\")","v":0},5,"E20"]
[]
[null,null,"CO1",{"$f":"IFERROR((IF(ISNUMBER(SEARCH(\"1\", D$19)),D$77,\"0\")),\"0\")","v":"0"},{"$f":"IFERROR((IF(ISNUMBER(SEARCH(\"1\", E$19)),E$77,\"0\")),\"0\")","v":"0"},{"$f":"IFERROR(SUM($D113:INDIRECT($I113)),\"0\")","v":0},null,null,{"$f":"SUBSTITUTE(ADDRESS(1,K113,4),1,\"\")&ROW($I113)","v":"E113"},{"$f":"COUNTIF($D$20:INDIRECT($L113),\"*1*\")","v":0},{"$f":"COLUMN($F$19)-1","v":5},{"$f":"SUBSTITUTE(ADDRESS(1,K113,4),1,\"\")&ROW($I$19)+1","v":"E20"},"No of Studdents Attended"]
[null,null,"CO2",{"$f":"IFERROR((IF(ISNUMBER(SEARCH(\"2\", D$19)),D$77,\"0\")),\"0\")","v":"0"},{"$f":"IFERROR((IF(ISNUMBER(SEARCH(\"2\", E$19)),E$77,\"0\")),\"0\")","v":"0"},{"$f":"IFERROR(SUM($D114:INDIRECT($I114)),\"0\")","v":0},null,null,"E114",{"$f":"COUNTIF($D$20:INDIRECT($L114),\"*2*\")","v":0},{"$f":"COLUMN($F$19)-1","v":5},{"$f":"SUBSTITUTE(ADDRESS(1,K114,4),1,\"\")&ROW($I$19)+1","v":"E20"}]
[null,null,"CO3",{"$f":"IFERROR((IF(ISNUMBER(SEARCH(\"3\", D$19)),D$77,\"0\")),\"0\")","v":"0"},{"$f":"IFERROR((IF(ISNUMBER(SEARCH(\"3\", E$19)),E$77,\"0\")),\"0\")","v":"0"},{"$f":"IFERROR(SUM($D115:INDIRECT($I115)),\"0\")","v":0},null,null,"E115",{"$f":"COUNTIF($D$20:INDIRECT($L115),\"*2*\")","v":0},5,"E20"]
[null,null,"CO4",{"$f":"IFERROR((IF(ISNUMBER(SEARCH(\"4\", D$19)),D$77,\"0\")),\"0\")","v":47},{"$f":"IFERROR((IF(ISNUMBER(SEARCH(\"4\", E$19)),E$77,\"0\")),\"0\")","v":47},{"$f":"IFERROR(SUM($D116:INDIRECT($I116)),\"0\")","v":94},null,null,"E116",{"$f":"COUNTIF($D$20:INDIRECT($L116),\"*2*\")","v":0},5,"E20"]
[null,null,"CO5",{"$f":"IFERROR((IF(ISNUMBER(SEARCH(\"5\", D$19)),D$77,\"0\")),\"0\")","v":"0"},{"$f":"IFERROR((IF(ISNUMBER(SEARCH(\"5\", E$19)),E$77,\"0\")),\"0\")","v":"0"},{"$f":"IFERROR(SUM($D117:INDIRECT($I117)),\"0\")","v":0},null,null,"E117",{"$f":"COUNTIF($D$20:INDIRECT($L117),\"*2*\")","v":0},5,"E20"]
[null,null,"CO6",{"$f":"IFERROR((IF(ISNUMBER(SEARCH(\"6\", D$19)),D$77,\"0\")),\"0\")","v":"0"},{"$f":"IFERROR((IF(ISNUMBER(SEARCH(\"6\", E$19)),E$77,\"0\")),\"0\")","v":"0"},{"$f":"IFERROR(SUM($D118:INDIRECT($I118)),\"0\")","v":0},null,null,"E118",{"$f":"COUNTIF($D$20:INDIRECT($L118),\"*2*\")","v":0},5,"E20"]
[]
[null,null,"CO1",{"$f":"IFERROR((IF(ISNUMBER(SEARCH(\"1\", D$19)),D$78,\"0\")),\"0\")","v":"0"},{"$f":"IFERROR((IF(ISNUMBER(SEARCH(\"1\", E$19)),E$78,\"0\")),\"0\")","v":"0"},{"$f":"IFERROR(SUM($D120:INDIRECT($I120)),\"0\")","v":0},null,null,{"$f":"SUBSTITUTE(ADDRESS(1,K120,4),1,\"\")&ROW($I120)","v":"E120"},{"$f":"COUNTIF($D$20:INDIRECT($L120),\"*1*\")","v":0},{"$f":"COLUMN($F$19)-1","v":5},{"$f":"SUBSTITUTE(ADDRESS(1,K120,4),1,\"\")&ROW($I$19)+1","v":"E20"},"Difficulty Level"]
[null,null,"CO2",{"$f":"IFERROR((IF(ISNUMBER(SEARCH(\"2\", D$19)),D$78,\"0\")),\"0\")","v":"0"},{"$f":"IFERROR((IF(ISNUMBER(SEARCH(\"2\", E$19)),E$78,\"0\")),\"0\")","v":"0"},{"$f":"IFERROR(SUM($D121:INDIRECT($I121)),\"0\")","v":0},null,null,"E121",{"$f":"COUNTIF($D$20:INDIRECT($L121),\"*2*\")","v":0},{"$f":"COLUMN($F$19)-1","v":5},{"$f":"SUBSTITUTE(ADDRESS(1,K121,4),1,\"\")&ROW($I$19)+1","v":"E20"}]
[null,null,"CO3",{"$f":"IFERROR((IF(ISNUMBER(SEARCH(\"3\", D$19)),D$78,\"0\")),\"0\")","v":"0"},{"$f":"IFERROR((IF(ISNUMBER(SEARCH(\"3\", E$19)),E$78,\"0\")),\"0\")","v":"0"},{"$f":"IFERROR(SUM($D122:INDIRECT($I122)),\"0\")","v":0},null,null,"E122",{"$f":"COUNTIF($D$20:INDIRECT($L122),\"*2*\")","v":0},5,"E20"]
[null,null,"CO4",{"$f":"IFERROR((IF(ISNUMBER(SEARCH(\"4\", D$19)),D$78,\"0\")),\"0\")","v":3},{"$f":"IFERROR((IF(ISNUMBER(SEARCH(\"4\", E$19)),E$78,\"0\")),\"0\")","v":3},{"$f":"IFERROR(SUM($D123:INDIRECT($I123)),\"0\")","v":6},null,null,"E123",{"$f":"COUNTIF($D$20:INDIRECT($L123),\"*2*\")","v":0},5,"E20"]
[null,null,"CO5",{"$f":"IFERROR((IF(ISNUMBER(SEARCH(\"5\", D$19)),D$78,\"0\")),\"0\")","v":"0"},{"$f":"IFERROR((IF(ISNUMBER(SEARCH(\"5\", E$19)),E$78,\"0\")),\"0\")","v":"0"},{"$f":"IFERROR(SUM($D124:INDIRECT($I124)),\"0\")","v":0},null,null,"E124",{"$f":"COUNTIF($D$20:INDIRECT($L124),\"*2*\")","v":0},5,"E20"]
[null,null,"CO6",{"$f":"IFERROR((IF(ISNUMBER(SEARCH(\"6\", D$19)),D$78,\"0\")),\"0\")","v":"0"},{"$f":"IFERROR((IF(ISNUMBER(SEARCH(\"6\", E$19)),E$78,\"0\")),\"0\")","v":"0"},{"$f":"IFERROR(SUM($D125:INDIRECT($I125)),\"0\")","v":0},null,null,"E125",{"$f":"COUNTIF($D$20:INDIRECT($L125),\"*2*\")","v":0},5,"E20"]
[]
[null,null,"CO1",{"$f":"IFERROR((IF(ISNUMBER(SEARCH(\"1\", D$19)),D$79,\"0\")),\"0\")","v":"0"},{"$f":"IFERROR((IF(ISNUMBER(SEARCH(\"1\", E$19)),E$79,\"0\")),\"0\")","v":"0"},{"$f":"IFERROR(SUM($D127:INDIRECT($I127)),\"0\")","v":0},null,null,{"$f":"SUBSTITUTE(ADDRESS(1,K127,4),1,\"\")&ROW($I127)","v":"E127"},{"$f":"COUNTIF($D$20:INDIRECT($L127),\"*1*\")","v":0},{"$f":"COLUMN($F$19)-1","v":5},{"$f":"SUBSTITUTE(ADDRESS(1,K127,4),1,\"\")&ROW($I$19)+1","v":"E20"},"No of Studdents Above Difficulty Level"]
[null,null,"CO2",{"$f":"IFERROR((IF(ISNUMBER(SEARCH(\"2\", D$19)),D$79,\"0\")),\"0\")","v":"0"},{"$f":"IFERROR((IF(ISNUMBER(SEARCH(\"2\", E$19)),E$79,\"0\")),\"0\")","v":"0"},{"$f":"IFERROR(SUM($D128:INDIRECT($I128)),\"0\")","v":0},null,null,"E128",{"$f":"COUNTIF($D$20:INDIRECT($L128),\"*2*\")","v":0},{"$f":"COLUMN($F$19)-1","v":5},{"$f":"SUBSTITUTE(ADDRESS(1,K128,4),1,\"\")&ROW($I$19)+1","v":"E20"}]
[null,null,"CO3",{"$f":"IFERROR((IF(ISNUMBER(SEARCH(\"3\", D$19)),D$79,\"0\")),\"0\")","v":"0"},{"$f":"IFERROR((IF(ISNUMBER(SEARCH(\"3\", E$19)),E$79,\"0\")),\"0\")","v":"0"},{"$f":"IFERROR(SUM($D129:INDIRECT($I129)),\"0\")","v":0},null,null,"E129",{"$f":"COUNTIF($D$20:INDIRECT($L129),\"*2*\")","v":0},5,"E20"]
[null,null,"CO4",{"$f":"IFERROR((IF(ISNUMBER(SEARCH(\"4\", D$19)),D$79,\"0\")),\"0\")","v":47},{"$f":"IFERROR((IF(ISNUMBER(SEARCH(\"4\", E$19)),E$79,\"0\")),\"0\")","v":47},{"$f":"IFERROR(SUM($D130:INDIRECT($I130)),\"0\")","v":94},null,null,"E130",{"$f":"COUNTIF($D$20:INDIRECT($L130),\"*2*\")","v":0},5,"E20"]
[null,null,"CO5",{"$f":"IFERROR((IF(ISNUMBER(SEARCH(\"5\", D$19)),D$79,\"0\")),\"0\")","v":"0"},{"$f":"IFERROR((IF(ISNUMBER(SEARCH(\"5\", E$19)),E$79,\"0\")),\"0\")","v":"0"},{"$f":"IFERROR(SUM($D131:INDIRECT($I131)),\"0\")","v":0},null,null,"E131",{"$f":"COUNTIF($D$20:INDIRECT($L131),\"*2*\")","v":0},5,"E20"]
[null,null,"CO6",{"$f":"IFERROR((IF(ISNUMBER(SEARCH(\"6\", D$19)),D$79,\"0\")),\"0\")","v":"0"},{"$f":"IFERROR((IF(ISNUMBER(SEARCH(\"6\", E$19)),E$79,\"0\")),\"0\")","v":"0"},{"$f":"IFERROR(SUM($D132:INDIRECT($I132)),\"0\")","v":0},null,null,"E132",{"$f":"COUNTIF($D$20:INDIRECT($L132),\"*2*\")","v":0},5,"E20"]
[]
[null,null,1,{"$f":"IFERROR((IF(ISNUMBER(SEARCH(\"1\", D$20)),D$21/IF(LEN(D20)=16,6,IF(LEN(D20)=13,5,IF(LEN(D20)=10,4,IF(LEN(D20)=7,3,IF(LEN(D20)=4,2,1))))),\"0\")),\"0\")","v":"0"},{"$f":"IFERROR((IF(ISNUMBER(SEARCH(\"1\", E$20)),E$21/IF(LEN(E20)=16,6,IF(LEN(E20)=13,5,IF(LEN(E20)=10,4,IF(LEN(E20)=7,3,IF(LEN(E20)=4,2,1))))),\"0\")),\"0\")","v":"0"},{"$f":"IFERROR(SUM($D134:INDIRECT($I134)),\"0\")","v":0},null,null,{"$f":"SUBSTITUTE(ADDRESS(1,K134,4),1,\"\")&ROW($I134)","v":"E134"},{"$f":"COUNTIF($D$20:INDIRECT($L134),\"1\")","v":0},{"$f":"COLUMN($F$18)-1","v":5},{"$f":"SUBSTITUTE(ADDRESS(1,K134,4),1,\"\")&ROW($I$19)+1","v":"E20"}]
[null,null,2,{"$f":"IFERROR((IF(ISNUMBER(SEARCH(\"2\", D$20)),D$21/IF(LEN(D20)=16,6,IF(LEN(D20)=13,5,IF(LEN(D20)=10,4,IF(LEN(D20)=7,3,IF(LEN(D20)=4,2,1))))),\"0\")),\"0\")","v":5},{"$f":"IFERROR((IF(ISNUMBER(SEARCH(\"2\", E$20)),E$21/IF(LEN(E20)=16,6,IF(LEN(E20)=13,5,IF(LEN(E20)=10,4,IF(LEN(E20)=7,3,IF(LEN(E20)=4,2,1))))),\"0\")),\"0\")","v":5},{"$f":"IFERROR(SUM($D135:INDIRECT($I135)),\"0\")","v":10},null,null,{"$f":"SUBSTITUTE(ADDRESS(1,K135,4),1,\"\")&ROW($I135)","v":"E135"},{"$f":"COUNTIF($D$20:INDIRECT($L135),\"2\")","v":2},{"$f":"COLUMN($F$18)-1","v":5},{"$f":"SUBSTITUTE(ADDRESS(1,K135,4),1,\"\")&ROW($I$19)+1","v":"E20"}]
[null,null,3,{"$f":"IFERROR((IF(ISNUMBER(SEARCH(\"3\", D$20)),D$21/IF(LEN(D20)=16,6,IF(LEN(D20)=13,5,IF(LEN(D20)=10,4,IF(LEN(D20)=7,3,IF(LEN(D20)=4,2,1))))),\"0\")),\"0\")","v":"0"},{"$f":"IFERROR((IF(ISNUMBER(SEARCH(\"3\", E$20)),E$21/IF(LEN(E20)=16,6,IF(LEN(E20)=13,5,IF(LEN(E20)=10,4,IF(LEN(E20)=7,3,IF(LEN(E20)=4,2,1))))),\"0\")),\"0\")","v":"0"},{"$f":"IFERROR(SUM($D136:INDIRECT($I136)),\"0\")","v":0},null,null,"E136",{"$f":"COUNTIF($D$20:INDIRECT($L136),\"3\")","v":0},5,"E20"]
[null,null,4,{"$f":"IFERROR((IF(ISNUMBER(SEARCH(\"4\", D$20)),D$21/IF(LEN(D20)=16,6,IF(LEN(D20)=13,5,IF(LEN(D20)=10,4,IF(LEN(D20)=7,3,IF(LEN(D20)=4,2,1))))),\"0\")),\"0\")","v":"0"},{"$f":"IFERROR((IF(ISNUMBER(SEARCH(\"4\", E$20)),E$21/IF(LEN(E20)=16,6,IF(LEN(E20)=13,5,IF(LEN(E20)=10,4,IF(LEN(E20)=7,3,IF(LEN(E20)=4,2,1))))),\"0\")),\"0\")","v":"0"},{"$f":"IFERROR(SUM($D137:INDIRECT($I137)),\"0\")","v":0},null,null,"E137",{"$f":"COUNTIF($D$20:INDIRECT($L137),\"4\")","v":0},5,"E20"]
[null,null,5,{"$f":"IFERROR((IF(ISNUMBER(SEARCH(\"5\", D$20)),D$21/IF(LEN(D20)=16,6,IF(LEN(D20)=13,5,IF(LEN(D20)=10,4,IF(LEN(D20)=7,3,IF(LEN(D20)=4,2,1))))),\"0\")),\"0\")","v":"0"},{"$f":"IFERROR((IF(ISNUMBER(SEARCH(\"5\", E$20)),E$21/IF(LEN(E20)=16,6,IF(LEN(E20)=13,5,IF(LEN(E20)=10,4,IF(LEN(E20)=7,3,IF(LEN(E20)=4,2,1))))),\"0\")),\"0\")","v":"0"},{"$f":"IFERROR(SUM($D138:INDIRECT($I138)),\"0\")","v":0},null,null,"E138",{"$f":"COUNTIF($D$20:INDIRECT($L138),\"5\")","v":0},5,"E20"]
[null,null,6,{"$f":"IFERROR((IF(ISNUMBER(SEARCH(\"6\", D$20)),D$21/IF(LEN(D20)=16,6,IF(LEN(D20)=13,5,IF(LEN(D20)=10,4,IF(LEN(D20)=7,3,IF(LEN(D20)=4,2,1))))),\"0\")),\"0\")","v":"0"},{"$f":"IFERROR((IF(ISNUMBER(SEARCH(\"6\", E$20)),E$21/IF(LEN(E20)=16,6,IF(LEN(E20)=13,5,IF(LEN(E20)=10,4,IF(LEN(E20)=7,3,IF(LEN(E20)=4,2,1))))),\"0\")),\"0\")","v":"0"},{"$f":"IFERROR(SUM($D139:INDIRECT($I139)),\"0\")","v":0},null,null,"E139",{"$f":"COUNTIF($D$20:INDIRECT($L139),\"6\")","v":0},5,"E20"]

{"sheet":"A1_Analysis","index":9,"n_rows":89,"n_cols":5,"rows_kept":89,"cut":false,"hidden":false,"merged":[[2,0,2,3],[4,0,4,3],[6,0,6,3],[8,0,8,3]]}
[]
[]
[{"$f":"Data_Sheet!A2","v":"Jyothi Engineering College, Cheruthuruthy"}]
[]
[{"$f":"Data_Sheet!A4","v":"Department of Electrical & Electronics Engineering"}]
[]
[{"$f":"'A1'!A11:F11","v":"CO Analysis - Internal Marks : Assignment - 1                       26-09-19"}]
[]
[{"$f":"Data_Sheet!A17","v":"S7 EC              EC407 Computer Communication               2019-20"}]
[]
[]
[]
[]
[]
[]
[]
[]
[]
[]
[]
[]
[{"$f":"'T1'!A18","v":"Register No."},{"$f":"'T1'!B18","v":"Name of Student"},{"$f":"'A1'!F18","v":"Total Marks (10)"},"Category"]
[]
["Column1","Column2","Column3","Column4"]
[{"$f":"Data_Sheet!A25","v":"JEC16EC051"},{"$f":"Data_Sheet!B25","v":"LANA KOLLATH"},{"$f":"'A1'!F25","v":10},{"$f":"IF(C25=\"A\",\"ABSENT\",IF(C25>='A1'!$E$5*$E$82/100,\"EXCELLENT\",IF(C25>='A1'!$E$5*$E$81/100,\"GOOD\",IF(C25>='A1'!$E$5*$E$80/100,\"AVERAGE\",\"POOR\"))))","v":"EXCELLENT"}]
[{"$f":"Data_Sheet!A26","v":"JEC16EC052"},{"$f":"Data_Sheet!B26","v":"MANU JENSON"},{"$f":"'A1'!F26","v":8},{"$f":"IF(C26=\"A\",\"ABSENT\",IF(C26>='A1'!$E$5*$E$82/100,\"EXCELLENT\",IF(C26>='A1'!$E$5*$E$81/100,\"GOOD\",IF(C26>='A1'!$E$5*$E$80/100,\"AVERAGE\",\"POOR\"))))","v":"EXCELLENT"}]
[{"$f":"Data_Sheet!A27","v":"JEC16EC053"},{"$f":"Data_Sheet!B27","v":"MAREENA MARIYA ABRAHAM"},{"$f":"'A1'!F27","v":10},{"$f":"IF(C27=\"A\",\"ABSENT\",IF(C27>='A1'!$E$5*$E$82/100,\"EXCELLENT\",IF(C27>='A1'!$E$5*$E$81/100,\"GOOD\",IF(C27>='A1'!$E$5*$E$80/100,\"AVERAGE\",\"POOR\"))))","v":"EXCELLENT"}]
[{"$f":"Data_Sheet!A28","v":"JEC16EC054"},{"$f":"Data_Sheet!B28","v":"MARIAN DAVIS KATTUKARAN"},{"$f":"'A1'!F28","v":9},{"$f":"IF(C28=\"A\",\"ABSENT\",IF(C28>='A1'!$E$5*$E$82/100,\"EXCELLENT\",IF(C28>='A1'!$E$5*$E$81/100,\"GOOD\",IF(C28>='A1'!$E$5*$E$80/100,\"AVERAGE\",\"POOR\"))))","v":"EXCELLENT"}]
[{"$f":"Data_Sheet!A29","v":"JEC16EC055"},{"$f":"Data_Sheet!B29","v":"MARY JEETHU A J"},{"$f":"'A1'!F29","v":9},{"$f":"IF(C29=\"A\",\"ABSENT\",IF(C29>='A1'!$E$5*$E$82/100,\"EXCELLENT\",IF(C29>='A1'!$E$5*$E$81/100,\"GOOD\",IF(C29>='A1'!$E$5*$E$80/100,\"AVERAGE\",\"POOR\"))))","v":"EXCELLENT"}]
[{"$f":"Data_Sheet!A30","v":"JEC16EC056"},{"$f":"Data_Sheet!B30","v":"MUBASHIRA K M"},{"$f":"'A1'!F30","v":10},{"$f":"IF(C30=\"A\",\"ABSENT\",IF(C30>='A1'!$E$5*$E$82/100,\"EXCELLENT\",IF(C30>='A1'!$E$5*$E$81/100,\"GOOD\",IF(C30>='A1'!$E$5*$E$80/100,\"AVERAGE\",\"POOR\"))))","v":"EXCELLENT"}]
[{"$f":"Data_Sheet!A31","v":"JEC16EC057"},{"$f":"Data_Sheet!B31","v":"MUHAMMED ARSHAD"},{"$f":"'A1'!F31","v":9},{"$f":"IF(C31=\"A\",\"ABSENT\",IF(C31>='A1'!$E$5*$E$82/100,\"EXCELLENT\",IF(C31>='A1'!$E$5*$E$81/100,\"GOOD\",IF(C31>='A1'!$E$5*$E$80/100,\"AVERAGE\",\"POOR\"))))","v":"EXCELLENT"}]
[{"$f":"Data_Sheet!A32","v":"JEC16EC058"},{"$f":"Data_Sheet!B32","v":"NANDANA K"},{"$f":"'A1'!F32","v":10},{"$f":"IF(C32=\"A\",\"ABSENT\",IF(C32>='A1'!$E$5*$E$82/100,\"EXCELLENT\",IF(C32>='A1'!$E$5*$E$81/100,\"GOOD\",IF(C32>='A1'!$E$5*$E$80/100,\"AVERAGE\",\"POOR\"))))","v":"EXCELLENT"}]
[{"$f":"Data_Sheet!A33","v":"JEC16EC059"},{"$f":"Data_Sheet!B33","v":"NARAYANAN M B"},{"$f":"'A1'!F33","v":9},{"$f":"IF(C33=\"A\",\"ABSENT\",IF(C33>='A1'!$E$5*$E$82/100,\"EXCELLENT\",IF(C33>='A1'!$E$5*$E$81/100,\"GOOD\",IF(C33>='A1'!$E$5*$E$80/100,\"AVERAGE\",\"POOR\"))))","v":"EXCELLENT"}]
[{"$f":"Data_Sheet!A34","v":"JEC16EC061"},{"$f":"Data_Sheet!B34","v":"NIKHIL KJ"},{"$f":"'A1'!F34","v":8},{"$f":"IF(C34=\"A\",\"ABSENT\",IF(C34>='A1'!$E$5*$E$82/100,\"EXCELLENT\",IF(C34>='A1'!$E$5*$E$81/100,\"GOOD\",IF(C34>='A1'!$E$5*$E$80/100,\"AVERAGE\",\"POOR\"))))","v":"EXCELLENT"}]
[{"$f":"Data_Sheet!A35","v":"JEC16EC062"},{"$f":"Data_Sheet!B35","v":"NIMISHA M S"},{"$f":"'A1'!F35","v":10},{"$f":"IF(C35=\"A\",\"ABSENT\",IF(C35>='A1'!$E$5*$E$82/100,\"EXCELLENT\",IF(C35>='A1'!$E$5*$E$81/100,\"GOOD\",IF(C35>='A1'!$E$5*$E$80/100,\"AVERAGE\",\"POOR\"))))","v":"EXCELLENT"}]
[{"$f":"Data_Sheet!A36","v":"JEC16EC063"},{"$f":"Data_Sheet!B36","v":"NIMISHA TONY"},{"$f":"'A1'!F36","v":9},{"$f":"IF(C36=\"A\",\"ABSENT\",IF(C36>='A1'!$E$5*$E$82/100,\"EXCELLENT\",IF(C36>='A1'!$E$5*$E$81/100,\"GOOD\",IF(C36>='A1'!$E$5*$E$80/100,\"AVERAGE\",\"POOR\"))))","v":"EXCELLENT"}]
[{"$f":"Data_Sheet!A37","v":"JEC16EC064"},{"$f":"Data_Sheet!B37","v":"NITHIN"},{"$f":"'A1'!F37","v":10},{"$f":"IF(C37=\"A\",\"ABSENT\",IF(C37>='A1'!$E$5*$E$82/100,\"EXCELLENT\",IF(C37>='A1'!$E$5*$E$81/100,\"GOOD\",IF(C37>='A1'!$E$5*$E$80/100,\"AVERAGE\",\"POOR\"))))","v":"EXCELLENT"}]
[{"$f":"Data_Sheet!A38","v":"JEC16EC065"},{"$f":"Data_Sheet!B38","v":"OLIVIA NELSON"},{"$f":"'A1'!F38","v":9},{"$f":"IF(C38=\"A\",\"ABSENT\",IF(C38>='A1'!$E$5*$E$82/100,\"EXCELLENT\",IF(C38>='A1'!$E$5*$E$81/100,\"GOOD\",IF(C38>='A1'!$E$5*$E$80/100,\"AVERAGE\",\"POOR\"))))","v":"EXCELLENT"}]
[{"$f":"Data_Sheet!A39","v":"JEC16EC066"},{"$f":"Data_Sheet!B39","v":"PAVITHRA.P"},{"$f":"'A1'!F39","v":9},{"$f":"IF(C39=\"A\",\"ABSENT\",IF(C39>='A1'!$E$5*$E$82/100,\"EXCELLENT\",IF(C39>='A1'!$E$5*$E$81/100,\"GOOD\",IF(C39>='A1'!$E$5*$E$80/100,\"AVERAGE\",\"POOR\"))))","v":"EXCELLENT"}]
[{"$f":"Data_Sheet!A40","v":"JEC16EC067"},{"$f":"Data_Sheet!B40","v":"P.DHANYA RAJ"},{"$f":"'A1'!F40","v":10},{"$f":"IF(C40=\"A\",\"ABSENT\",IF(C40>='A1'!$E$5*$E$82/100,\"EXCELLENT\",IF(C40>='A1'!$E$5*$E$81/100,\"GOOD\",IF(C40>='A1'!$E$5*$E$80/100,\"AVERAGE\",\"POOR\"))))","v":"EXCELLENT"}]
[{"$f":"Data_Sheet!A41","v":"JEC16EC068"},{"$f":"Data_Sheet!B41","v":"POOJA.P"},{"$f":"'A1'!F41","v":9},{"$f":"IF(C41=\"A\",\"ABSENT\",IF(C41>='A1'!$E$5*$E$82/100,\"EXCELLENT\",IF(C41>='A1'!$E$5*$E$81/100,\"GOOD\",IF(C41>='A1'!$E$5*$E$80/100,\"AVERAGE\",\"POOR\"))))","v":"EXCELLENT"}]
[{"$f":"Data_Sheet!A42","v":"JEC16EC069"},{"$f":"Data_Sheet!B42","v":"PRANAV"},{"$f":"'A1'!F42","v":9},{"$f":"IF(C42=\"A\",\"ABSENT\",IF(C42>='A1'!$E$5*$E$82/100,\"EXCELLENT\",IF(C42>='A1'!$E$5*$E$81/100,\"GOOD\",IF(C42>='A1'!$E$5*$E$80/100,\"AVERAGE\",\"POOR\"))))","v":"EXCELLENT"}]
[{"$f":"Data_Sheet!A43","v":"JEC16EC070"},{"$f":"Data_Sheet!B43","v":"PRASOBH KP"},{"$f":"'A1'!F43","v":9},{"$f":"IF(C43=\"A\",\"ABSENT\",IF(C43>='A1'!$E$5*$E$82/100,\"EXCELLENT\",IF(C43>='A1'!$E$5*$E$81/100,\"GOOD\",IF(C43>='A1'!$E$5*$E$80/100,\"AVERAGE\",\"POOR\"))))","v":"EXCELLENT"}]
[{"$f":"Data_Sheet!A44","v":"JEC16EC071"},{"$f":"Data_Sheet!B44","v":"PRINCE BENNY"},{"$f":"'A1'!F44","v":10},{"$f":"IF(C44=\"A\",\"ABSENT\",IF(C44>='A1'!$E$5*$E$82/100,\"EXCELLENT\",IF(C44>='A1'!$E$5*$E$81/100,\"GOOD\",IF(C44>='A1'!$E$5*$E$80/100,\"AVERAGE\",\"POOR\"))))","v":"EXCELLENT"}]
[{"$f":"Data_Sheet!A45","v":"JEC16EC072"},{"$f":"Data_Sheet!B45","v":"PRIYA.K"},{"$f":"'A1'!F45","v":10},{"$f":"IF(C45=\"A\",\"ABSENT\",IF(C45>='A1'!$E$5*$E$82/100,\"EXCELLENT\",IF(C45>='A1'!$E$5*$E$81/100,\"GOOD\",IF(C45>='A1'!$E$5*$E$80/100,\"AVERAGE\",\"POOR\"))))","v":"EXCELLENT"}]
[{"$f":"Data_Sheet!A46","v":"JEC16EC073"},{"$f":"Data_Sheet!B46","v":"RADHIKA"},{"$f":"'A1'!F46","v":10},{"$f":"IF(C46=\"A\",\"ABSENT\",IF(C46>='A1'!$E$5*$E$82/100,\"EXCELLENT\",IF(C46>='A1'!$E$5*$E$81/100,\"GOOD\",IF(C46>='A1'!$E$5*$E$80/100,\"AVERAGE\",\"POOR\"))))","v":"EXCELLENT"}]
[{"$f":"Data_Sheet!A47","v":"JEC16EC074"},{"$f":"Data_Sheet!B47","v":"RINOSHA.K.R"},{"$f":"'A1'!F47","v":10},{"$f":"IF(C47=\"A\",\"ABSENT\",IF(C47>='A1'!$E$5*$E$82/100,\"EXCELLENT\",IF(C47>='A1'!$E$5*$E$81/100,\"GOOD\",IF(C47>='A1'!$E$5*$E$80/100,\"AVERAGE\",\"POOR\"))))","v":"EXCELLENT"}]
[{"$f":"Data_Sheet!A48","v":"JEC16EC075"},{"$f":"Data_Sheet!B48","v":"RIYA ALBERT"},{"$f":"'A1'!F48","v":10},{"$f":"IF(C48=\"A\",\"ABSENT\",IF(C48>='A1'!$E$5*$E$82/100,\"EXCELLENT\",IF(C48>='A1'!$E$5*$E$81/100,\"GOOD\",IF(C48>='A1'!$E$5*$E$80/100,\"AVERAGE\",\"POOR\"))))","v":"EXCELLENT"}]
[{"$f":"Data_Sheet!A49","v":"JEC16EC076"},{"$f":"Data_Sheet!B49","v":"RIYA PS"},{"$f":"'A1'!F49","v":9},{"$f":"IF(C49=\"A\",\"ABSENT\",IF(C49>='A1'!$E$5*$E$82/100,\"EXCELLENT\",IF(C49>='A1'!$E$5*$E$81/100,\"GOOD\",IF(C49>='A1'!$E$5*$E$80/100,\"AVERAGE\",\"POOR\"))))","v":"EXCELLENT"}]
[{"$f":"Data_Sheet!A50","v":"JEC16EC077"},{"$f":"Data_Sheet!B50","v":"ROSHNI J NAIR"},{"$f":"'A1'!F50","v":10},{"$f":"IF(C50=\"A\",\"ABSENT\",IF(C50>='A1'!$E$5*$E$82/100,\"EXCELLENT\",IF(C50>='A1'!$E$5*$E$81/100,\"GOOD\",IF(C50>='A1'!$E$5*$E$80/100,\"AVERAGE\",\"POOR\"))))","v":"EXCELLENT"}]
[{"$f":"Data_Sheet!A51","v":"JEC16EC079"},{"$f":"Data_Sheet!B51","v":"SAFNA M"},{"$f":"'A1'!F51","v":8},{"$f":"IF(C51=\"A\",\"ABSENT\",IF(C51>='A1'!$E$5*$E$82/100,\"EXCELLENT\",IF(C51>='A1'!$E$5*$E$81/100,\"GOOD\",IF(C51>='A1'!$E$5*$E$80/100,\"AVERAGE\",\"POOR\"))))","v":"EXCELLENT"}]
[{"$f":"Data_Sheet!A52","v":"JEC16EC080"},{"$f":"Data_Sheet!B52","v":"SAJIN SHAJI"},{"$f":"'A1'!F52","v":10},{"$f":"IF(C52=\"A\",\"ABSENT\",IF(C52>='A1'!$E$5*$E$82/100,\"EXCELLENT\",IF(C52>='A1'!$E$5*$E$81/100,\"GOOD\",IF(C52>='A1'!$E$5*$E$80/100,\"AVERAGE\",\"POOR\"))))","v":"EXCELLENT"}]
[{"$f":"Data_Sheet!A53","v":"JEC16EC081"},{"$f":"Data_Sheet!B53","v":"SANDHRA .S"},{"$f":"'A1'!F53","v":9},{"$f":"IF(C53=\"A\",\"ABSENT\",IF(C53>='A1'!$E$5*$E$82/100,\"EXCELLENT\",IF(C53>='A1'!$E$5*$E$81/100,\"GOOD\",IF(C53>='A1'!$E$5*$E$80/100,\"AVERAGE\",\"POOR\"))))","v":"EXCELLENT"}]
[{"$f":"Data_Sheet!A54","v":"JEC16EC082"},{"$f":"Data_Sheet!B54","v":"SANGAMITHRA"},{"$f":"'A1'!F54","v":8},{"$f":"IF(C54=\"A\",\"ABSENT\",IF(C54>='A1'!$E$5*$E$82/100,\"EXCELLENT\",IF(C54>='A1'!$E$5*$E$81/100,\"GOOD\",IF(C54>='A1'!$E$5*$E$80/100,\"AVERAGE\",\"POOR\"))))","v":"EXCELLENT"}]
[{"$f":"Data_Sheet!A55","v":"JEC16EC083"},{"$f":"Data_Sheet!B55","v":"SARANYA.M.NAIR"},{"$f":"'A1'!F55","v":10},{"$f":"IF(C55=\"A\",\"ABSENT\",IF(C55>='A1'!$E$5*$E$82/100,\"EXCELLENT\",IF(C55>='A1'!$E$5*$E$81/100,\"GOOD\",IF(C55>='A1'!$E$5*$E$80/100,\"AVERAGE\",\"POOR\"))))","v":"EXCELLENT"}]
[{"$f":"Data_Sheet!A56","v":"JEC16EC084"},{"$f":"Data_Sheet!B56","v":"SARATHRAJ"},{"$f":"'A1'!F56","v":10},{"$f":"IF(C56=\"A\",\"ABSENT\",IF(C56>='A1'!$E$5*$E$82/100,\"EXCELLENT\",IF(C56>='A1'!$E$5*$E$81/100,\"GOOD\",IF(C56>='A1'!$E$5*$E$80/100,\"AVERAGE\",\"POOR\"))))","v":"EXCELLENT"}]
[{"$f":"Data_Sheet!A57","v":"JEC16EC085"},{"$f":"Data_Sheet!B57","v":"SHAHAN FATHIMA K"},{"$f":"'A1'!F57","v":9},{"$f":"IF(C57=\"A\",\"ABSENT\",IF(C57>='A1'!$E$5*$E$82/100,\"EXCELLENT\",IF(C57>='A1'!$E$5*$E$81/100,\"GOOD\",IF(C57>='A1'!$E$5*$E$80/100,\"AVERAGE\",\"POOR\"))))","v":"EXCELLENT"}]
[{"$f":"Data_Sheet!A58","v":"JEC16EC086"},{"$f":"Data_Sheet!B58","v":"SHAHLA.P.MOHAMMED"},{"$f":"'A1'!F58","v":10},{"$f":"IF(C58=\"A\",\"ABSENT\",IF(C58>='A1'!$E$5*$E$82/100,\"EXCELLENT\",IF(C58>='A1'!$E$5*$E$81/100,\"GOOD\",IF(C58>='A1'!$E$5*$E$80/100,\"AVERAGE\",\"POOR\"))))","v":"EXCELLENT"}]
[{"$f":"Data_Sheet!A59","v":"JEC16EC087"},{"$f":"Data_Sheet!B59","v":"SHAMSEENA T A"},{"$f":"'A1'!F59","v":0},{"$f":"IF(C59=\"A\",\"ABSENT\",IF(C59>='A1'!$E$5*$E$82/100,\"EXCELLENT\",IF(C59>='A1'!$E$5*$E$81/100,\"GOOD\",IF(C59>='A1'!$E$5*$E$80/100,\"AVERAGE\",\"POOR\"))))","v":"POOR"}]
[{"$f":"Data_Sheet!A60","v":"JEC16EC088"},{"$f":"Data_Sheet!B60","v":"SHARAN SHASHINDRAN A"},{"$f":"'A1'!F60","v":9},{"$f":"IF(C60=\"A\",\"ABSENT\",IF(C60>='A1'!$E$5*$E$82/100,\"EXCELLENT\",IF(C60>='A1'!$E$5*$E$81/100,\"GOOD\",IF(C60>='A1'!$E$5*$E$80/100,\"AVERAGE\",\"POOR\"))))","v":"EXCELLENT"}]
[{"$f":"Data_Sheet!A61","v":"JEC16EC089"},{"$f":"Data_Sheet!B61","v":"SIBIN KRISHNA C"},{"$f":"'A1'!F61","v":10},{"$f":"IF(C61=\"A\",\"ABSENT\",IF(C61>='A1'!$E$5*$E$82/100,\"EXCELLENT\",IF(C61>='A1'!$E$5*$E$81/100,\"GOOD\",IF(C61>='A1'!$E$5*$E$80/100,\"AVERAGE\",\"POOR\"))))","v":"EXCELLENT"}]
[{"$f":"Data_Sheet!A62","v":"JEC16EC090"},{"$f":"Data_Sheet!B62","v":"SREEJITH VIJAYAKUMAR"},{"$f":"'A1'!F62","v":0},{"$f":"IF(C62=\"A\",\"ABSENT\",IF(C62>='A1'!$E$5*$E$82/100,\"EXCELLENT\",IF(C62>='A1'!$E$5*$E$81/100,\"GOOD\",IF(C62>='A1'!$E$5*$E$80/100,\"AVERAGE\",\"POOR\"))))","v":"POOR"}]
[{"$f":"Data_Sheet!A63","v":"JEC16EC091"},{"$f":"Data_Sheet!B63","v":"SREELAKSHMI.R"},{"$f":"'A1'!F63","v":10},{"$f":"IF(C63=\"A\",\"ABSENT\",IF(C63>='A1'!$E$5*$E$82/100,\"EXCELLENT\",IF(C63>='A1'!$E$5*$E$81/100,\"GOOD\",IF(C63>='A1'!$E$5*$E$80/100,\"AVERAGE\",\"POOR\"))))","v":"EXCELLENT"}]
[{"$f":"Data_Sheet!A64","v":"JEC16EC092"},{"$f":"Data_Sheet!B64","v":"SREERAG K M"},{"$f":"'A1'!F64","v":10},{"$f":"IF(C64=\"A\",\"ABSENT\",IF(C64>='A1'!$E$5*$E$82/100,\"EXCELLENT\",IF(C64>='A1'!$E$5*$E$81/100,\"GOOD\",IF(C64>='A1'!$E$5*$E$80/100,\"AVERAGE\",\"POOR\"))))","v":"EXCELLENT"}]
[{"$f":"Data_Sheet!A65","v":"JEC16EC093"},{"$f":"Data_Sheet!B65","v":"SREERAG T K"},{"$f":"'A1'!F65","v":10},{"$f":"IF(C65=\"A\",\"ABSENT\",IF(C65>='A1'!$E$5*$E$82/100,\"EXCELLENT\",IF(C65>='A1'!$E$5*$E$81/100,\"GOOD\",IF(C65>='A1'!$E$5*$E$80/100,\"AVERAGE\",\"POOR\"))))","v":"EXCELLENT"}]
[{"$f":"Data_Sheet!A66","v":"JEC16EC094"},{"$f":"Data_Sheet!B66","v":"SREERAG V.V"},{"$f":"'A1'!F66","v":9},{"$f":"IF(C66=\"A\",\"ABSENT\",IF(C66>='A1'!$E$5*$E$82/100,\"EXCELLENT\",IF(C66>='A1'!$E$5*$E$81/100,\"GOOD\",IF(C66>='A1'!$E$5*$E$80/100,\"AVERAGE\",\"POOR\"))))","v":"EXCELLENT"}]
[{"$f":"Data_Sheet!A67","v":"JEC16EC095"},{"$f":"Data_Sheet!B67","v":"SRUTHIMOL.N.T"},{"$f":"'A1'!F67","v":0},{"$f":"IF(C67=\"A\",\"ABSENT\",IF(C67>='A1'!$E$5*$E$82/100,\"EXCELLENT\",IF(C67>='A1'!$E$5*$E$81/100,\"GOOD\",IF(C67>='A1'!$E$5*$E$80/100,\"AVERAGE\",\"POOR\"))))","v":"POOR"}]
[{"$f":"Data_Sheet!A68","v":"JEC16EC096"},{"$f":"Data_Sheet!B68","v":"SRUTHISHA SASI"},{"$f":"'A1'!F68","v":10},{"$f":"IF(C68=\"A\",\"ABSENT\",IF(C68>='A1'!$E$5*$E$82/100,\"EXCELLENT\",IF(C68>='A1'!$E$5*$E$81/100,\"GOOD\",IF(C68>='A1'!$E$5*$E$80/100,\"AVERAGE\",\"POOR\"))))","v":"EXCELLENT"}]
[{"$f":"Data_Sheet!A69","v":"JEC16EC097"},{"$f":"Data_Sheet!B69","v":"SUCHITHRA.TS"},{"$f":"'A1'!F69","v":10},{"$f":"IF(C69=\"A\",\"ABSENT\",IF(C69>='A1'!$E$5*$E$82/100,\"EXCELLENT\",IF(C69>='A1'!$E$5*$E$81/100,\"GOOD\",IF(C69>='A1'!$E$5*$E$80/100,\"AVERAGE\",\"POOR\"))))","v":"EXCELLENT"}]
[{"$f":"Data_Sheet!A70","v":"JEC16EC098"},{"$f":"Data_Sheet!B70","v":"SWETHA SARA GEORGE"},{"$f":"'A1'!F70","v":10},{"$f":"IF(C70=\"A\",\"ABSENT\",IF(C70>='A1'!$E$5*$E$82/100,\"EXCELLENT\",IF(C70>='A1'!$E$5*$E$81/100,\"GOOD\",IF(C70>='A1'!$E$5*$E$80/100,\"AVERAGE\",\"POOR\"))))","v":"EXCELLENT"}]
[{"$f":"Data_Sheet!A71","v":"JEC16EC099"},{"$f":"Data_Sheet!B71","v":"VISHNU K"},{"$f":"'A1'!F71","v":9},{"$f":"IF(C71=\"A\",\"ABSENT\",IF(C71>='A1'!$E$5*$E$82/100,\"EXCELLENT\",IF(C71>='A1'!$E$5*$E$81/100,\"GOOD\",IF(C71>='A1'!$E$5*$E$80/100,\"AVERAGE\",\"POOR\"))))","v":"EXCELLENT"}]
[{"$f":"Data_Sheet!A72","v":"JEC16EC100"},{"$f":"Data_Sheet!B72","v":"VISHNU PRAKASH"},{"$f":"'A1'!F72","v":9},{"$f":"IF(C72=\"A\",\"ABSENT\",IF(C72>='A1'!$E$5*$E$82/100,\"EXCELLENT\",IF(C72>='A1'!$E$5*$E$81/100,\"GOOD\",IF(C72>='A1'!$E$5*$E$80/100,\"AVERAGE\",\"POOR\"))))","v":"EXCELLENT"}]
[{"$f":"Data_Sheet!A73","v":"JEC16EC101"},{"$f":"Data_Sheet!B73","v":"VISHNU V"},{"$f":"'A1'!F73","v":9},{"$f":"IF(C73=\"A\",\"ABSENT\",IF(C73>='A1'!$E$5*$E$82/100,\"EXCELLENT\",IF(C73>='A1'!$E$5*$E$81/100,\"GOOD\",IF(C73>='A1'!$E$5*$E$80/100,\"AVERAGE\",\"POOR\"))))","v":"EXCELLENT"}]
[{"$f":"Data_Sheet!A74","v":"LJEC16EC102"},{"$f":"Data_Sheet!B74","v":"CHRISTEENA PAULSON"},{"$f":"'A1'!F74","v":10},{"$f":"IF(C74=\"A\",\"ABSENT\",IF(C74>='A1'!$E$5*$E$82/100,\"EXCELLENT\",IF(C74>='A1'!$E$5*$E$81/100,\"GOOD\",IF(C74>='A1'!$E$5*$E$80/100,\"AVERAGE\",\"POOR\"))))","v":"EXCELLENT"}]
[]
["Total Number of Students",null,{"$f":"Data_Sheet!$C$6","v":50}]
["Number of Students Absent",null,{"$f":"IF(COUNTIF(C25:INDIRECT(C89),\"=A\"),COUNTIF(C25:INDIRECT(C89),\"=A\"),0)","v":0}]
["Total Number of Students attended",null,{"$f":"C76-C77","v":50}]
[{"$f":"\"Number of Students with Marks less than \"&E80&\"%\"","v":"Number of Students with Marks less than 45%"},null,{"$f":"IF(COUNTIF(D25:INDIRECT(D89),\"=POOR\"),COUNTIF(D25:INDIRECT(D89),\"=POOR\"),0)","v":3},"POOR","Range"]
[{"$f":"\"Number of Students with Marks betweeen \"&E80&\"% to \"&E81&\"%\"","v":"Number of Students with Marks betweeen 45% to 60%"},null,{"$f":"IF(COUNTIF(D25:INDIRECT(D89),\"=AVERAGE\"),COUNTIF(D25:INDIRECT(D89),\"=AVERAGE\"),0)","v":0},"AVERAGE",45]
[{"$f":"\"Number of Students with Marks betweeen \"&E81&\"% to \"&E82&\"%\"","v":"Number of Students with Marks betweeen 60% to 80%"},null,{"$f":"IF(COUNTIF(D25:INDIRECT(D89),\"=GOOD\"),COUNTIF(D25:INDIRECT(D89),\"=GOOD\"),0)","v":0},"GOOD",60]
[{"$f":"\"Number of Students with Marks greater than \"&E82&\"%\"","v":"Number of Students with Marks greater than 80%"},null,{"$f":"IF(COUNTIF(D25:INDIRECT(D89),\"=EXCELLENT\"),COUNTIF(D25:INDIRECT(D89),\"=EXCELLENT\"),0)","v":47},"EXCELLENT",80]
["Class Average",null,{"$f":"ROUND(AVERAGE(C25:INDIRECT(C89)),2)","v":8.8800000000000008}]
["Pass Percentage",null,{"$f":"ROUND(((C78-C79)/C78)*100,2)","v":94}]
[]
[null,{"$f":"Data_Sheet!B10","v":"Name of Faculty : "},{"$f":"Data_Sheet!B11","v":"PONMANI RAJA M"}]
[null,{"$f":"Data_Sheet!B94","v":"Dated Signature :  "}]
[]
[{"$f":"ROW(A76)-2","v":74},"Last Row Count",{"$f":"\"$C$\"&$A$89","v":"$C$74"},{"$f":"\"$D$\"&$A$89","v":"$D$74"}]

{"sheet":"A2","index":10,"n_rows":139,"n_cols":16,"rows_kept":139,"cut":false,"hidden":false,"merged":[[75,0,75,2],[76,0,76,2],[77,0,77,2],[78,0,78,2],[79,0,79,2],[6,0,6,5],[8,0,8,5],[10,0,10,5],[12,0,12,5],[17,0,21,0],[17,1,21,1],[17,5,21,5],[0,2,0,3],[1,2,1,3],[2,0,4,1],[2,2,2,4],[3,2,3,4],[4,2,4,3],[17,8,21,8],[126,12,131,12],[98,12,103,12],[105,12,110,12],[112,12,117,12],[119,12,124,12]]}
[null,null,"Date : "]
[null,null,"2018-03-21"]
["Add questions one by one as needed..",null,"Assessment Category",null,null,null,"CO1","First Internal Exam"]
[null,null,"Assignment - 2",null,null,null,"CO2","Second Internal Exam"]
[null,null,"Total Marks : ",null,10,null,"CO3","Assessment Exam - 1"]
[null,null,null,null,null,null,"CO4","Assessment Exam - 2"]
[{"$f":"Data_Sheet!A2","v":"Jyothi Engineering College, Cheruthuruthy"},null,null,null,null,null,"CO5","Assignment - 1"]
[null,null,null,null,null,null,"CO6","Assignment - 2"]
[{"$f":"Data_Sheet!A4","v":"Department of Electrical & Electronics Engineering"},null,null,null,null,null,null,"Retest"]
[null,null,null,null,null,null,1]
[{"$f":"\"CO Analysis - Internal Marks : \"&C4 &\"                       \" &TEXT(C2,\"dd-mm-yy\")","v":"CO Analysis - Internal Marks : Assignment - 2                       21-03-18"},null,null,null,null,null,2]
[null,null,null,null,null,null,3]
[{"$f":"Data_Sheet!A17","v":"S7 EC              EC407 Computer Communication               2019-20"},null,null,null,null,null,4]
[null,null,null,null,null,null,5]
[null,null,null,null,null,null,6]
[]
[]
["Register No.","Name of Student","Qn. No.",1,2,{"$f":" \"Total Marks (\" &E5 & \")\"","v":"Total Marks (10)"},null,null,"Calculated Total Marks (10)"]
[null,null,"CO's","CO1, CO6","CO2, CO1"]
[null,null,"Blooms Taxonomy Lavel","4, 5","5, 6"]
[null,null,"Max. Marks",5,5]
[null,null,"Difficulty Level in %",60,60]
[]
["Column1","Column2","Column3","Column4","Column5","Column32"]
[{"$f":"Data_Sheet!A25","v":"JEC16EC051"},{"$f":"Data_Sheet!B25","v":"LANA KOLLATH"},null,5,5,10]
[{"$f":"Data_Sheet!A26","v":"JEC16EC052"},{"$f":"Data_Sheet!B26","v":"MANU JENSON"},null,5,5,10]
[{"$f":"Data_Sheet!A27","v":"JEC16EC053"},{"$f":"Data_Sheet!B27","v":"MAREENA MARIYA ABRAHAM"},null,5,5,10]
[{"$f":"Data_Sheet!A28","v":"JEC16EC054"},{"$f":"Data_Sheet!B28","v":"MARIAN DAVIS KATTUKARAN"},null,5,4,9]
[{"$f":"Data_Sheet!A29","v":"JEC16EC055"},{"$f":"Data_Sheet!B29","v":"MARY JEETHU A J"},null,5,5,10]
[{"$f":"Data_Sheet!A30","v":"JEC16EC056"},{"$f":"Data_Sheet!B30","v":"MUBASHIRA K M"},null,5,5,10]
[{"$f":"Data_Sheet!A31","v":"JEC16EC057"},{"$f":"Data_Sheet!B31","v":"MUHAMMED ARSHAD"},null,5,5,10]
[{"$f":"Data_Sheet!A32","v":"JEC16EC058"},{"$f":"Data_Sheet!B32","v":"NANDANA K"},null,5,5,10]
[{"$f":"Data_Sheet!A33","v":"JEC16EC059"},{"$f":"Data_Sheet!B33","v":"NARAYANAN M B"},null,5,4,9]
[{"$f":"Data_Sheet!A34","v":"JEC16EC061"},{"$f":"Data_Sheet!B34","v":"NIKHIL KJ"},null,4,5,9]
[{"$f":"Data_Sheet!A35","v":"JEC16EC062"},{"$f":"Data_Sheet!B35","v":"NIMISHA M S"},null,5,5,10]
[{"$f":"Data_Sheet!A36","v":"JEC16EC063"},{"$f":"Data_Sheet!B36","v":"NIMISHA TONY"},null,5,5,10]
[{"$f":"Data_Sheet!A37","v":"JEC16EC064"},{"$f":"Data_Sheet!B37","v":"NITHIN"},null,5,5,10]
[{"$f":"Data_Sheet!A38","v":"JEC16EC065"},{"$f":"Data_Sheet!B38","v":"OLIVIA NELSON"},null,5,5,10]
[{"$f":"Data_Sheet!A39","v":"JEC16EC066"},{"$f":"Data_Sheet!B39","v":"PAVITHRA.P"},null,5,5,10]
[{"$f":"Data_Sheet!A40","v":"JEC16EC067"},{"$f":"Data_Sheet!B40","v":"P.DHANYA RAJ"},null,5,5,10]
[{"$f":"Data_Sheet!A41","v":"JEC16EC068"},{"$f":"Data_Sheet!B41","v":"POOJA.P"},null,5,5,10]
[{"$f":"Data_Sheet!A42","v":"JEC16EC069"},{"$f":"Data_Sheet!B42","v":"PRANAV"},null,5,5,10]
[{"$f":"Data_Sheet!A43","v":"JEC16EC070"},{"$f":"Data_Sheet!B43","v":"PRASOBH KP"},null,5,4,9]
[{"$f":"Data_Sheet!A44","v":"JEC16EC071"},{"$f":"Data_Sheet!B44","v":"PRINCE BENNY"},null,4,5,9]
[{"$f":"Data_Sheet!A45","v":"JEC16EC072"},{"$f":"Data_Sheet!B45","v":"PRIYA.K"},null,5,5,10]
[{"$f":"Data_Sheet!A46","v":"JEC16EC073"},{"$f":"Data_Sheet!B46","v":"RADHIKA"},null,5,5,10]
[{"$f":"Data_Sheet!A47","v":"JEC16EC074"},{"$f":"Data_Sheet!B47","v":"RINOSHA.K.R"},null,5,5,10]
[{"$f":"Data_Sheet!A48","v":"JEC16EC075"},{"$f":"Data_Sheet!B48","v":"RIYA ALBERT"},null,5,5,10]
[{"$f":"Data_Sheet!A49","v":"JEC16EC076"},{"$f":"Data_Sheet!B49","v":"RIYA PS"},null,5,5,10]
[{"$f":"Data_Sheet!A50","v":"JEC16EC077"},{"$f":"Data_Sheet!B50","v":"ROSHNI J NAIR"},null,5,5,10]
[{"$f":"Data_Sheet!A51","v":"JEC16EC079"},{"$f":"Data_Sheet!B51","v":"SAFNA M"},null,4,5,9]
[{"$f":"Data_Sheet!A52","v":"JEC16EC080"},{"$f":"Data_Sheet!B52","v":"SAJIN SHAJI"},null,5,5,10]
[{"$f":"Data_Sheet!A53","v":"JEC16EC081"},{"$f":"Data_Sheet!B53","v":"SANDHRA .S"},null,5,5,10]
[{"$f":"Data_Sheet!A54","v":"JEC16EC082"},{"$f":"Data_Sheet!B54","v":"SANGAMITHRA"},null,5,5,10]
[{"$f":"Data_Sheet!A55","v":"JEC16EC083"},{"$f":"Data_Sheet!B55","v":"SARANYA.M.NAIR"},null,5,5,10]
[{"$f":"Data_Sheet!A56","v":"JEC16EC084"},{"$f":"Data_Sheet!B56","v":"SARATHRAJ"},null,5,5,10]
[{"$f":"Data_Sheet!A57","v":"JEC16EC085"},{"$f":"Data_Sheet!B57","v":"SHAHAN FATHIMA K"},null,5,5,10]
[{"$f":"Data_Sheet!A58","v":"JEC16EC086"},{"$f":"Data_Sheet!B58","v":"SHAHLA.P.MOHAMMED"},null,5,5,10]
[{"$f":"Data_Sheet!A59","v":"JEC16EC087"},{"$f":"Data_Sheet!B59","v":"SHAMSEENA T A"},null,0,0,0]
[{"$f":"Data_Sheet!A60","v":"JEC16EC088"},{"$f":"Data_Sheet!B60","v":"SHARAN SHASHINDRAN A"},null,5,5,10]
[{"$f":"Data_Sheet!A61","v":"JEC16EC089"},{"$f":"Data_Sheet!B61","v":"SIBIN KRISHNA C"},null,5,4,9]
[{"$f":"Data_Sheet!A62","v":"JEC16EC090"},{"$f":"Data_Sheet!B62","v":"SREEJITH VIJAYAKUMAR"},null,0,0,0]
[{"$f":"Data_Sheet!A63","v":"JEC16EC091"},{"$f":"Data_Sheet!B63","v":"SREELAKSHMI.R"},null,5,5,10]
[{"$f":"Data_Sheet!A64","v":"JEC16EC092"},{"$f":"Data_Sheet!B64","v":"SREERAG K M"},null,4,5,9]
[{"$f":"Data_Sheet!A65","v":"JEC16EC093"},{"$f":"Data_Sheet!B65","v":"SREERAG T K"},null,0,0,0]
[{"$f":"Data_Sheet!A66","v":"JEC16EC094"},{"$f":"Data_Sheet!B66","v":"SREERAG V.V"},null,5,5,10]
[{"$f":"Data_Sheet!A67","v":"JEC16EC095"},{"$f":"Data_Sheet!B67","v":"SRUTHIMOL.N.T"},null,0,0,0]
[{"$f":"Data_Sheet!A68","v":"JEC16EC096"},{"$f":"Data_Sheet!B68","v":"SRUTHISHA SASI"},null,5,5,10]
[{"$f":"Data_Sheet!A69","v":"JEC16EC097"},{"$f":"Data_Sheet!B69","v":"SUCHITHRA.TS"},null,4,5,9]
[{"$f":"Data_Sheet!A70","v":"JEC16EC098"},{"$f":"Data_Sheet!B70","v":"SWETHA SARA GEORGE"},null,5,5,10]
[{"$f":"Data_Sheet!A71","v":"JEC16EC099"},{"$f":"Data_Sheet!B71","v":"VISHNU K"},null,5,5,10]
[{"$f":"Data_Sheet!A72","v":"JEC16EC100"},{"$f":"Data_Sheet!B72","v":"VISHNU PRAKASH"},null,5,4,9]
[{"$f":"Data_Sheet!A73","v":"JEC16EC101"},{"$f":"Data_Sheet!B73","v":"VISHNU V"},null,5,4,9]
[{"$f":"Data_Sheet!A74","v":"LJEC16EC102"},{"$f":"Data_Sheet!B74","v":"CHRISTEENA PAULSON"},null,4,5,9]
[]
["Total Marks scored for the Question",null,null,{"$f":"IF(D$22<>\"\",IF(SUM(D25:INDIRECT(D96))>=0,SUM(D25:INDIRECT(D96)),\"\"),\"\")","v":224},{"$f":"IF(E$22<>\"\",IF(SUM(E25:INDIRECT(E96))>=0,SUM(E25:INDIRECT(E96)),\"\"),\"\")","v":224}]
["No. of Students who attended the Question",null,null,{"$f":"IF(D$22<>\"\",IF(COUNT(D25:INDIRECT(D96))>=0,COUNT(D25:INDIRECT(D96)),\"\"),\"\")","v":50},{"$f":"IF(E$22<>\"\",IF(COUNT(E25:INDIRECT(E96))>=0,COUNT(E25:INDIRECT(E96)),\"\"),\"\")","v":50}]
["Difficulty Level marks of the Question",null,null,{"$f":"IF(D21*D22/100=0,\"\",D21*D22/100)","v":3},3]
["No. of Students who scored above the Difficulty Level",null,null,{"$f":"IF(COUNTIF(D25:INDIRECT(D96),\">=\"&D78)=0,\"\",COUNTIF(D25:INDIRECT(D96),\">=\"&D78))","v":46},{"$f":"IF(COUNTIF(E25:INDIRECT(E96),\">=\"&E78)=0,\"\",COUNTIF(E25:INDIRECT(E96),\">=\"&E78))","v":46}]
["% of Students who scored above the Difficulty Level",null,null,{"$f":"IFERROR(ROUND(D79/D77*100,2),\"\")","v":92},92]
[null,null,null,{"$f":"IF(D80=\"\",0,IF(D80>=80,3,IF(D80>=70,2,IF(D80>=60,1,0))))","v":3},3,"Marks"]
[null,{"$f":"IF(Data_Sheet!A77<>\"\",\"Total Attainment level for \"&Data_Sheet!A77&\" :\",\"\")","v":"Total Attainment level for CO1 :"},{"$f":"IF(Data_Sheet!A77<>\"\",I82,\"\")","v":3},{"$f":"IFERROR((IF(ISNUMBER(SEARCH(\"1\", D$19)),D$21,\"0\")),\"0\")*D81","v":15},{"$f":"IFERROR((IF(ISNUMBER(SEARCH(\"1\", E$19)),E$21,\"0\")),\"0\")*E81","v":15},{"$f":"F99","v":10},null,null,{"$f":"IF(F82=0,\"\",ROUND(SUM(D82:E82)/F82,2))","v":3},"T_Marks","S_Marks","Students","Level","Above","Above %","Attainment"]
[null,{"$f":"IF(Data_Sheet!A78<>\"\",\"Total Attainment level for \"&Data_Sheet!A78&\" :\",\"\")","v":"Total Attainment level for CO2 :"},{"$f":"IF(Data_Sheet!A78<>\"\",I83,\"\")","v":3},{"$f":"IFERROR((IF(ISNUMBER(SEARCH(\"2\", D$19)),D$21,\"0\")),\"0\")*D81","v":0},{"$f":"IFERROR((IF(ISNUMBER(SEARCH(\"2\", E$19)),E$21,\"0\")),\"0\")*E81","v":15},{"$f":"F100","v":5},null,null,3,{"$f":"F99","v":10},{"$f":"F106","v":448},{"$f":"F113","v":100},{"$f":"F120","v":6},{"$f":"F127","v":92},{"$f":"IFERROR(ROUND(N83/L83*100,2),\"\")","v":92},{"$f":"IF(O83=\"\",\"\",IF(O83>=80,3,IF(O83>=70,2,IF(O83>=60,1,0))))","v":3}]
[null,{"$f":"IF(Data_Sheet!A79<>\"\",\"Total Attainment level for \"&Data_Sheet!A79&\" :\",\"\")","v":"Total Attainment level for CO3 :"},{"$f":"IF(Data_Sheet!A79<>\"\",I84,\"\")","v":""},{"$f":"IFERROR((IF(ISNUMBER(SEARCH(\"3\", D$19)),D$21,\"0\")),\"0\")*D81","v":0},{"$f":"IFERROR((IF(ISNUMBER(SEARCH(\"3\", E$19)),E$21,\"0\")),\"0\")*E81","v":0},0,null,null,"",{"$f":"F100","v":5},{"$f":"F107","v":224},{"$f":"F114","v":50},{"$f":"F121","v":3},{"$f":"F128","v":46},{"$f":"IFERROR(ROUND(N84/L84*100,2),\"\")","v":92},{"$f":"IF(O84=\"\",\"\",IF(O84>=80,3,IF(O84>=70,2,IF(O84>=60,1,0))))","v":3}]
[null,{"$f":"IF(Data_Sheet!A80<>\"\",\"Total Attainment level for \"&Data_Sheet!A80&\" :\",\"\")","v":"Total Attainment level for CO4 :"},{"$f":"IF(Data_Sheet!A80<>\"\",I85,\"\")","v":""},{"$f":"IFERROR((IF(ISNUMBER(SEARCH(\"4\", D$19)),D$21,\"0\")),\"0\")*D81","v":0},{"$f":"IFERROR((IF(ISNUMBER(SEARCH(\"4\", E$19)),E$21,\"0\")),\"0\")*E81","v":0},0,null,null,"",0,0,0,0,0,"",""]
[null,{"$f":"IF(Data_Sheet!A81<>\"\",\"Total Attainment level for \"&Data_Sheet!A81&\" :\",\"\")","v":"Total Attainment level for CO5 :"},{"$f":"IF(Data_Sheet!A81<>\"\",I86,\"\")","v":""},{"$f":"IFERROR((IF(ISNUMBER(SEARCH(\"5\", D$19)),D$21,\"0\")),\"0\")*D81","v":0},{"$f":"IFERROR((IF(ISNUMBER(SEARCH(\"5\", E$19)),E$21,\"0\")),\"0\")*E81","v":0},0,null,null,"",0,0,0,0,0,"",""]
[null,{"$f":"IF(Data_Sheet!A82<>\"\",\"Total Attainment level for \"&Data_Sheet!A82&\" :\",\"\")","v":"Total Attainment level for CO6 :"},{"$f":"IF(Data_Sheet!A82<>\"\",I87,\"\")","v":3},{"$f":"IFERROR((IF(ISNUMBER(SEARCH(\"6\", D$19)),D$21,\"0\")),\"0\")*D81","v":15},{"$f":"IFERROR((IF(ISNUMBER(SEARCH(\"6\", E$19)),E$21,\"0\")),\"0\")*E81","v":0},5,null,null,3,0,0,0,0,0,"",""]
[null,null,null,null,null,null,null,null,null,5,224,50,3,46,92,3]
[{"$f":"Data_Sheet!A85","v":"Attainment Level 1: 60% students scoring more than 60% of the Total Marks"}]
[{"$f":"Data_Sheet!A86","v":"Attainment Level 2: 70% students scoring more than 60% of the Total Marks"}]
[{"$f":"Data_Sheet!A87","v":"Attainment Level 3: 80% students scoring more than 60% of the Total Marks"}]
[]
[null,{"$f":"Data_Sheet!B10","v":"Name of Faculty : "},{"$f":"Data_Sheet!B11","v":"PONMANI RAJA M"}]
[null,{"$f":"Data_Sheet!B94","v":"Dated Signature :  "}]
[]
[null,"Last Row Count",{"$f":"ROW(A76)-2","v":74},{"$f":"SUBSTITUTE(ADDRESS(1,COLUMN(D1),2),\"1\",\"\")&$C$96","v":"D$74"},{"$f":"\"E\"&$C$96","v":"E74"}]
[]
[]
[null,null,"CO1",{"$f":"IFERROR((IF(ISNUMBER(SEARCH(\"1\", D$19)),D$21,\"0\")),\"0\")","v":5},{"$f":"IFERROR((IF(ISNUMBER(SEARCH(\"1\", E$19)),E$21,\"0\")),\"0\")","v":5},{"$f":"IFERROR(SUM($D99:INDIRECT($I99)),\"0\")","v":10},null,null,{"$f":"SUBSTITUTE(ADDRESS(1,K99,4),1,\"\")&ROW($I99)","v":"E99"},{"$f":"COUNTIF($D$20:INDIRECT($L99),\"*1*\")","v":0},{"$f":"COLUMN($F$19)-1","v":5},{"$f":"SUBSTITUTE(ADDRESS(1,K99,4),1,\"\")&ROW($I$19)+1","v":"E20"},"Total Marks"]
[null,null,"CO2",{"$f":"IFERROR((IF(ISNUMBER(SEARCH(\"2\", D$19)),D$21,\"0\")),\"0\")","v":"0"},{"$f":"IFERROR((IF(ISNUMBER(SEARCH(\"2\", E$19)),E$21,\"0\")),\"0\")","v":5},{"$f":"IFERROR(SUM($D100:INDIRECT($I100)),\"0\")","v":5},null,null,"E100",{"$f":"COUNTIF($D$20:INDIRECT($L100),\"*2*\")","v":0},{"$f":"COLUMN($F$19)-1","v":5},{"$f":"SUBSTITUTE(ADDRESS(1,K100,4),1,\"\")&ROW($I$19)+1","v":"E20"}]
[null,null,"CO3",{"$f":"IFERROR((IF(ISNUMBER(SEARCH(\"3\", D$19)),D$21,\"0\")),\"0\")","v":"0"},{"$f":"IFERROR((IF(ISNUMBER(SEARCH(\"3\", E$19)),E$21,\"0\")),\"0\")","v":"0"},{"$f":"IFERROR(SUM($D101:INDIRECT($I101)),\"0\")","v":0},null,null,"E101",{"$f":"COUNTIF($D$20:INDIRECT($L101),\"*2*\")","v":0},5,"E20"]
[null,null,"CO4",{"$f":"IFERROR((IF(ISNUMBER(SEARCH(\"4\", D$19)),D$21,\"0\")),\"0\")","v":"0"},{"$f":"IFERROR((IF(ISNUMBER(SEARCH(\"4\", E$19)),E$21,\"0\")),\"0\")","v":"0"},{"$f":"IFERROR(SUM($D102:INDIRECT($I102)),\"0\")","v":0},null,null,"E102",{"$f":"COUNTIF($D$20:INDIRECT($L102),\"*2*\")","v":0},5,"E20"]
[null,null,"CO5",{"$f":"IFERROR((IF(ISNUMBER(SEARCH(\"5\", D$19)),D$21,\"0\")),\"0\")","v":"0"},{"$f":"IFERROR((IF(ISNUMBER(SEARCH(\"5\", E$19)),E$21,\"0\")),\"0\")","v":"0"},{"$f":"IFERROR(SUM($D103:INDIRECT($I103)),\"0\")","v":0},null,null,"E103",{"$f":"COUNTIF($D$20:INDIRECT($L103),\"*2*\")","v":0},5,"E20"]
[null,null,"CO6",{"$f":"IFERROR((IF(ISNUMBER(SEARCH(\"6\", D$19)),D$21,\"0\")),\"0\")","v":5},{"$f":"IFERROR((IF(ISNUMBER(SEARCH(\"6\", E$19)),E$21,\"0\")),\"0\")","v":"0"},{"$f":"IFERROR(SUM($D104:INDIRECT($I104)),\"0\")","v":5},null,null,"E104",{"$f":"COUNTIF($D$20:INDIRECT($L104),\"*2*\")","v":0},5,"E20"]
[]
[null,null,"CO1",{"$f":"IFERROR((IF(ISNUMBER(SEARCH(\"1\", D$19)),D$76,\"0\")),\"0\")","v":224},{"$f":"IFERROR((IF(ISNUMBER(SEARCH(\"1\", E$19)),E$76,\"0\")),\"0\")","v":224},{"$f":"IFERROR(SUM($D106:INDIRECT($I106)),\"0\")","v":448},null,null,{"$f":"SUBSTITUTE(ADDRESS(1,K106,4),1,\"\")&ROW($I106)","v":"E106"},{"$f":"COUNTIF($D$20:INDIRECT($L106),\"*1*\")","v":0},{"$f":"COLUMN($F$19)-1","v":5},{"$f":"SUBSTITUTE(ADDRESS(1,K106,4),1,\"\")&ROW($I$19)+1","v":"E20"},"Total Marks Scored"]
[null,null,"CO2",{"$f":"IFERROR((IF(ISNUMBER(SEARCH(\"2\", D$19)),D$76,\"0\")),\"0\")","v":"0"},{"$f":"IFERROR((IF(ISNUMBER(SEARCH(\"2\", E$19)),E$76,\"0\")),\"0\")","v":224},{"$f":"IFERROR(SUM($D107:INDIRECT($I107)),\"0\")","v":224},null,null,"E107",{"$f":"COUNTIF($D$20:INDIRECT($L107),\"*2*\")","v":0},{"$f":"COLUMN($F$19)-1","v":5},{"$f":"SUBSTITUTE(ADDRESS(1,K107,4),1,\"\")&ROW($I$19)+1","v":"E20"}]
[null,null,"CO3",{"$f":"IFERROR((IF(ISNUMBER(SEARCH(\"3\", D$19)),D$76,\"0\")),\"0\")","v":"0"},{"$f":"IFERROR((IF(ISNUMBER(SEARCH(\"3\", E$19)),E$76,\"0\")),\"0\")","v":"0"},{"$f":"IFERROR(SUM($D108:INDIRECT($I108)),\"0\")","v":0},null,null,"E108",{"$f":"COUNTIF($D$20:INDIRECT($L108),\"*2*\")","v":0},5,"E20"]
[null,null,"CO4",{"$f":"IFERROR((IF(ISNUMBER(SEARCH(\"4\", D$19)),D$76,\"0\")),\"0\")","v":"0"},{"$f":"IFERROR((IF(ISNUMBER(SEARCH(\"4\", E$19)),E$76,\"0\")),\"0\")","v":"0"},{"$f":"IFERROR(SUM($D109:INDIRECT($I109)),\"0\")","v":0},null,null,"E109",{"$f":"COUNTIF($D$20:INDIRECT($L109),\"*2*\")","v":0},5,"E20"]
[null,null,"CO5",{"$f":"IFERROR((IF(ISNUMBER(SEARCH(\"5\", D$19)),D$76,\"0\")),\"0\")","v":"0"},{"$f":"IFERROR((IF(ISNUMBER(SEARCH(\"5\", E$19)),E$76,\"0\")),\"0\")","v":"0"},{"$f":"IFERROR(SUM($D110:INDIRECT($I110)),\"0\")","v":0},null,null,"E110",{"$f":"COUNTIF($D$20:INDIRECT($L110),\"*2*\")","v":0},5,"E20"]
[null,null,"CO6",{"$f":"IFERROR((IF(ISNUMBER(SEARCH(\"6\", D$19)),D$76,\"0\")),\"0\")","v":224},{"$f":"IFERROR((IF(ISNUMBER(SEARCH(\"6\", E$19)),E$76,\"0\")),\"0\")","v":"0"},{"$f":"IFERROR(SUM($D111:INDIRECT($I111)),\"0\")","v":224},null,null,"E111",{"$f":"COUNTIF($D$20:INDIRECT($L111),\"*2*\")","v":0},5,"E20"]
[]
[null,null,"CO1",{"$f":"IFERROR((IF(ISNUMBER(SEARCH(\"1\", D$19)),D$77,\"0\")),\"0\")","v":50},{"$f":"IFERROR((IF(ISNUMBER(SEARCH(\"1\", E$19)),E$77,\"0\")),\"0\")","v":50},{"$f":"IFERROR(SUM($D113:INDIRECT($I113)),\"0\")","v":100},null,null,{"$f":"SUBSTITUTE(ADDRESS(1,K113,4),1,\"\")&ROW($I113)","v":"E113"},{"$f":"COUNTIF($D$20:INDIRECT($L113),\"*1*\")","v":0},{"$f":"COLUMN($F$19)-1","v":5},{"$f":"SUBSTITUTE(ADDRESS(1,K113,4),1,\"\")&ROW($I$19)+1","v":"E20"},"No of Studdents Attended"]
[null,null,"CO2",{"$f":"IFERROR((IF(ISNUMBER(SEARCH(\"2\", D$19)),D$77,\"0\")),\"0\")","v":"0"},{"$f":"IFERROR((IF(ISNUMBER(SEARCH(\"2\", E$19)),E$77,\"0\")),\"0\")","v":50},{"$f":"IFERROR(SUM($D114:INDIRECT($I114)),\"0\")","v":50},null,null,"E114",{"$f":"COUNTIF($D$20:INDIRECT($L114),\"*2*\")","v":0},{"$f":"COLUMN($F$19)-1","v":5},{"$f":"SUBSTITUTE(ADDRESS(1,K114,4),1,\"\")&ROW($I$19)+1","v":"E20"}]
[null,null,"CO3",{"$f":"IFERROR((IF(ISNUMBER(SEARCH(\"3\", D$19)),D$77,\"0\")),\"0\")","v":"0"},{"$f":"IFERROR((IF(ISNUMBER(SEARCH(\"3\", E$19)),E$77,\"0\")),\"0\")","v":"0"},{"$f":"IFERROR(SUM($D115:INDIRECT($I115)),\"0\")","v":0},null,null,"E115",{"$f":"COUNTIF($D$20:INDIRECT($L115),\"*2*\")","v":0},5,"E20"]
[null,null,"CO4",{"$f":"IFERROR((IF(ISNUMBER(SEARCH(\"4\", D$19)),D$77,\"0\")),\"0\")","v":"0"},{"$f":"IFERROR((IF(ISNUMBER(SEARCH(\"4\", E$19)),E$77,\"0\")),\"0\")","v":"0"},{"$f":"IFERROR(SUM($D116:INDIRECT($I116)),\"0\")","v":0},null,null,"E116",{"$f":"COUNTIF($D$20:INDIRECT($L116),\"*2*\")","v":0},5,"E20"]
[null,null,"CO5",{"$f":"IFERROR((IF(ISNUMBER(SEARCH(\"5\", D$19)),D$77,\"0\")),\"0\")","v":"0"},{"$f":"IFERROR((IF(ISNUMBER(SEARCH(\"5\", E$19)),E$77,\"0\")),\"0\")","v":"0"},{"$f":"IFERROR(SUM($D117:INDIRECT($I117)),\"0\")","v":0},null,null,"E117",{"$f":"COUNTIF($D$20:INDIRECT($L117),\"*2*\")","v":0},5,"E20"]
[null,null,"CO6",{"$f":"IFERROR((IF(ISNUMBER(SEARCH(\"6\", D$19)),D$77,\"0\")),\"0\")","v":50},{"$f":"IFERROR((IF(ISNUMBER(SEARCH(\"6\", E$19)),E$77,\"0\")),\"0\")","v":"0"},{"$f":"IFERROR(SUM($D118:INDIRECT($I118)),\"0\")","v":50},null,null,"E118",{"$f":"COUNTIF($D$20:INDIRECT($L118),\"*2*\")","v":0},5,"E20"]
[]
[null,null,"CO1",{"$f":"IFERROR((IF(ISNUMBER(SEARCH(\"1\", D$19)),D$78,\"0\")),\"0\")","v":3},{"$f":"IFERROR((IF(ISNUMBER(SEARCH(\"1\", E$19)),E$78,\"0\")),\"0\")","v":3},{"$f":"IFERROR(SUM($D120:INDIRECT($I120)),\"0\")","v":6},null,null,{"$f":"SUBSTITUTE(ADDRESS(1,K120,4),1,\"\")&ROW($I120)","v":"E120"},{"$f":"COUNTIF($D$20:INDIRECT($L120),\"*1*\")","v":0},{"$f":"COLUMN($F$19)-1","v":5},{"$f":"SUBSTITUTE(ADDRESS(1,K120,4),1,\"\")&ROW($I$19)+1","v":"E20"},"Difficulty Level"]
[null,null,"CO2",{"$f":"IFERROR((IF(ISNUMBER(SEARCH(\"2\", D$19)),D$78,\"0\")),\"0\")","v":"0"},{"$f":"IFERROR((IF(ISNUMBER(SEARCH(\"2\", E$19)),E$78,\"0\")),\"0\")","v":3},{"$f":"IFERROR(SUM($D121:INDIRECT($I121)),\"0\")","v":3},null,null,"E121",{"$f":"COUNTIF($D$20:INDIRECT($L121),\"*2*\")","v":0},{"$f":"COLUMN($F$19)-1","v":5},{"$f":"SUBSTITUTE(ADDRESS(1,K121,4),1,\"\")&ROW($I$19)+1","v":"E20"}]
[null,null,"CO3",{"$f":"IFERROR((IF(ISNUMBER(SEARCH(\"3\", D$19)),D$78,\"0\")),\"0\")","v":"0"},{"$f":"IFERROR((IF(ISNUMBER(SEARCH(\"3\", E$19)),E$78,\"0\")),\"0\")","v":"0"},{"$f":"IFERROR(SUM($D122:INDIRECT($I122)),\"0\")","v":0},null,null,"E122",{"$f":"COUNTIF($D$20:INDIRECT($L122),\"*2*\")","v":0},5,"E20"]
[null,null,"CO4",{"$f":"IFERROR((IF(ISNUMBER(SEARCH(\"4\", D$19)),D$78,\"0\")),\"0\")","v":"0"},{"$f":"IFERROR((IF(ISNUMBER(SEARCH(\"4\", E$19)),E$78,\"0\")),\"0\")","v":"0"},{"$f":"IFERROR(SUM($D123:INDIRECT($I123)),\"0\")","v":0},null,null,"E123",{"$f":"COUNTIF($D$20:INDIRECT($L123),\"*2*\")","v":0},5,"E20"]
[null,null,"CO5",{"$f":"IFERROR((IF(ISNUMBER(SEARCH(\"5\", D$19)),D$78,\"0\")),\"0\")","v":"0"},{"$f":"IFERROR((IF(ISNUMBER(SEARCH(\"5\", E$19)),E$78,\"0\")),\"0\")","v":"0"},{"$f":"IFERROR(SUM($D124:INDIRECT($I124)),\"0\")","v":0},null,null,"E124",{"$f":"COUNTIF($D$20:INDIRECT($L124),\"*2*\")","v":0},5,"E20"]
[null,null,"CO6",{"$f":"IFERROR((IF(ISNUMBER(SEARCH(\"6\", D$19)),D$78,\"0\")),\"0\")","v":3},{"$f":"IFERROR((IF(ISNUMBER(SEARCH(\"6\", E$19)),E$78,\"0\")),\"0\")","v":"0"},{"$f":"IFERROR(SUM($D125:INDIRECT($I125)),\"0\")","v":3},null,null,"E125",{"$f":"COUNTIF($D$20:INDIRECT($L125),\"*2*\")","v":0},5,"E20"]
[]
[null,null,"CO1",{"$f":"IFERROR((IF(ISNUMBER(SEARCH(\"1\", D$19)),D$79,\"0\")),\"0\")","v":46},{"$f":"IFERROR((IF(ISNUMBER(SEARCH(\"1\", E$19)),E$79,\"0\")),\"0\")","v":46},{"$f":"IFERROR(SUM($D127:INDIRECT($I127)),\"0\")","v":92},null,null,{"$f":"SUBSTITUTE(ADDRESS(1,K127,4),1,\"\")&ROW($I127)","v":"E127"},{"$f":"COUNTIF($D$20:INDIRECT($L127),\"*1*\")","v":0},{"$f":"COLUMN($F$19)-1","v":5},{"$f":"SUBSTITUTE(ADDRESS(1,K127,4),1,\"\")&ROW($I$19)+1","v":"E20"},"No of Studdents Above Difficulty Level"]
[null,null,"CO2",{"$f":"IFERROR((IF(ISNUMBER(SEARCH(\"2\", D$19)),D$79,\"0\")),\"0\")","v":"0"},{"$f":"IFERROR((IF(ISNUMBER(SEARCH(\"2\", E$19)),E$79,\"0\")),\"0\")","v":46},{"$f":"IFERROR(SUM($D128:INDIRECT($I128)),\"0\")","v":46},null,null,"E128",{"$f":"COUNTIF($D$20:INDIRECT($L128),\"*2*\")","v":0},{"$f":"COLUMN($F$19)-1","v":5},{"$f":"SUBSTITUTE(ADDRESS(1,K128,4),1,\"\")&ROW($I$19)+1","v":"E20"}]
[null,null,"CO3",{"$f":"IFERROR((IF(ISNUMBER(SEARCH(\"3\", D$19)),D$79,\"0\")),\"0\")","v":"0"},{"$f":"IFERROR((IF(ISNUMBER(SEARCH(\"3\", E$19)),E$79,\"0\")),\"0\")","v":"0"},{"$f":"IFERROR(SUM($D129:INDIRECT($I129)),\"0\")","v":0},null,null,"E129",{"$f":"COUNTIF($D$20:INDIRECT($L129),\"*2*\")","v":0},5,"E20"]
[null,null,"CO4",{"$f":"IFERROR((IF(ISNUMBER(SEARCH(\"4\", D$19)),D$79,\"0\")),\"0\")","v":"0"},{"$f":"IFERROR((IF(ISNUMBER(SEARCH(\"4\", E$19)),E$79,\"0\")),\"0\")","v":"0"},{"$f":"IFERROR(SUM($D130:INDIRECT($I130)),\"0\")","v":0},null,null,"E130",{"$f":"COUNTIF($D$20:INDIRECT($L130),\"*2*\")","v":0},5,"E20"]
[null,null,"CO5",{"$f":"IFERROR((IF(ISNUMBER(SEARCH(\"5\", D$19)),D$79,\"0\")),\"0\")","v":"0"},{"$f":"IFERROR((IF(ISNUMBER(SEARCH(\"5\", E$19)),E$79,\"0\")),\"0\")","v":"0"},{"$f":"IFERROR(SUM($D131:INDIRECT($I131)),\"0\")","v":0},null,null,"E131",{"$f":"COUNTIF($D$20:INDIRECT($L131),\"*2*\")","v":0},5,"E20"]
[null,null,"CO6",{"$f":"IFERROR((IF(ISNUMBER(SEARCH(\"6\", D$19)),D$79,\"0\")),\"0\")","v":46},{"$f":"IFERROR((IF(ISNUMBER(SEARCH(\"6\", E$19)),E$79,\"0\")),\"0\")","v":"0"},{"$f":"IFERROR(SUM($D132:INDIRECT($I132)),\"0\")","v":46},null,null,"E132",{"$f":"COUNTIF($D$20:INDIRECT($L132),\"*2*\")","v":0},5,"E20"]
[]
[null,null,1,{"$f":"IFERROR((IF(ISNUMBER(SEARCH(\"1\", D$20)),D$21/IF(LEN(D20)=16,6,IF(LEN(D20)=13,5,IF(LEN(D20)=10,4,IF(LEN(D20)=7,3,IF(LEN(D20)=4,2,1))))),\"0\")),\"0\")","v":"0"},{"$f":"IFERROR((IF(ISNUMBER(SEARCH(\"1\", E$20)),E$21/IF(LEN(E20)=16,6,IF(LEN(E20)=13,5,IF(LEN(E20)=10,4,IF(LEN(E20)=7,3,IF(LEN(E20)=4,2,1))))),\"0\")),\"0\")","v":"0"},{"$f":"IFERROR(SUM($D134:INDIRECT($I134)),\"0\")","v":0},null,null,{"$f":"SUBSTITUTE(ADDRESS(1,K134,4),1,\"\")&ROW($I134)","v":"E134"},{"$f":"COUNTIF($D$20:INDIRECT($L134),\"1\")","v":0},{"$f":"COLUMN($F$18)-1","v":5},{"$f":"SUBSTITUTE(ADDRESS(1,K134,4),1,\"\")&ROW($I$19)+1","v":"E20"}]
[null,null,2,{"$f":"IFERROR((IF(ISNUMBER(SEARCH(\"2\", D$20)),D$21/IF(LEN(D20)=16,6,IF(LEN(D20)=13,5,IF(LEN(D20)=10,4,IF(LEN(D20)=7,3,IF(LEN(D20)=4,2,1))))),\"0\")),\"0\")","v":"0"},{"$f":"IFERROR((IF(ISNUMBER(SEARCH(\"2\", E$20)),E$21/IF(LEN(E20)=16,6,IF(LEN(E20)=13,5,IF(LEN(E20)=10,4,IF(LEN(E20)=7,3,IF(LEN(E20)=4,2,1))))),\"0\")),\"0\")","v":"0"},{"$f":"IFERROR(SUM($D135:INDIRECT($I135)),\"0\")","v":0},null,null,{"$f":"SUBSTITUTE(ADDRESS(1,K135,4),1,\"\")&ROW($I135)","v":"E135"},{"$f":"COUNTIF($D$20:INDIRECT($L135),\"2\")","v":0},{"$f":"COLUMN($F$18)-1","v":5},{"$f":"SUBSTITUTE(ADDRESS(1,K135,4),1,\"\")&ROW($I$19)+1","v":"E20"}]
[null,null,3,{"$f":"IFERROR((IF(ISNUMBER(SEARCH(\"3\", D$20)),D$21/IF(LEN(D20)=16,6,IF(LEN(D20)=13,5,IF(LEN(D20)=10,4,IF(LEN(D20)=7,3,IF(LEN(D20)=4,2,1))))),\"0\")),\"0\")","v":"0"},{"$f":"IFERROR((IF(ISNUMBER(SEARCH(\"3\", E$20)),E$21/IF(LEN(E20)=16,6,IF(LEN(E20)=13,5,IF(LEN(E20)=10,4,IF(LEN(E20)=7,3,IF(LEN(E20)=4,2,1))))),\"0\")),\"0\")","v":"0"},{"$f":"IFERROR(SUM($D136:INDIRECT($I136)),\"0\")","v":0},null,null,"E136",{"$f":"COUNTIF($D$20:INDIRECT($L136),\"3\")","v":0},5,"E20"]
[null,null,4,{"$f":"IFERROR((IF(ISNUMBER(SEARCH(\"4\", D$20)),D$21/IF(LEN(D20)=16,6,IF(LEN(D20)=13,5,IF(LEN(D20)=10,4,IF(LEN(D20)=7,3,IF(LEN(D20)=4,2,1))))),\"0\")),\"0\")","v":2.5},{"$f":"IFERROR((IF(ISNUMBER(SEARCH(\"4\", E$20)),E$21/IF(LEN(E20)=16,6,IF(LEN(E20)=13,5,IF(LEN(E20)=10,4,IF(LEN(E20)=7,3,IF(LEN(E20)=4,2,1))))),\"0\")),\"0\")","v":"0"},{"$f":"IFERROR(SUM($D137:INDIRECT($I137)),\"0\")","v":2.5},null,null,"E137",{"$f":"COUNTIF($D$20:INDIRECT($L137),\"4\")","v":0},5,"E20"]
[null,null,5,{"$f":"IFERROR((IF(ISNUMBER(SEARCH(\"5\", D$20)),D$21/IF(LEN(D20)=16,6,IF(LEN(D20)=13,5,IF(LEN(D20)=10,4,IF(LEN(D20)=7,3,IF(LEN(D20)=4,2,1))))),\"0\")),\"0\")","v":2.5},{"$f":"IFERROR((IF(ISNUMBER(SEARCH(\"5\", E$20)),E$21/IF(LEN(E20)=16,6,IF(LEN(E20)=13,5,IF(LEN(E20)=10,4,IF(LEN(E20)=7,3,IF(LEN(E20)=4,2,1))))),\"0\")),\"0\")","v":2.5},{"$f":"IFERROR(SUM($D138:INDIRECT($I138)),\"0\")","v":5},null,null,"E138",{"$f":"COUNTIF($D$20:INDIRECT($L138),\"5\")","v":0},5,"E20"]
[null,null,6,{"$f":"IFERROR((IF(ISNUMBER(SEARCH(\"6\", D$20)),D$21/IF(LEN(D20)=16,6,IF(LEN(D20)=13,5,IF(LEN(D20)=10,4,IF(LEN(D20)=7,3,IF(LEN(D20)=4,2,1))))),\"0\")),\"0\")","v":"0"},{"$f":"IFERROR((IF(ISNUMBER(SEARCH(\"6\", E$20)),E$21/IF(LEN(E20)=16,6,IF(LEN(E20)=13,5,IF(LEN(E20)=10,4,IF(LEN(E20)=7,3,IF(LEN(E20)=4,2,1))))),\"0\")),\"0\")","v":2.5},{"$f":"IFERROR(SUM($D139:INDIRECT($I139)),\"0\")","v":2.5},null,null,"E139",{"$f":"COUNTIF($D$20:INDIRECT($L139),\"6\")","v":0},5,"E20"]

{"sheet":"A2_Analysis","index":11,"n_rows":89,"n_cols":5,"rows_kept":89,"cut":false,"hidden":false,"merged":[[2,0,2,3],[4,0,4,3],[6,0,6,3],[8,0,8,3]]}
[]
[]
[{"$f":"Data_Sheet!A2","v":"Jyothi Engineering College, Cheruthuruthy"}]
[]
[{"$f":"Data_Sheet!A4","v":"Department of Electrical & Electronics Engineering"}]
[]
[{"$f":"'A2'!A11:F11","v":"CO Analysis - Internal Marks : Assignment - 2                       21-03-18"}]
[]
[{"$f":"Data_Sheet!A17","v":"S7 EC              EC407 Computer Communication               2019-20"}]
[]
[]
[]
[]
[]
[]
[]
[]
[]
[]
[]
[]
[{"$f":"'T1'!A18","v":"Register No."},{"$f":"'T1'!B18","v":"Name of Student"},{"$f":"'A2'!F18","v":"Total Marks (10)"},"Category"]
[]
["Column1","Column2","Column3","Column4"]
[{"$f":"Data_Sheet!A25","v":"JEC16EC051"},{"$f":"Data_Sheet!B25","v":"LANA KOLLATH"},{"$f":"'A2'!F25","v":10},{"$f":"IF(C25=\"A\",\"ABSENT\",IF(C25>='A2'!$E$5*$E$82/100,\"EXCELLENT\",IF(C25>='A2'!$E$5*$E$81/100,\"GOOD\",IF(C25>='A2'!$E$5*$E$80/100,\"AVERAGE\",\"POOR\"))))","v":"EXCELLENT"}]
[{"$f":"Data_Sheet!A26","v":"JEC16EC052"},{"$f":"Data_Sheet!B26","v":"MANU JENSON"},{"$f":"'A2'!F26","v":10},{"$f":"IF(C26=\"A\",\"ABSENT\",IF(C26>='A2'!$E$5*$E$82/100,\"EXCELLENT\",IF(C26>='A2'!$E$5*$E$81/100,\"GOOD\",IF(C26>='A2'!$E$5*$E$80/100,\"AVERAGE\",\"POOR\"))))","v":"EXCELLENT"}]
[{"$f":"Data_Sheet!A27","v":"JEC16EC053"},{"$f":"Data_Sheet!B27","v":"MAREENA MARIYA ABRAHAM"},{"$f":"'A2'!F27","v":10},{"$f":"IF(C27=\"A\",\"ABSENT\",IF(C27>='A2'!$E$5*$E$82/100,\"EXCELLENT\",IF(C27>='A2'!$E$5*$E$81/100,\"GOOD\",IF(C27>='A2'!$E$5*$E$80/100,\"AVERAGE\",\"POOR\"))))","v":"EXCELLENT"}]
[{"$f":"Data_Sheet!A28","v":"JEC16EC054"},{"$f":"Data_Sheet!B28","v":"MARIAN DAVIS KATTUKARAN"},{"$f":"'A2'!F28","v":9},{"$f":"IF(C28=\"A\",\"ABSENT\",IF(C28>='A2'!$E$5*$E$82/100,\"EXCELLENT\",IF(C28>='A2'!$E$5*$E$81/100,\"GOOD\",IF(C28>='A2'!$E$5*$E$80/100,\"AVERAGE\",\"POOR\"))))","v":"EXCELLENT"}]
[{"$f":"Data_Sheet!A29","v":"JEC16EC055"},{"$f":"Data_Sheet!B29","v":"MARY JEETHU A J"},{"$f":"'A2'!F29","v":10},{"$f":"IF(C29=\"A\",\"ABSENT\",IF(C29>='A2'!$E$5*$E$82/100,\"EXCELLENT\",IF(C29>='A2'!$E$5*$E$81/100,\"GOOD\",IF(C29>='A2'!$E$5*$E$80/100,\"AVERAGE\",\"POOR\"))))","v":"EXCELLENT"}]
[{"$f":"Data_Sheet!A30","v":"JEC16EC056"},{"$f":"Data_Sheet!B30","v":"MUBASHIRA K M"},{"$f":"'A2'!F30","v":10},{"$f":"IF(C30=\"A\",\"ABSENT\",IF(C30>='A2'!$E$5*$E$82/100,\"EXCELLENT\",IF(C30>='A2'!$E$5*$E$81/100,\"GOOD\",IF(C30>='A2'!$E$5*$E$80/100,\"AVERAGE\",\"POOR\"))))","v":"EXCELLENT"}]
[{"$f":"Data_Sheet!A31","v":"JEC16EC057"},{"$f":"Data_Sheet!B31","v":"MUHAMMED ARSHAD"},{"$f":"'A2'!F31","v":10},{"$f":"IF(C31=\"A\",\"ABSENT\",IF(C31>='A2'!$E$5*$E$82/100,\"EXCELLENT\",IF(C31>='A2'!$E$5*$E$81/100,\"GOOD\",IF(C31>='A2'!$E$5*$E$80/100,\"AVERAGE\",\"POOR\"))))","v":"EXCELLENT"}]
[{"$f":"Data_Sheet!A32","v":"JEC16EC058"},{"$f":"Data_Sheet!B32","v":"NANDANA K"},{"$f":"'A2'!F32","v":10},{"$f":"IF(C32=\"A\",\"ABSENT\",IF(C32>='A2'!$E$5*$E$82/100,\"EXCELLENT\",IF(C32>='A2'!$E$5*$E$81/100,\"GOOD\",IF(C32>='A2'!$E$5*$E$80/100,\"AVERAGE\",\"POOR\"))))","v":"EXCELLENT"}]
[{"$f":"Data_Sheet!A33","v":"JEC16EC059"},{"$f":"Data_Sheet!B33","v":"NARAYANAN M B"},{"$f":"'A2'!F33","v":9},{"$f":"IF(C33=\"A\",\"ABSENT\",IF(C33>='A2'!$E$5*$E$82/100,\"EXCELLENT\",IF(C33>='A2'!$E$5*$E$81/100,\"GOOD\",IF(C33>='A2'!$E$5*$E$80/100,\"AVERAGE\",\"POOR\"))))","v":"EXCELLENT"}]
[{"$f":"Data_Sheet!A34","v":"JEC16EC061"},{"$f":"Data_Sheet!B34","v":"NIKHIL KJ"},{"$f":"'A2'!F34","v":9},{"$f":"IF(C34=\"A\",\"ABSENT\",IF(C34>='A2'!$E$5*$E$82/100,\"EXCELLENT\",IF(C34>='A2'!$E$5*$E$81/100,\"GOOD\",IF(C34>='A2'!$E$5*$E$80/100,\"AVERAGE\",\"POOR\"))))","v":"EXCELLENT"}]
[{"$f":"Data_Sheet!A35","v":"JEC16EC062"},{"$f":"Data_Sheet!B35","v":"NIMISHA M S"},{"$f":"'A2'!F35","v":10},{"$f":"IF(C35=\"A\",\"ABSENT\",IF(C35>='A2'!$E$5*$E$82/100,\"EXCELLENT\",IF(C35>='A2'!$E$5*$E$81/100,\"GOOD\",IF(C35>='A2'!$E$5*$E$80/100,\"AVERAGE\",\"POOR\"))))","v":"EXCELLENT"}]
[{"$f":"Data_Sheet!A36","v":"JEC16EC063"},{"$f":"Data_Sheet!B36","v":"NIMISHA TONY"},{"$f":"'A2'!F36","v":10},{"$f":"IF(C36=\"A\",\"ABSENT\",IF(C36>='A2'!$E$5*$E$82/100,\"EXCELLENT\",IF(C36>='A2'!$E$5*$E$81/100,\"GOOD\",IF(C36>='A2'!$E$5*$E$80/100,\"AVERAGE\",\"POOR\"))))","v":"EXCELLENT"}]
[{"$f":"Data_Sheet!A37","v":"JEC16EC064"},{"$f":"Data_Sheet!B37","v":"NITHIN"},{"$f":"'A2'!F37","v":10},{"$f":"IF(C37=\"A\",\"ABSENT\",IF(C37>='A2'!$E$5*$E$82/100,\"EXCELLENT\",IF(C37>='A2'!$E$5*$E$81/100,\"GOOD\",IF(C37>='A2'!$E$5*$E$80/100,\"AVERAGE\",\"POOR\"))))","v":"EXCELLENT"}]
[{"$f":"Data_Sheet!A38","v":"JEC16EC065"},{"$f":"Data_Sheet!B38","v":"OLIVIA NELSON"},{"$f":"'A2'!F38","v":10},{"$f":"IF(C38=\"A\",\"ABSENT\",IF(C38>='A2'!$E$5*$E$82/100,\"EXCELLENT\",IF(C38>='A2'!$E$5*$E$81/100,\"GOOD\",IF(C38>='A2'!$E$5*$E$80/100,\"AVERAGE\",\"POOR\"))))","v":"EXCELLENT"}]
[{"$f":"Data_Sheet!A39","v":"JEC16EC066"},{"$f":"Data_Sheet!B39","v":"PAVITHRA.P"},{"$f":"'A2'!F39","v":10},{"$f":"IF(C39=\"A\",\"ABSENT\",IF(C39>='A2'!$E$5*$E$82/100,\"EXCELLENT\",IF(C39>='A2'!$E$5*$E$81/100,\"GOOD\",IF(C39>='A2'!$E$5*$E$80/100,\"AVERAGE\",\"POOR\"))))","v":"EXCELLENT"}]
[{"$f":"Data_Sheet!A40","v":"JEC16EC067"},{"$f":"Data_Sheet!B40","v":"P.DHANYA RAJ"},{"$f":"'A2'!F40","v":10},{"$f":"IF(C40=\"A\",\"ABSENT\",IF(C40>='A2'!$E$5*$E$82/100,\"EXCELLENT\",IF(C40>='A2'!$E$5*$E$81/100,\"GOOD\",IF(C40>='A2'!$E$5*$E$80/100,\"AVERAGE\",\"POOR\"))))","v":"EXCELLENT"}]
[{"$f":"Data_Sheet!A41","v":"JEC16EC068"},{"$f":"Data_Sheet!B41","v":"POOJA.P"},{"$f":"'A2'!F41","v":10},{"$f":"IF(C41=\"A\",\"ABSENT\",IF(C41>='A2'!$E$5*$E$82/100,\"EXCELLENT\",IF(C41>='A2'!$E$5*$E$81/100,\"GOOD\",IF(C41>='A2'!$E$5*$E$80/100,\"AVERAGE\",\"POOR\"))))","v":"EXCELLENT"}]
[{"$f":"Data_Sheet!A42","v":"JEC16EC069"},{"$f":"Data_Sheet!B42","v":"PRANAV"},{"$f":"'A2'!F42","v":10},{"$f":"IF(C42=\"A\",\"ABSENT\",IF(C42>='A2'!$E$5*$E$82/100,\"EXCELLENT\",IF(C42>='A2'!$E$5*$E$81/100,\"GOOD\",IF(C42>='A2'!$E$5*$E$80/100,\"AVERAGE\",\"POOR\"))))","v":"EXCELLENT"}]
[{"$f":"Data_Sheet!A43","v":"JEC16EC070"},{"$f":"Data_Sheet!B43","v":"PRASOBH KP"},{"$f":"'A2'!F43","v":9},{"$f":"IF(C43=\"A\",\"ABSENT\",IF(C43>='A2'!$E$5*$E$82/100,\"EXCELLENT\",IF(C43>='A2'!$E$5*$E$81/100,\"GOOD\",IF(C43>='A2'!$E$5*$E$80/100,\"AVERAGE\",\"POOR\"))))","v":"EXCELLENT"}]
[{"$f":"Data_Sheet!A44","v":"JEC16EC071"},{"$f":"Data_Sheet!B44","v":"PRINCE BENNY"},{"$f":"'A2'!F44","v":9},{"$f":"IF(C44=\"A\",\"ABSENT\",IF(C44>='A2'!$E$5*$E$82/100,\"EXCELLENT\",IF(C44>='A2'!$E$5*$E$81/100,\"GOOD\",IF(C44>='A2'!$E$5*$E$80/100,\"AVERAGE\",\"POOR\"))))","v":"EXCELLENT"}]
[{"$f":"Data_Sheet!A45","v":"JEC16EC072"},{"$f":"Data_Sheet!B45","v":"PRIYA.K"},{"$f":"'A2'!F45","v":10},{"$f":"IF(C45=\"A\",\"ABSENT\",IF(C45>='A2'!$E$5*$E$82/100,\"EXCELLENT\",IF(C45>='A2'!$E$5*$E$81/100,\"GOOD\",IF(C45>='A2'!$E$5*$E$80/100,\"AVERAGE\",\"POOR\"))))","v":"EXCELLENT"}]
[{"$f":"Data_Sheet!A46","v":"JEC16EC073"},{"$f":"Data_Sheet!B46","v":"RADHIKA"},{"$f":"'A2'!F46","v":10},{"$f":"IF(C46=\"A\",\"ABSENT\",IF(C46>='A2'!$E$5*$E$82/100,\"EXCELLENT\",IF(C46>='A2'!$E$5*$E$81/100,\"GOOD\",IF(C46>='A2'!$E$5*$E$80/100,\"AVERAGE\",\"POOR\"))))","v":"EXCELLENT"}]
[{"$f":"Data_Sheet!A47","v":"JEC16EC074"},{"$f":"Data_Sheet!B47","v":"RINOSHA.K.R"},{"$f":"'A2'!F47","v":10},{"$f":"IF(C47=\"A\",\"ABSENT\",IF(C47>='A2'!$E$5*$E$82/100,\"EXCELLENT\",IF(C47>='A2'!$E$5*$E$81/100,\"GOOD\",IF(C47>='A2'!$E$5*$E$80/100,\"AVERAGE\",\"POOR\"))))","v":"EXCELLENT"}]
[{"$f":"Data_Sheet!A48","v":"JEC16EC075"},{"$f":"Data_Sheet!B48","v":"RIYA ALBERT"},{"$f":"'A2'!F48","v":10},{"$f":"IF(C48=\"A\",\"ABSENT\",IF(C48>='A2'!$E$5*$E$82/100,\"EXCELLENT\",IF(C48>='A2'!$E$5*$E$81/100,\"GOOD\",IF(C48>='A2'!$E$5*$E$80/100,\"AVERAGE\",\"POOR\"))))","v":"EXCELLENT"}]
[{"$f":"Data_Sheet!A49","v":"JEC16EC076"},{"$f":"Data_Sheet!B49","v":"RIYA PS"},{"$f":"'A2'!F49","v":10},{"$f":"IF(C49=\"A\",\"ABSENT\",IF(C49>='A2'!$E$5*$E$82/100,\"EXCELLENT\",IF(C49>='A2'!$E$5*$E$81/100,\"GOOD\",IF(C49>='A2'!$E$5*$E$80/100,\"AVERAGE\",\"POOR\"))))","v":"EXCELLENT"}]
[{"$f":"Data_Sheet!A50","v":"JEC16EC077"},{"$f":"Data_Sheet!B50","v":"ROSHNI J NAIR"},{"$f":"'A2'!F50","v":10},{"$f":"IF(C50=\"A\",\"ABSENT\",IF(C50>='A2'!$E$5*$E$82/100,\"EXCELLENT\",IF(C50>='A2'!$E$5*$E$81/100,\"GOOD\",IF(C50>='A2'!$E$5*$E$80/100,\"AVERAGE\",\"POOR\"))))","v":"EXCELLENT"}]
[{"$f":"Data_Sheet!A51","v":"JEC16EC079"},{"$f":"Data_Sheet!B51","v":"SAFNA M"},{"$f":"'A2'!F51","v":9},{"$f":"IF(C51=\"A\",\"ABSENT\",IF(C51>='A2'!$E$5*$E$82/100,\"EXCELLENT\",IF(C51>='A2'!$E$5*$E$81/100,\"GOOD\",IF(C51>='A2'!$E$5*$E$80/100,\"AVERAGE\",\"POOR\"))))","v":"EXCELLENT"}]
[{"$f":"Data_Sheet!A52","v":"JEC16EC080"},{"$f":"Data_Sheet!B52","v":"SAJIN SHAJI"},{"$f":"'A2'!F52","v":10},{"$f":"IF(C52=\"A\",\"ABSENT\",IF(C52>='A2'!$E$5*$E$82/100,\"EXCELLENT\",IF(C52>='A2'!$E$5*$E$81/100,\"GOOD\",IF(C52>='A2'!$E$5*$E$80/100,\"AVERAGE\",\"POOR\"))))","v":"EXCELLENT"}]
[{"$f":"Data_Sheet!A53","v":"JEC16EC081"},{"$f":"Data_Sheet!B53","v":"SANDHRA .S"},{"$f":"'A2'!F53","v":10},{"$f":"IF(C53=\"A\",\"ABSENT\",IF(C53>='A2'!$E$5*$E$82/100,\"EXCELLENT\",IF(C53>='A2'!$E$5*$E$81/100,\"GOOD\",IF(C53>='A2'!$E$5*$E$80/100,\"AVERAGE\",\"POOR\"))))","v":"EXCELLENT"}]
[{"$f":"Data_Sheet!A54","v":"JEC16EC082"},{"$f":"Data_Sheet!B54","v":"SANGAMITHRA"},{"$f":"'A2'!F54","v":10},{"$f":"IF(C54=\"A\",\"ABSENT\",IF(C54>='A2'!$E$5*$E$82/100,\"EXCELLENT\",IF(C54>='A2'!$E$5*$E$81/100,\"GOOD\",IF(C54>='A2'!$E$5*$E$80/100,\"AVERAGE\",\"POOR\"))))","v":"EXCELLENT"}]
[{"$f":"Data_Sheet!A55","v":"JEC16EC083"},{"$f":"Data_Sheet!B55","v":"SARANYA.M.NAIR"},{"$f":"'A2'!F55","v":10},{"$f":"IF(C55=\"A\",\"ABSENT\",IF(C55>='A2'!$E$5*$E$82/100,\"EXCELLENT\",IF(C55>='A2'!$E$5*$E$81/100,\"GOOD\",IF(C55>='A2'!$E$5*$E$80/100,\"AVERAGE\",\"POOR\"))))","v":"EXCELLENT"}]
[{"$f":"Data_Sheet!A56","v":"JEC16EC084"},{"$f":"Data_Sheet!B56","v":"SARATHRAJ"},{"$f":"'A2'!F56","v":10},{"$f":"IF(C56=\"A\",\"ABSENT\",IF(C56>='A2'!$E$5*$E$82/100,\"EXCELLENT\",IF(C56>='A2'!$E$5*$E$81/100,\"GOOD\",IF(C56>='A2'!$E$5*$E$80/100,\"AVERAGE\",\"POOR\"))))","v":"EXCELLENT"}]
[{"$f":"Data_Sheet!A57","v":"JEC16EC085"},{"$f":"Data_Sheet!B57","v":"SHAHAN FATHIMA K"},{"$f":"'A2'!F57","v":10},{"$f":"IF(C57=\"A\",\"ABSENT\",IF(C57>='A2'!$E$5*$E$82/100,\"EXCELLENT\",IF(C57>='A2'!$E$5*$E$81/100,\"GOOD\",IF(C57>='A2'!$E$5*$E$80/100,\"AVERAGE\",\"POOR\"))))","v":"EXCELLENT"}]
[{"$f":"Data_Sheet!A58","v":"JEC16EC086"},{"$f":"Data_Sheet!B58","v":"SHAHLA.P.MOHAMMED"},{"$f":"'A2'!F58","v":10},{"$f":"IF(C58=\"A\",\"ABSENT\",IF(C58>='A2'!$E$5*$E$82/100,\"EXCELLENT\",IF(C58>='A2'!$E$5*$E$81/100,\"GOOD\",IF(C58>='A2'!$E$5*$E$80/100,\"AVERAGE\",\"POOR\"))))","v":"EXCELLENT"}]
[{"$f":"Data_Sheet!A59","v":"JEC16EC087"},{"$f":"Data_Sheet!B59","v":"SHAMSEENA T A"},{"$f":"'A2'!F59","v":0},{"$f":"IF(C59=\"A\",\"ABSENT\",IF(C59>='A2'!$E$5*$E$82/100,\"EXCELLENT\",IF(C59>='A2'!$E$5*$E$81/100,\"GOOD\",IF(C59>='A2'!$E$5*$E$80/100,\"AVERAGE\",\"POOR\"))))","v":"POOR"}]
[{"$f":"Data_Sheet!A60","v":"JEC16EC088"},{"$f":"Data_Sheet!B60","v":"SHARAN SHASHINDRAN A"},{"$f":"'A2'!F60","v":10},{"$f":"IF(C60=\"A\",\"ABSENT\",IF(C60>='A2'!$E$5*$E$82/100,\"EXCELLENT\",IF(C60>='A2'!$E$5*$E$81/100,\"GOOD\",IF(C60>='A2'!$E$5*$E$80/100,\"AVERAGE\",\"POOR\"))))","v":"EXCELLENT"}]
[{"$f":"Data_Sheet!A61","v":"JEC16EC089"},{"$f":"Data_Sheet!B61","v":"SIBIN KRISHNA C"},{"$f":"'A2'!F61","v":9},{"$f":"IF(C61=\"A\",\"ABSENT\",IF(C61>='A2'!$E$5*$E$82/100,\"EXCELLENT\",IF(C61>='A2'!$E$5*$E$81/100,\"GOOD\",IF(C61>='A2'!$E$5*$E$80/100,\"AVERAGE\",\"POOR\"))))","v":"EXCELLENT"}]
[{"$f":"Data_Sheet!A62","v":"JEC16EC090"},{"$f":"Data_Sheet!B62","v":"SREEJITH VIJAYAKUMAR"},{"$f":"'A2'!F62","v":0},{"$f":"IF(C62=\"A\",\"ABSENT\",IF(C62>='A2'!$E$5*$E$82/100,\"EXCELLENT\",IF(C62>='A2'!$E$5*$E$81/100,\"GOOD\",IF(C62>='A2'!$E$5*$E$80/100,\"AVERAGE\",\"POOR\"))))","v":"POOR"}]
[{"$f":"Data_Sheet!A63","v":"JEC16EC091"},{"$f":"Data_Sheet!B63","v":"SREELAKSHMI.R"},{"$f":"'A2'!F63","v":10},{"$f":"IF(C63=\"A\",\"ABSENT\",IF(C63>='A2'!$E$5*$E$82/100,\"EXCELLENT\",IF(C63>='A2'!$E$5*$E$81/100,\"GOOD\",IF(C63>='A2'!$E$5*$E$80/100,\"AVERAGE\",\"POOR\"))))","v":"EXCELLENT"}]
[{"$f":"Data_Sheet!A64","v":"JEC16EC092"},{"$f":"Data_Sheet!B64","v":"SREERAG K M"},{"$f":"'A2'!F64","v":9},{"$f":"IF(C64=\"A\",\"ABSENT\",IF(C64>='A2'!$E$5*$E$82/100,\"EXCELLENT\",IF(C64>='A2'!$E$5*$E$81/100,\"GOOD\",IF(C64>='A2'!$E$5*$E$80/100,\"AVERAGE\",\"POOR\"))))","v":"EXCELLENT"}]
[{"$f":"Data_Sheet!A65","v":"JEC16EC093"},{"$f":"Data_Sheet!B65","v":"SREERAG T K"},{"$f":"'A2'!F65","v":0},{"$f":"IF(C65=\"A\",\"ABSENT\",IF(C65>='A2'!$E$5*$E$82/100,\"EXCELLENT\",IF(C65>='A2'!$E$5*$E$81/100,\"GOOD\",IF(C65>='A2'!$E$5*$E$80/100,\"AVERAGE\",\"POOR\"))))","v":"POOR"}]
[{"$f":"Data_Sheet!A66","v":"JEC16EC094"},{"$f":"Data_Sheet!B66","v":"SREERAG V.V"},{"$f":"'A2'!F66","v":10},{"$f":"IF(C66=\"A\",\"ABSENT\",IF(C66>='A2'!$E$5*$E$82/100,\"EXCELLENT\",IF(C66>='A2'!$E$5*$E$81/100,\"GOOD\",IF(C66>='A2'!$E$5*$E$80/100,\"AVERAGE\",\"POOR\"))))","v":"EXCELLENT"}]
[{"$f":"Data_Sheet!A67","v":"JEC16EC095"},{"$f":"Data_Sheet!B67","v":"SRUTHIMOL.N.T"},{"$f":"'A2'!F67","v":0},{"$f":"IF(C67=\"A\",\"ABSENT\",IF(C67>='A2'!$E$5*$E$82/100,\"EXCELLENT\",IF(C67>='A2'!$E$5*$E$81/100,\"GOOD\",IF(C67>='A2'!$E$5*$E$80/100,\"AVERAGE\",\"POOR\"))))","v":"POOR"}]
[{"$f":"Data_Sheet!A68","v":"JEC16EC096"},{"$f":"Data_Sheet!B68","v":"SRUTHISHA SASI"},{"$f":"'A2'!F68","v":10},{"$f":"IF(C68=\"A\",\"ABSENT\",IF(C68>='A2'!$E$5*$E$82/100,\"EXCELLENT\",IF(C68>='A2'!$E$5*$E$81/100,\"GOOD\",IF(C68>='A2'!$E$5*$E$80/100,\"AVERAGE\",\"POOR\"))))","v":"EXCELLENT"}]
[{"$f":"Data_Sheet!A69","v":"JEC16EC097"},{"$f":"Data_Sheet!B69","v":"SUCHITHRA.TS"},{"$f":"'A2'!F69","v":9},{"$f":"IF(C69=\"A\",\"ABSENT\",IF(C69>='A2'!$E$5*$E$82/100,\"EXCELLENT\",IF(C69>='A2'!$E$5*$E$81/100,\"GOOD\",IF(C69>='A2'!$E$5*$E$80/100,\"AVERAGE\",\"POOR\"))))","v":"EXCELLENT"}]
[{"$f":"Data_Sheet!A70","v":"JEC16EC098"},{"$f":"Data_Sheet!B70","v":"SWETHA SARA GEORGE"},{"$f":"'A2'!F70","v":10},{"$f":"IF(C70=\"A\",\"ABSENT\",IF(C70>='A2'!$E$5*$E$82/100,\"EXCELLENT\",IF(C70>='A2'!$E$5*$E$81/100,\"GOOD\",IF(C70>='A2'!$E$5*$E$80/100,\"AVERAGE\",\"POOR\"))))","v":"EXCELLENT"}]
[{"$f":"Data_Sheet!A71","v":"JEC16EC099"},{"$f":"Data_Sheet!B71","v":"VISHNU K"},{"$f":"'A2'!F71","v":10},{"$f":"IF(C71=\"A\",\"ABSENT\",IF(C71>='A2'!$E$5*$E$82/100,\"EXCELLENT\",IF(C71>='A2'!$E$5*$E$81/100,\"GOOD\",IF(C71>='A2'!$E$5*$E$80/100,\"AVERAGE\",\"POOR\"))))","v":"EXCELLENT"}]
[{"$f":"Data_Sheet!A72","v":"JEC16EC100"},{"$f":"Data_Sheet!B72","v":"VISHNU PRAKASH"},{"$f":"'A2'!F72","v":9},{"$f":"IF(C72=\"A\",\"ABSENT\",IF(C72>='A2'!$E$5*$E$82/100,\"EXCELLENT\",IF(C72>='A2'!$E$5*$E$81/100,\"GOOD\",IF(C72>='A2'!$E$5*$E$80/100,\"AVERAGE\",\"POOR\"))))","v":"EXCELLENT"}]
[{"$f":"Data_Sheet!A73","v":"JEC16EC101"},{"$f":"Data_Sheet!B73","v":"VISHNU V"},{"$f":"'A2'!F73","v":9},{"$f":"IF(C73=\"A\",\"ABSENT\",IF(C73>='A2'!$E$5*$E$82/100,\"EXCELLENT\",IF(C73>='A2'!$E$5*$E$81/100,\"GOOD\",IF(C73>='A2'!$E$5*$E$80/100,\"AVERAGE\",\"POOR\"))))","v":"EXCELLENT"}]
[{"$f":"Data_Sheet!A74","v":"LJEC16EC102"},{"$f":"Data_Sheet!B74","v":"CHRISTEENA PAULSON"},{"$f":"'A2'!F74","v":9},{"$f":"IF(C74=\"A\",\"ABSENT\",IF(C74>='A2'!$E$5*$E$82/100,\"EXCELLENT\",IF(C74>='A2'!$E$5*$E$81/100,\"GOOD\",IF(C74>='A2'!$E$5*$E$80/100,\"AVERAGE\",\"POOR\"))))","v":"EXCELLENT"}]
[]
["Total Number of Students",null,{"$f":"Data_Sheet!$C$6","v":50}]
["Number of Students Absent",null,{"$f":"IF(COUNTIF(C25:INDIRECT(C89),\"=A\"),COUNTIF(C25:INDIRECT(C89),\"=A\"),0)","v":0}]
["Total Number of Students attended",null,{"$f":"C76-C77","v":50}]
[{"$f":"\"Number of Students with Marks less than \"&E80&\"%\"","v":"Number of Students with Marks less than 45%"},null,{"$f":"IF(COUNTIF(D25:INDIRECT(D89),\"=POOR\"),COUNTIF(D25:INDIRECT(D89),\"=POOR\"),0)","v":4},"POOR","Range"]
[{"$f":"\"Number of Students with Marks betweeen \"&E80&\"% to \"&E81&\"%\"","v":"Number of Students with Marks betweeen 45% to 60%"},null,{"$f":"IF(COUNTIF(D25:INDIRECT(D89),\"=AVERAGE\"),COUNTIF(D25:INDIRECT(D89),\"=AVERAGE\"),0)","v":0},"AVERAGE",45]
[{"$f":"\"Number of Students with Marks betweeen \"&E81&\"% to \"&E82&\"%\"","v":"Number of Students with Marks betweeen 60% to 80%"},null,{"$f":"IF(COUNTIF(D25:INDIRECT(D89),\"=GOOD\"),COUNTIF(D25:INDIRECT(D89),\"=GOOD\"),0)","v":0},"GOOD",60]
[{"$f":"\"Number of Students with Marks greater than \"&E82&\"%\"","v":"Number of Students with Marks greater than 80%"},null,{"$f":"IF(COUNTIF(D25:INDIRECT(D89),\"=EXCELLENT\"),COUNTIF(D25:INDIRECT(D89),\"=EXCELLENT\"),0)","v":46},"EXCELLENT",80]
["Class Average",null,{"$f":"ROUND(AVERAGE(C25:INDIRECT(C89)),2)","v":8.9600000000000009}]
["Pass Percentage",null,{"$f":"ROUND(((C78-C79)/C78)*100,2)","v":92}]
[]
[null,{"$f":"Data_Sheet!B10","v":"Name of Faculty : "},{"$f":"Data_Sheet!B11","v":"PONMANI RAJA M"}]
[null,{"$f":"Data_Sheet!B94","v":"Dated Signature :  "}]
[]
[{"$f":"ROW(A76)-2","v":74},"Last Row Count",{"$f":"\"$C$\"&$A$89","v":"$C$74"},{"$f":"\"$D$\"&$A$89","v":"$D$74"}]

{"sheet":"Overall_CO","index":12,"n_rows":61,"n_cols":22,"rows_kept":61,"cut":false,"hidden":false,"merged":[[2,0,2,13],[4,0,4,13],[6,0,6,13],[8,0,8,13],[12,0,17,0],[10,2,10,3],[10,4,10,5],[10,6,10,7],[10,8,10,9],[10,10,10,11],[10,0,11,1],[19,0,20,1],[18,0,18,11],[22,0,22,11],[19,8,19,9],[20,8,20,9],[42,0,47,0],[32,0,32,13],[34,0,34,13],[36,0,36,13],[38,0,38,13],[40,0,41,1],[40,12,41,12],[40,13,41,13]]}
[]
[]
[{"$f":"Data_Sheet!A2","v":"Jyothi Engineering College, Cheruthuruthy"}]
[]
[{"$f":"Data_Sheet!A4","v":"Department of Electrical & Electronics Engineering"}]
[]
["Overall CO Analysis - Internal Marks",null,null,null,null,null,null,null,null,null,null,null,null,null,null,{"$f":"\"Overall \"&LEFT(Data_Sheet!A15, LEN(Data_Sheet!A15)-12)","v":"Overall CO Analysis - Internal Marks                    "}]
[]
[{"$f":"Data_Sheet!A17","v":"S7 EC              EC407 Computer Communication               2019-20"}]
[]
["Internal Marks Analysis",null,"T1",null,"T2",null,"T3",null,"A1",null,"A2",null,"Average","Remarks"]
[null,null,"A_Value","Marks","A_Value","Marks","A_Value","Marks","A_Value","Marks","A_Value","Marks"]
["Total Attainment level for",{"$f":"IF(Data_Sheet!A77<>\"\",Data_Sheet!A77,\"\")","v":"CO1"},{"$f":"IF(Data_Sheet!A77<>\"\",'T1'!C82,\"\")","v":0.71},{"$f":"IF(Data_Sheet!A77<>\"\",'T1'!J82,\"\")","v":70},{"$f":"IF(Data_Sheet!A77<>\"\",'T2'!C82,\"\")","v":3},{"$f":"IF(Data_Sheet!A77<>\"\",'T2'!J82,\"\")","v":70},{"$f":"IF(Data_Sheet!A77<>\"\",'T3'!C82,\"\")","v":""},{"$f":"IF(Data_Sheet!A77<>\"\",'T3'!I82,\"\")","v":0},{"$f":"IF(Data_Sheet!A77<>\"\",'A1'!C82,\"\")","v":""},{"$f":"IF(Data_Sheet!A77<>\"\",'A1'!F82,\"\")","v":0},{"$f":"IF(Data_Sheet!A77<>\"\",'A2'!C82,\"\")","v":3},{"$f":"IF(Data_Sheet!A77<>\"\",'A2'!F82,\"\")","v":10},{"$f":"IF(SUM(D13,F13,H13,J13,L13)=0,\"\",ROUND((IF(C13=\"\",0,C13*D13)+IF(E13=\"\",0,E13*F13)+IF(G13=\"\",0,H13*G13)+IF(I13=\"\",0,I13*J13)+IF(K13=\"\",0,K13*L13))/(SUM(D13,F13,H13,J13,L13)),2))","v":1.93},{"$f":"IF(Data_Sheet!A77<>\"\",IF(M13=\"\",\"No Correlation\",\"\"),\"\")","v":""},{"$f":"IFERROR(IF(Data_Sheet!A77<>\"\",ROUND(AVERAGE('T1'!C82,'T2'!C82,'A1'!C82,'A2'!C82),2),\"\"),\"\")","v":2.2400000000000002},{"$f":"IF(Data_Sheet!A77<>\"\",ROUND(SUM('T1'!C82,'T2'!C82,'A1'!C82,'A2'!C82)/4,2),\"\")","v":1.68}]
[null,{"$f":"IF(Data_Sheet!A78<>\"\",Data_Sheet!A78,\"\")","v":"CO2"},{"$f":"IF(Data_Sheet!A78<>\"\",'T1'!C83,\"\")","v":1.5},{"$f":"IF(Data_Sheet!A78<>\"\",'T1'!J83,\"\")","v":20},{"$f":"IF(Data_Sheet!A78<>\"\",'T2'!C83,\"\")","v":3},{"$f":"IF(Data_Sheet!A78<>\"\",'T2'!J83,\"\")","v":20},{"$f":"IF(Data_Sheet!A78<>\"\",'T3'!C83,\"\")","v":""},{"$f":"IF(Data_Sheet!A78<>\"\",'T3'!I83,\"\")","v":0},{"$f":"IF(Data_Sheet!A78<>\"\",'A1'!C83,\"\")","v":""},{"$f":"IF(Data_Sheet!A78<>\"\",'A1'!F83,\"\")","v":0},{"$f":"IF(Data_Sheet!A78<>\"\",'A2'!C83,\"\")","v":3},{"$f":"IF(Data_Sheet!A78<>\"\",'A2'!F83,\"\")","v":5},2.33,{"$f":"IF(Data_Sheet!A78<>\"\",IF(M14=\"\",\"No Correlation\",\"\"),\"\")","v":""},{"$f":"IFERROR(IF(Data_Sheet!A78<>\"\",ROUND(AVERAGE('T1'!C83,'T2'!C83,'A1'!C83,'A2'!C83),2),\"\"),\"\")","v":2.5},{"$f":"IF(Data_Sheet!A78<>\"\",ROUND(SUM('T1'!C83,'T2'!C83,'A1'!C83,'A2'!C83)/4,2),\"\")","v":1.88}]
[null,{"$f":"IF(Data_Sheet!A79<>\"\",Data_Sheet!A79,\"\")","v":"CO3"},{"$f":"IF(Data_Sheet!A79<>\"\",'T1'!C84,\"\")","v":0.4},{"$f":"IF(Data_Sheet!A79<>\"\",'T1'!J84,\"\")","v":50},{"$f":"IF(Data_Sheet!A79<>\"\",'T2'!C84,\"\")","v":2.6},{"$f":"IF(Data_Sheet!A79<>\"\",'T2'!J84,\"\")","v":50},{"$f":"IF(Data_Sheet!A79<>\"\",'T3'!C84,\"\")","v":0},{"$f":"IF(Data_Sheet!A79<>\"\",'T3'!I84,\"\")","v":10},{"$f":"IF(Data_Sheet!A79<>\"\",'A1'!C84,\"\")","v":""},{"$f":"IF(Data_Sheet!A79<>\"\",'A1'!F84,\"\")","v":0},{"$f":"IF(Data_Sheet!A79<>\"\",'A2'!C84,\"\")","v":""},{"$f":"IF(Data_Sheet!A79<>\"\",'A2'!F84,\"\")","v":0},1.36,{"$f":"IF(Data_Sheet!A79<>\"\",IF(M15=\"\",\"No Correlation\",\"\"),\"\")","v":""},{"$f":"IFERROR(IF(Data_Sheet!A79<>\"\",ROUND(AVERAGE('T1'!C84,'T2'!C84,'A1'!C84,'A2'!C84),2),\"\"),\"\")","v":1.5},{"$f":"IF(Data_Sheet!A79<>\"\",ROUND(SUM('T1'!C84,'T2'!C84,'A1'!C84,'A2'!C84)/4,2),\"\")","v":0.75}]
[null,{"$f":"IF(Data_Sheet!A80<>\"\",Data_Sheet!A80,\"\")","v":"CO4"},{"$f":"IF(Data_Sheet!A80<>\"\",'T1'!C85,\"\")","v":0.79},{"$f":"IF(Data_Sheet!A80<>\"\",'T1'!J85,\"\")","v":70},{"$f":"IF(Data_Sheet!A80<>\"\",'T2'!C85,\"\")","v":2.71},{"$f":"IF(Data_Sheet!A80<>\"\",'T2'!J85,\"\")","v":70},{"$f":"IF(Data_Sheet!A80<>\"\",'T3'!C85,\"\")","v":0},{"$f":"IF(Data_Sheet!A80<>\"\",'T3'!I85,\"\")","v":10},{"$f":"IF(Data_Sheet!A80<>\"\",'A1'!C85,\"\")","v":3},{"$f":"IF(Data_Sheet!A80<>\"\",'A1'!F85,\"\")","v":10},{"$f":"IF(Data_Sheet!A80<>\"\",'A2'!C85,\"\")","v":""},{"$f":"IF(Data_Sheet!A80<>\"\",'A2'!F85,\"\")","v":0},1.72,{"$f":"IF(Data_Sheet!A80<>\"\",IF(M16=\"\",\"No Correlation\",\"\"),\"\")","v":""},{"$f":"IFERROR(IF(Data_Sheet!A80<>\"\",ROUND(AVERAGE('T1'!C85,'T2'!C85,'A1'!C85,'A2'!C85),2),\"\"),\"\")","v":2.17},{"$f":"IF(Data_Sheet!A80<>\"\",ROUND(SUM('T1'!C85,'T2'!C85,'A1'!C85,'A2'!C85)/4,2),\"\")","v":1.63}]
[null,{"$f":"IF(Data_Sheet!A81<>\"\",Data_Sheet!A81,\"\")","v":"CO5"},{"$f":"IF(Data_Sheet!A81<>\"\",'T1'!C86,\"\")","v":0.4},{"$f":"IF(Data_Sheet!A81<>\"\",'T1'!J86,\"\")","v":50},{"$f":"IF(Data_Sheet!A81<>\"\",'T2'!C86,\"\")","v":3},{"$f":"IF(Data_Sheet!A81<>\"\",'T2'!J86,\"\")","v":50},{"$f":"IF(Data_Sheet!A81<>\"\",'T3'!C86,\"\")","v":0},{"$f":"IF(Data_Sheet!A81<>\"\",'T3'!I86,\"\")","v":5},{"$f":"IF(Data_Sheet!A81<>\"\",'A1'!C86,\"\")","v":""},{"$f":"IF(Data_Sheet!A81<>\"\",'A1'!F86,\"\")","v":0},{"$f":"IF(Data_Sheet!A81<>\"\",'A2'!C86,\"\")","v":""},{"$f":"IF(Data_Sheet!A81<>\"\",'A2'!F86,\"\")","v":0},1.62,{"$f":"IF(Data_Sheet!A81<>\"\",IF(M17=\"\",\"No Correlation\",\"\"),\"\")","v":""},{"$f":"IFERROR(IF(Data_Sheet!A81<>\"\",ROUND(AVERAGE('T1'!C86,'T2'!C86,'A1'!C86,'A2'!C86),2),\"\"),\"\")","v":1.7},{"$f":"IF(Data_Sheet!A81<>\"\",ROUND(SUM('T1'!C86,'T2'!C86,'A1'!C86,'A2'!C86)/4,2),\"\")","v":0.85}]
[null,{"$f":"IF(Data_Sheet!A82<>\"\",Data_Sheet!A82,\"\")","v":"CO6"},{"$f":"IF(Data_Sheet!A82<>\"\",'T1'!C87,\"\")","v":""},{"$f":"IF(Data_Sheet!A82<>\"\",'T1'!J87,\"\")","v":0},{"$f":"IF(Data_Sheet!A82<>\"\",'T2'!C87,\"\")","v":""},{"$f":"IF(Data_Sheet!A82<>\"\",'T2'!J87,\"\")","v":0},{"$f":"IF(Data_Sheet!A82<>\"\",'T3'!C87,\"\")","v":""},{"$f":"IF(Data_Sheet!A82<>\"\",'T3'!I87,\"\")","v":0},{"$f":"IF(Data_Sheet!A82<>\"\",'A1'!C87,\"\")","v":""},{"$f":"IF(Data_Sheet!A82<>\"\",'A1'!F87,\"\")","v":0},{"$f":"IF(Data_Sheet!A82<>\"\",'A2'!C87,\"\")","v":3},{"$f":"IF(Data_Sheet!A82<>\"\",'A2'!F87,\"\")","v":5},3,{"$f":"IF(Data_Sheet!A82<>\"\",IF(M18=\"\",\"No Correlation\",\"\"),\"\")","v":""},{"$f":"IFERROR(IF(Data_Sheet!A82<>\"\",ROUND(AVERAGE('T1'!C87,'T2'!C87,'A1'!C87,'A2'!C87),2),\"\"),\"\")","v":3},{"$f":"IF(Data_Sheet!A82<>\"\",ROUND(SUM('T1'!C87,'T2'!C87,'A1'!C87,'A2'!C87)/4,2),\"\")","v":0.75}]
["Average of COs",null,null,null,null,null,null,null,null,null,null,null,{"$f":"ROUND(AVERAGE(M13:M18),2)","v":1.99}]
["External Marks Analysis",null,{"$f":"IF(Data_Sheet!A77<>\"\",Data_Sheet!A77,\"\")","v":"CO1"},{"$f":"IF(Data_Sheet!A78<>\"\",Data_Sheet!A78,\"\")","v":"CO2"},{"$f":"IF(Data_Sheet!A79<>\"\",Data_Sheet!A79,\"\")","v":"CO3"},{"$f":"IF(Data_Sheet!A80<>\"\",Data_Sheet!A80,\"\")","v":"CO4"},{"$f":"IF(Data_Sheet!A81<>\"\",Data_Sheet!A81,\"\")","v":"CO5"},{"$f":"IF(Data_Sheet!A82<>\"\",Data_Sheet!A82,\"\")","v":"CO6"},"Average"]
[null,null,{"$f":"IF(Data_Sheet!A77<>\"\",Data_Sheet!E75,\"\")","v":3},{"$f":"IF(Data_Sheet!A78<>\"\",Data_Sheet!E75,\"\")","v":3},{"$f":"IF(Data_Sheet!A79<>\"\",Data_Sheet!E75,\"\")","v":3},{"$f":"IF(Data_Sheet!A80<>\"\",Data_Sheet!E75,\"\")","v":3},{"$f":"IF(Data_Sheet!A81<>\"\",Data_Sheet!E75,\"\")","v":3},{"$f":"IF(Data_Sheet!A82<>\"\",Data_Sheet!E75,\"\")","v":3},{"$f":"ROUND(AVERAGE(C21:H21),2)","v":3}]
[]
[{"$f":"\"Course Outcome  Attainment for \"&Data_Sheet!A9&\" \"&Data_Sheet!B9","v":"Course Outcome  Attainment for EC407 Computer Communication"},null,null,null,null,null,null,null,null,null,null,null,{"$f":"ROUND((M19*Data_Sheet!E84+I21*Data_Sheet!E88)/100,2)","v":2.7}]
[{"$f":"Data_Sheet!A85","v":"Attainment Level 1: 60% students scoring more than 60% of the Total Marks"}]
[{"$f":"Data_Sheet!A86","v":"Attainment Level 2: 70% students scoring more than 60% of the Total Marks"}]
[{"$f":"Data_Sheet!A87","v":"Attainment Level 3: 80% students scoring more than 60% of the Total Marks"}]
[null,null,null,null,null,null,null,null,null,null,{"$f":"Data_Sheet!B10","v":"Name of Faculty : "},null,{"$f":"Data_Sheet!B11","v":"PONMANI RAJA M"}]
[null,null,null,null,null,null,null,null,null,null,{"$f":"Data_Sheet!B94","v":"Dated Signature :  "}]
[]
[]
[]
[]
[{"$f":"Data_Sheet!A2","v":"Jyothi Engineering College, Cheruthuruthy"}]
[]
[{"$f":"Data_Sheet!A4","v":"Department of Electrical & Electronics Engineering"}]
[]
["Question Paper & Assignment Quality Analysis"]
[]
[{"$f":"Data_Sheet!A17","v":"S7 EC              EC407 Computer Communication               2019-20"}]
[]
["Quality Analysis",null,"T1",{"$f":"'T1'!F5","v":50},"T2",{"$f":"'T2'!F5","v":50},"T3",{"$f":"'T3'!F5","v":50},"A1",{"$f":"'A1'!E5","v":10},"A2",{"$f":"'A2'!E5","v":10},"Average Marks %","Remarks"]
[null,null,"Included","Marks %","Included","Marks %","Included","Marks %","Included","Marks %","Included","Marks %",null,null,null,null,"L1","L2","L3","L4","L5","L6"]
["Blooms Taxonomy Level",1,{"$f":"IF(D43<>0,\"Yes\",\"No\")","v":"Yes"},{"$f":"IFERROR(ROUND('T1'!$J134/SUM('T1'!$D$21:'T1'!$I$21)*100,2),0)","v":19.440000000000001},{"$f":"IF(F43<>0,\"Yes\",\"No\")","v":"Yes"},{"$f":"IFERROR(ROUND('T2'!$J134/SUM('T2'!$D$21:'T2'!$I$21)*100,2),0)","v":19.440000000000001},{"$f":"IF(H43<>0,\"Yes\",\"No\")","v":"No"},{"$f":"IFERROR(ROUND('T3'!$I134/SUM('T3'!$D$21:'T3'!$H$21)*100,2),0)","v":0},{"$f":"IF(J43<>0,\"Yes\",\"No\")","v":"No"},{"$f":"IFERROR(ROUND('A1'!$F134/SUM('A1'!$D$21:'A1'!$E$21)*100,2),0)","v":0},{"$f":"IF(L43<>0,\"Yes\",\"No\")","v":"No"},{"$f":"IFERROR(ROUND('A2'!$F134/SUM('A2'!$D$21:'A2'!$E$21)*100,2),0)","v":0},{"$f":"IF(SUM(D43,F43,H43,J43,L43)=0,\"\",ROUND((IF(C43=\"No\",0,$D$41*D43)+IF(E43=\"No\",0,$F$41*F43)+IF(G43=\"No\",0,$H$41*H43)+IF(I43=\"No\",0,$J$41*J43)+IF(K43=\"No\",0,$L$41*L43))/(SUM($D$41,$F$41,$H$41,$J$41,$L$41)),2))","v":11.44},{"$f":"IF(M43=\"\",\"Not Included\",\"\")","v":""},{"$f":"($D43*$D$41+$F43*$F$41+$H43*$H$41+$J43*$J$41+$L43*$L$41)/100","v":19.440000000000001},"T1",{"$f":"TRANSPOSE(D43:D48)","v":19.440000000000001},58.33,11.11,0,0,11.11]
[null,2,"Yes",{"$f":"IFERROR(ROUND('T1'!$J135/SUM('T1'!$D$21:'T1'!$I$21)*100,2),0)","v":58.33},"Yes",{"$f":"IFERROR(ROUND('T2'!$J135/SUM('T2'!$D$21:'T2'!$I$21)*100,2),0)","v":58.33},"No",{"$f":"IFERROR(ROUND('T3'!$I135/SUM('T3'!$D$21:'T3'!$H$21)*100,2),0)","v":0},"Yes",{"$f":"IFERROR(ROUND('A1'!$F135/SUM('A1'!$D$21:'A1'!$E$21)*100,2),0)","v":100},"No",{"$f":"IFERROR(ROUND('A2'!$F135/SUM('A2'!$D$21:'A2'!$E$21)*100,2),0)","v":0},{"$f":"IF(SUM(D44,F44,H44,J44,L44)=0,\"\",ROUND((IF(C44=\"No\",0,$D$41*D44)+IF(E44=\"No\",0,$F$41*F44)+IF(G44=\"No\",0,$H$41*H44)+IF(I44=\"No\",0,$J$41*J44)+IF(K44=\"No\",0,$L$41*L44))/(SUM($D$41,$F$41,$H$41,$J$41,$L$41)),2))","v":40.19},{"$f":"IF(M44=\"\",\"Not Included\",\"\")","v":""},{"$f":"($D44*$D$41+$F44*$F$41+$H44*$H$41+$J44*$J$41+$L44*$L$41)/100","v":68.33},"T2",{"$f":"TRANSPOSE(F43:F48)","v":19.440000000000001},58.33,11.11,0,0,11.11]
[null,3,"Yes",{"$f":"IFERROR(ROUND('T1'!$J136/SUM('T1'!$D$21:'T1'!$I$21)*100,2),0)","v":11.11},"Yes",{"$f":"IFERROR(ROUND('T2'!$J136/SUM('T2'!$D$21:'T2'!$I$21)*100,2),0)","v":11.11},"No",{"$f":"IFERROR(ROUND('T3'!$I136/SUM('T3'!$D$21:'T3'!$H$21)*100,2),0)","v":0},"No",{"$f":"IFERROR(ROUND('A1'!$F136/SUM('A1'!$D$21:'A1'!$E$21)*100,2),0)","v":0},"No",{"$f":"IFERROR(ROUND('A2'!$F136/SUM('A2'!$D$21:'A2'!$E$21)*100,2),0)","v":0},6.54,{"$f":"IF(M45=\"\",\"Not Included\",\"\")","v":""},11.11,"T3",{"$f":"TRANSPOSE(H43:H48)","v":0},0,0,0,60,40]
[null,4,"No",{"$f":"IFERROR(ROUND('T1'!$J137/SUM('T1'!$D$21:'T1'!$I$21)*100,2),0)","v":0},"No",{"$f":"IFERROR(ROUND('T2'!$J137/SUM('T2'!$D$21:'T2'!$I$21)*100,2),0)","v":0},"No",{"$f":"IFERROR(ROUND('T3'!$I137/SUM('T3'!$D$21:'T3'!$H$21)*100,2),0)","v":0},"No",{"$f":"IFERROR(ROUND('A1'!$F137/SUM('A1'!$D$21:'A1'!$E$21)*100,2),0)","v":0},"Yes",{"$f":"IFERROR(ROUND('A2'!$F137/SUM('A2'!$D$21:'A2'!$E$21)*100,2),0)","v":25},1.47,"",2.5,"A1",{"$f":"TRANSPOSE(J43:J48)","v":0},100,0,0,0,0]
[null,5,"No",{"$f":"IFERROR(ROUND('T1'!$J138/SUM('T1'!$D$21:'T1'!$I$21)*100,2),0)","v":0},"No",{"$f":"IFERROR(ROUND('T2'!$J138/SUM('T2'!$D$21:'T2'!$I$21)*100,2),0)","v":0},"Yes",{"$f":"IFERROR(ROUND('T3'!$I138/SUM('T3'!$D$21:'T3'!$H$21)*100,2),0)","v":60},"No",{"$f":"IFERROR(ROUND('A1'!$F138/SUM('A1'!$D$21:'A1'!$E$21)*100,2),0)","v":0},"Yes",{"$f":"IFERROR(ROUND('A2'!$F138/SUM('A2'!$D$21:'A2'!$E$21)*100,2),0)","v":50},20.59,"",35,"A2",{"$f":"TRANSPOSE(L43:L48)","v":0},0,0,25,50,25]
[null,6,"Yes",{"$f":"IFERROR(ROUND('T1'!$J139/SUM('T1'!$D$21:'T1'!$I$21)*100,2),0)","v":11.11},"Yes",{"$f":"IFERROR(ROUND('T2'!$J139/SUM('T2'!$D$21:'T2'!$I$21)*100,2),0)","v":11.11},"Yes",{"$f":"IFERROR(ROUND('T3'!$I139/SUM('T3'!$D$21:'T3'!$H$21)*100,2),0)","v":40},"No",{"$f":"IFERROR(ROUND('A1'!$F139/SUM('A1'!$D$21:'A1'!$E$21)*100,2),0)","v":0},"Yes",{"$f":"IFERROR(ROUND('A2'!$F139/SUM('A2'!$D$21:'A2'!$E$21)*100,2),0)","v":25},19.77,"",33.61,"Average",{"$f":"TRANSPOSE(M43:M48)","v":11.44},40.19,6.54,1.47,20.59,19.77]
[]
[]
[]
[]
[]
[]
[]
[]
[]
[]
[]
[null,null,null,null,null,null,null,null,null,null,{"$f":"Data_Sheet!B10","v":"Name of Faculty : "},{"$f":"Data_Sheet!B11","v":"PONMANI RAJA M"}]
[null,null,null,null,null,null,null,null,null,null,{"$f":"Data_Sheet!B94","v":"Dated Signature :  "}]