{"text_format":"1","workbook":"xlsx","n_sheets":13,"sheets":["Data_Sheet","Internal_Analysis","T1","T1_Analysis","T2","T2_Analysis","T3","T3_Analysis","A1","A1_Analysis","A2","A2_Analysis","Overall_CO"],"not_rendered":{"charts":1,"images":0,"macros":1,"external_links":3,"defined_names":55,"comments":6,"pivot_tables":0},"unopened":[],"bounds":{"document_bytes":16777216,"sheet_cells":100000,"rows_first":2000,"rows_last":500,"rows_between":2000,"halvings":0,"cell_chars":16384,"cell_head_chars":4096},"cells_cut":0,"cells_raw":0,"read":"whole","date_system":"1900"}

{"sheet":"Data_Sheet","index":0,"n_rows":141,"n_cols":15,"rows_kept":141,"cut":false,"hidden":false,"merged":[[125,0,125,1],[129,0,129,1],[129,2,129,3],[125,2,125,3],[122,1,122,4],[123,1,123,4],[117,1,117,4],[118,1,118,4],[119,1,119,4],[120,1,120,4],[121,1,121,4],[16,0,16,4],[7,2,7,3],[14,0,14,4],[19,0,21,0],[19,1,21,1],[19,4,21,4],[19,2,21,2],[19,3,21,3],[9,2,9,3],[10,2,10,3],[1,0,1,4],[3,0,3,4],[8,2,8,3],[5,4,5,5],[5,0,6,1],[5,2,6,2]]}
[]
["Jyothi Engineering College, Cheruthuruthy"]
[]
["Department of Computer Science Engineering"]
[]
["Total No of Students : ",null,92,"Date :","26/10/2019"]
[null,null,null,"Semester","S3"]
["Sub Code : ","Subject Name : ","Academic Year :",null,"2019-20","CO1","S1","CE","Department of Civil Engineering"]
["CS203","Switching Theory and Logic Design","Total Marks(Int) : ",null,50,"CO2","S2","CS","Department of Computer Science Engineering"]
["Branch","Name of Faculty : ","Total Marks(Ext) : ",null,100,"CO3","S3","EC","Department of Electrical & Electronics Engineering"]
["CS","Namitha T N","Target Grade Point : ",null,5,"CO4","S4","EE","Department of Electronics & Communication Engineering"]
[null,null,null,null,null,"CO5","S5","ME","Department of Mechanical Engineering"]
[null,null,null,null,null,"CO6","S6","MR","Department of Mechatronics Engineering"]
[null,null,null,null,null,null,"S7"]
[{"$f":"\"CO Analysis - Internal Marks \" &\"                       \" &TEXT(E6,\"dd-mm-yy\")","v":"CO Analysis - Internal Marks                        26-10-19"},null,null,null,null,null,"S8",null,null,null,null,{"$f":"LEFT(\"CO Analysis - Internal Marks : \",LEN(\"CO Analysis - Internal Marks : \")-3) &\"                       \" &E8","v":"CO Analysis - Internal Marks                       2019-20"}]
[]
[{"$f":"E7&\" \"&A11&\"              \"&A9&\" \"&B9 &\"               \" &E8","v":"S3 CS              CS203 Switching Theory and Logic Design               2019-20"}]
[]
[]
["Register No.","Name of Student","University (External) Grade",{"$f":" \"University (External) Grade Point\"","v":"University (External) Grade Point"},{"$f":" \"Total Internal Marks (\" & E9& \")\"","v":"Total Internal Marks (50)"}]
[null,null,null,null,null,null,null,null,null,null,null,null,null,null,"CONCATENATE(TRANSPOSE(A29:A34)&\",\")"]
[]
[]
["Column1","Column2","Column3","Column4","Column32"]
["JEC18CS001","ABHISHEK KRISHNAN MENON E","F",{"$f":"IF(C25=\"O\",10,IF(C25=\"A+\",9,IF(C25=\"A\",8.5,IF(C25=\"B+\",8,IF(C25=\"B\",7,IF(C25=\"C\",6,IF(C25=\"P\",5,0)))))))","v":0},23]
["JEC18CS002","ABHISHEK SAJEEVAN","F",0,23]
["JEC18CS003","ABHITH SHAJI","F",0,23]
["JEC18CS004","ABIN SANTHOSH ALAPATT","F",0,32]
["JEC18CS005","ADARSH KUMAR M A","C",6,33]
["JEC18CS006","ADHITHYA KRISHNA S","P",5,29]
["JEC18CS007","ADITHYA HARIDAS","B",7,36]
["JEC18CS008","AJMAL BASHEER","F",0,24]
["JEC18CS009","AKASH.V","F",0,23]
["JEC18CS010","AKHIL AZEEZ UPPILAMKUNNATH","B",7,33]
["JEC18CS011","AKHIL KRISHNA UK","F",0,27]
["JEC18CS012","ALAN GEORGE","P",5,29]
["JEC18CS013","ALEN VARGHESE","B",7,34]
["JEC18CS014","AMAL SEBASTIAN","A",8.5,47]
["JEC18CS015","AMAL SONY","F",0,23]
["JEC18CS016","ANAGHA WILSON","C",6,26]
["JEC18CS017","ANETTE ANTO","F",0,23]
["JEC18CS018","ANIT MARY THOMAS","B",7,37]
["JEC18CS020","ANN THERESA SHAJI","A+",9,48]
["JEC18CS021","ANTONY ROY","F",0,23]
["JEC18CS022","ANUGRAHA C","B",7,36]
["JEC18CS023","APARNA.V","C",6,37]
["JEC18CS024","ARAVIND S KUMAR","F",0,31]
["JEC18CS025","ARJUN VINOD","F",0,24]
["JEC18CS026","ARUN VG","F",0,25]
["JEC18CS027","ASHRUL K","B",7,36]
["JEC18CS028","ATHIL PAULY","F",0,23]
["JEC18CS029","ATHIRA K P","B",7,42]
["JEC18CS030","AWIN ANTO","F",0,27]
["JEC18CS031","CHARLES JOHNSON","C",6,29]
["JEC18CS032","CHITTILAPPILLY JOVIA JOHNSON","B",7,41]
["JEC18CS033","CIYA BABU","F",0,23]
["JEC18CS034","DAVID SALUS","C",{"$f":"IF(C57=\"O\",10,IF(C57=\"A+\",9,IF(C57=\"A\",8.5,IF(C57=\"B+\",8,IF(C57=\"B\",7,IF(C57=\"C\",6,IF(C57=\"P\",5,0)))))))","v":6},30]
["JEC18CS035","DELICIA REJI","B",7,41]
["JEC18CS036","DELMA SHAJAN","B+",8,37]
["JEC18CS037","DILBER SHA AP","F",0,29]
["JEC18CS038","EDWIN T JOY","C",6,37]
["JEC18CS039","EDWIN WILSON","F",0,24]
["JEC18CS040","EMMANUEL SHIBU","C",6,32]
["JEC18CS041","GAYATHRI DINESH","C",6,28]
["JEC18CS042","GOKUL DAS M","C",6,32]
["JEC18CS043","G RAMGOPAL","A",8.5,48]
["JEC18CS044","HARIES DAVIS","C",6,29]
["JEC18CS045","HARISANKER P","B",7,34]
["JEC18CS046","HARSHA.K.S.","B",7,39]
["JEC18CS047","HELNA THOMAS","B+",8,42]
["JEC18CS048","HRIDI KRISHNA.H","F",0,28]
["JEC18CS049","INDRAJIT R","P",5,23]
["JEC18CS050","JESWIN JOJY","C",6,42]
["JEC18CS051","JIBIN A BABU","C",6,29]
["JEC18CS052","JISSY JOY","A",8.5,45]
["JEC18CS053","JOEL JAMES KARIKKANDATHIL","F",0,26]
["JEC18CS054","JOSE REJI KARIMADATHI","F",0,23]
["JEC18CS055","JUMANA HASIN","B",7,40]
["JEC18CS056","KAILASHNATH","C",6,28]
["JEC18CS057","K AJISHKUMAR","C",6,28]
["JEC18CS058","KEERTHANA K S","C",6,23]
["JEC18CS059","KEVIN VARGHESE","B+",8,43]
["JEC18CS060","LAKSHMI SADANANDAN","F",0,25]
["JEC18CS061","LEYA PALLAN","P",5,26]
["JEC18CS062","MARVEL BABU","F",0,23]
["JEC18CS063","MEDWIN PAUL","F",0,23]
[null,null,null,0]
[null,null,null,0]
["JEC18CS066","MUHAMMED INSHADH","F",{"$f":"IF(C89=\"O\",10,IF(C89=\"A+\",9,IF(C89=\"A\",8.5,IF(C89=\"B+\",8,IF(C89=\"B\",7,IF(C89=\"C\",6,IF(C89=\"P\",5,0)))))))","v":0},23]
["JEC18CS067","NAIR MIDHUN RAMACHANDRAN","C",6,28]
["JEC18CS068","NAVEENA ANTONY","B",7,30]
["JEC18CS069","NITIN MADHU","B",7,37]
["JEC18CS070","PRATHIUSH ARUN","P",5,29]
["JEC18CS071","RACHEL CECER","B+",8,42]
["JEC18CS072","RAHUL RAJU","F",0,24]
["JEC18CS073","RAHUL T RAVI","F",0,28]
["JEC18CS074","RAPHEAL K MOYALAN","P",5,23]
["JEC18CS075","RISHIKESH. V","B+",8,34]
["JEC18CS076","ROCKSON T. AUGUSTINE","B",7,32]
["JEC18CS077","SARATH C P","B",7,38]
["JEC18CS078","SARATH SASI","A",8.5,40]
["JEC18CS079","SHAFNA","A+",9,49]
["JEC18CS080","SHELMY SHABU","B",7,45]
["JEC18CS081","SHIZA SHIHAB PUVAMPARAMBIL","B",7,37]
["JEC18CS082","SIJO GEORGE","C",6,33]
["JEC18CS083","SOURAV K","F",0,23]
[null,null,null,0]
["JEC18CS085","SREEHARI","P",5,23]
["JEC18CS086","SREEKANTH P","F",0,23]
["JEC18CS087","SREELEKSHMI H KUMAR","B",7,34]
["JEC18CS088","SUFAIL BADUSHA.T","C",6,32]
["JEC18CS089","TIYA THOMAS","B+",8,45]
["JEC18CS090","TOMSUN PAVOO P","F",0,31]
["JEC18CS091","ULLAS. S","P",5,23]
["JEC18CS092","VAISHNAV M","P",5,23]
["JEC18CS093","VANI PRAKASHAN CHOYYAN","A+",9,49]
[null,null,{"$f":"ROUND(100*D117/COUNTA(C25:INDIRECT(\"C\"&A137)),2)","v":66.290000000000006},{"$f":"COUNTIF(D25:INDIRECT(D137),\">=\"&E11)","v":59},{"$f":"IF(C117>=K133,3,IF(C117>=K132,2,IF(C117>=K131,1,0)))","v":1}]
["CO's","Definition of CO's"]
["CO1","CO1 Statement"]
["CO2","CO2 Statement"]
["CO3","CO3 Statement"]
["CO4","CO4 Statement"]
["CO5","CO5 Statement"]
["CO6","CO6 Statement"]
[]
["Internal Analysis",null,"Weightage",null,30,null,null,null,null,null,"Target %","%Students"]
[{"$f":"\"Attainment Level 1: \"&$L$127&\"% students scoring more than \"&$K$127&\"% of the Total Marks\"","v":"Attainment Level 1: 60% students scoring more than 60% of the Total Marks"},null,null,null,null,null,null,null,null,null,60,60]
[{"$f":"\"Attainment Level 2: \"&$L$128&\"% students scoring more than \"&$K$127&\"% of the Total Marks\"","v":"Attainment Level 2: 70% students scoring more than 60% of the Total Marks"},null,null,null,null,null,null,null,null,null,null,70]
[{"$f":"\"Attainment Level 3: \"&$L$129&\"% students scoring more than \"&$K$127&\"% of the Total Marks\"","v":"Attainment Level 3: 80% students scoring more than 60% of the Total Marks"},null,null,null,null,null,null,null,null,null,null,80]
["External Analysis",null,"Weightage",null,70,null,null,null,null,null,"%Students"]
[{"$f":"\"Attainment Level 1: \"&K131&\"% students scoring more than the Target Grade Point\"","v":"Attainment Level 1: 60% students scoring more than the Target Grade Point"},null,null,null,null,null,null,null,null,null,60]
[{"$f":"\"Attainment Level 2: \"&K132&\"% students scoring more than the Target Grade Point\"","v":"Attainment Level 2: 70% students scoring more than the Target Grade Point"},null,null,null,null,null,null,null,null,null,70]
[{"$f":"\"Attainment Level 3: \"&K133&\"% students scoring more than the Target Grade Point\"","v":"Attainment Level 3: 80% students scoring more than the Target Grade Point"},null,null,null,null,null,null,null,null,null,80]
[]
[null,{"$f":"B10","v":"Name of Faculty : "},{"$f":"B11","v":"Namitha T N"}]
[null,"Dated Signature :  "]
[{"$f":"ROW(A118)-2","v":116},null,{"$f":"\"$C$\"&A137","v":"$C$116"},{"$f":"\"$D$\"&A137","v":"$D$116"}]
[]
[]
[]
[null,"Last Row Count",{"$f":"ROW(A118)-2","v":116},{"$f":"\"D\"&$C$141","v":"D116"}]

{"sheet":"Internal_Analysis","index":1,"n_rows":131,"n_cols":5,"rows_kept":131,"cut":false,"hidden":false,"merged":[[2,0,2,3],[4,0,4,3],[6,0,6,3],[8,0,8,3]]}
[]
[]
[{"$f":"Data_Sheet!A2","v":"Jyothi Engineering College, Cheruthuruthy"}]
[]
[{"$f":"Data_Sheet!A4","v":"Department of Computer Science Engineering"}]
[]
[{"$f":"Data_Sheet!A15","v":"CO Analysis - Internal Marks                        26-10-19"}]
[]
[{"$f":"Data_Sheet!A17","v":"S3 CS              CS203 Switching Theory and Logic Design               2019-20"}]
[]
[]
[]
[]
[]
[]
[]
[]
[]
[]
[]
[]
[{"$f":"'T1'!A18","v":"Register No."},{"$f":"'T1'!B18","v":"Name of Student"},{"$f":"'T1'!P18","v":"Total Marks (50)"},"Category"]
[]
["Column1","Column2","Column3","Column4"]
[{"$f":"Data_Sheet!A25","v":"JEC18CS001"},{"$f":"Data_Sheet!B25","v":"ABHISHEK KRISHNAN MENON E"},{"$f":"Data_Sheet!E25","v":23},{"$f":"IF(C25=\"A\",\"ABSENT\",IF(C25>=Data_Sheet!$E$9*$E$124/100,\"EXCELLENT\",IF(C25>=Data_Sheet!$E$9*$E$123/100,\"GOOD\",IF(C25>=Data_Sheet!$E$9*$E$122/100,\"AVERAGE\",\"POOR\"))))","v":"AVERAGE"}]
[{"$f":"Data_Sheet!A26","v":"JEC18CS002"},{"$f":"Data_Sheet!B26","v":"ABHISHEK SAJEEVAN"},{"$f":"Data_Sheet!E26","v":23},{"$f":"IF(C26=\"A\",\"ABSENT\",IF(C26>=Data_Sheet!$E$9*$E$124/100,\"EXCELLENT\",IF(C26>=Data_Sheet!$E$9*$E$123/100,\"GOOD\",IF(C26>=Data_Sheet!$E$9*$E$122/100,\"AVERAGE\",\"POOR\"))))","v":"AVERAGE"}]
[{"$f":"Data_Sheet!A27","v":"JEC18CS003"},{"$f":"Data_Sheet!B27","v":"ABHITH SHAJI"},{"$f":"Data_Sheet!E27","v":23},{"$f":"IF(C27=\"A\",\"ABSENT\",IF(C27>=Data_Sheet!$E$9*$E$124/100,\"EXCELLENT\",IF(C27>=Data_Sheet!$E$9*$E$123/100,\"GOOD\",IF(C27>=Data_Sheet!$E$9*$E$122/100,\"AVERAGE\",\"POOR\"))))","v":"AVERAGE"}]
[{"$f":"Data_Sheet!A28","v":"JEC18CS004"},{"$f":"Data_Sheet!B28","v":"ABIN SANTHOSH ALAPATT"},{"$f":"Data_Sheet!E28","v":32},{"$f":"IF(C28=\"A\",\"ABSENT\",IF(C28>=Data_Sheet!$E$9*$E$124/100,\"EXCELLENT\",IF(C28>=Data_Sheet!$E$9*$E$123/100,\"GOOD\",IF(C28>=Data_Sheet!$E$9*$E$122/100,\"AVERAGE\",\"POOR\"))))","v":"GOOD"}]
[{"$f":"Data_Sheet!A29","v":"JEC18CS005"},{"$f":"Data_Sheet!B29","v":"ADARSH KUMAR M A"},{"$f":"Data_Sheet!E29","v":33},{"$f":"IF(C29=\"A\",\"ABSENT\",IF(C29>=Data_Sheet!$E$9*$E$124/100,\"EXCELLENT\",IF(C29>=Data_Sheet!$E$9*$E$123/100,\"GOOD\",IF(C29>=Data_Sheet!$E$9*$E$122/100,\"AVERAGE\",\"POOR\"))))","v":"GOOD"}]
[{"$f":"Data_Sheet!A30","v":"JEC18CS006"},{"$f":"Data_Sheet!B30","v":"ADHITHYA KRISHNA S"},{"$f":"Data_Sheet!E30","v":29},{"$f":"IF(C30=\"A\",\"ABSENT\",IF(C30>=Data_Sheet!$E$9*$E$124/100,\"EXCELLENT\",IF(C30>=Data_Sheet!$E$9*$E$123/100,\"GOOD\",IF(C30>=Data_Sheet!$E$9*$E$122/100,\"AVERAGE\",\"POOR\"))))","v":"AVERAGE"}]
[{"$f":"Data_Sheet!A31","v":"JEC18CS007"},{"$f":"Data_Sheet!B31","v":"ADITHYA HARIDAS"},{"$f":"Data_Sheet!E31","v":36},{"$f":"IF(C31=\"A\",\"ABSENT\",IF(C31>=Data_Sheet!$E$9*$E$124/100,\"EXCELLENT\",IF(C31>=Data_Sheet!$E$9*$E$123/100,\"GOOD\",IF(C31>=Data_Sheet!$E$9*$E$122/100,\"AVERAGE\",\"POOR\"))))","v":"GOOD"}]
[{"$f":"Data_Sheet!A32","v":"JEC18CS008"},{"$f":"Data_Sheet!B32","v":"AJMAL BASHEER"},{"$f":"Data_Sheet!E32","v":24},{"$f":"IF(C32=\"A\",\"ABSENT\",IF(C32>=Data_Sheet!$E$9*$E$124/100,\"EXCELLENT\",IF(C32>=Data_Sheet!$E$9*$E$123/100,\"GOOD\",IF(C32>=Data_Sheet!$E$9*$E$122/100,\"AVERAGE\",\"POOR\"))))","v":"AVERAGE"}]
[{"$f":"Data_Sheet!A33","v":"JEC18CS009"},{"$f":"Data_Sheet!B33","v":"AKASH.V"},{"$f":"Data_Sheet!E33","v":23},{"$f":"IF(C33=\"A\",\"ABSENT\",IF(C33>=Data_Sheet!$E$9*$E$124/100,\"EXCELLENT\",IF(C33>=Data_Sheet!$E$9*$E$123/100,\"GOOD\",IF(C33>=Data_Sheet!$E$9*$E$122/100,\"AVERAGE\",\"POOR\"))))","v":"AVERAGE"}]
[{"$f":"Data_Sheet!A34","v":"JEC18CS010"},{"$f":"Data_Sheet!B34","v":"AKHIL AZEEZ UPPILAMKUNNATH"},{"$f":"Data_Sheet!E34","v":33},{"$f":"IF(C34=\"A\",\"ABSENT\",IF(C34>=Data_Sheet!$E$9*$E$124/100,\"EXCELLENT\",IF(C34>=Data_Sheet!$E$9*$E$123/100,\"GOOD\",IF(C34>=Data_Sheet!$E$9*$E$122/100,\"AVERAGE\",\"POOR\"))))","v":"GOOD"}]
[{"$f":"Data_Sheet!A35","v":"JEC18CS011"},{"$f":"Data_Sheet!B35","v":"AKHIL KRISHNA UK"},{"$f":"Data_Sheet!E35","v":27},{"$f":"IF(C35=\"A\",\"ABSENT\",IF(C35>=Data_Sheet!$E$9*$E$124/100,\"EXCELLENT\",IF(C35>=Data_Sheet!$E$9*$E$123/100,\"GOOD\",IF(C35>=Data_Sheet!$E$9*$E$122/100,\"AVERAGE\",\"POOR\"))))","v":"AVERAGE"}]
[{"$f":"Data_Sheet!A36","v":"JEC18CS012"},{"$f":"Data_Sheet!B36","v":"ALAN GEORGE"},{"$f":"Data_Sheet!E36","v":29},{"$f":"IF(C36=\"A\",\"ABSENT\",IF(C36>=Data_Sheet!$E$9*$E$124/100,\"EXCELLENT\",IF(C36>=Data_Sheet!$E$9*$E$123/100,\"GOOD\",IF(C36>=Data_Sheet!$E$9*$E$122/100,\"AVERAGE\",\"POOR\"))))","v":"AVERAGE"}]
[{"$f":"Data_Sheet!A37","v":"JEC18CS013"},{"$f":"Data_Sheet!B37","v":"ALEN VARGHESE"},{"$f":"Data_Sheet!E37","v":34},{"$f":"IF(C37=\"A\",\"ABSENT\",IF(C37>=Data_Sheet!$E$9*$E$124/100,\"EXCELLENT\",IF(C37>=Data_Sheet!$E$9*$E$123/100,\"GOOD\",IF(C37>=Data_Sheet!$E$9*$E$122/100,\"AVERAGE\",\"POOR\"))))","v":"GOOD"}]
[{"$f":"Data_Sheet!A38","v":"JEC18CS014"},{"$f":"Data_Sheet!B38","v":"AMAL SEBASTIAN"},{"$f":"Data_Sheet!E38","v":47},{"$f":"IF(C38=\"A\",\"ABSENT\",IF(C38>=Data_Sheet!$E$9*$E$124/100,\"EXCELLENT\",IF(C38>=Data_Sheet!$E$9*$E$123/100,\"GOOD\",IF(C38>=Data_Sheet!$E$9*$E$122/100,\"AVERAGE\",\"POOR\"))))","v":"EXCELLENT"}]
[{"$f":"Data_Sheet!A39","v":"JEC18CS015"},{"$f":"Data_Sheet!B39","v":"AMAL SONY"},{"$f":"Data_Sheet!E39","v":23},{"$f":"IF(C39=\"A\",\"ABSENT\",IF(C39>=Data_Sheet!$E$9*$E$124/100,\"EXCELLENT\",IF(C39>=Data_Sheet!$E$9*$E$123/100,\"GOOD\",IF(C39>=Data_Sheet!$E$9*$E$122/100,\"AVERAGE\",\"POOR\"))))","v":"AVERAGE"}]
[{"$f":"Data_Sheet!A40","v":"JEC18CS016"},{"$f":"Data_Sheet!B40","v":"ANAGHA WILSON"},{"$f":"Data_Sheet!E40","v":26},{"$f":"IF(C40=\"A\",\"ABSENT\",IF(C40>=Data_Sheet!$E$9*$E$124/100,\"EXCELLENT\",IF(C40>=Data_Sheet!$E$9*$E$123/100,\"GOOD\",IF(C40>=Data_Sheet!$E$9*$E$122/100,\"AVERAGE\",\"POOR\"))))","v":"AVERAGE"}]
[{"$f":"Data_Sheet!A41","v":"JEC18CS017"},{"$f":"Data_Sheet!B41","v":"ANETTE ANTO"},{"$f":"Data_Sheet!E41","v":23},{"$f":"IF(C41=\"A\",\"ABSENT\",IF(C41>=Data_Sheet!$E$9*$E$124/100,\"EXCELLENT\",IF(C41>=Data_Sheet!$E$9*$E$123/100,\"GOOD\",IF(C41>=Data_Sheet!$E$9*$E$122/100,\"AVERAGE\",\"POOR\"))))","v":"AVERAGE"}]
[{"$f":"Data_Sheet!A42","v":"JEC18CS018"},{"$f":"Data_Sheet!B42","v":"ANIT MARY THOMAS"},{"$f":"Data_Sheet!E42","v":37},{"$f":"IF(C42=\"A\",\"ABSENT\",IF(C42>=Data_Sheet!$E$9*$E$124/100,\"EXCELLENT\",IF(C42>=Data_Sheet!$E$9*$E$123/100,\"GOOD\",IF(C42>=Data_Sheet!$E$9*$E$122/100,\"AVERAGE\",\"POOR\"))))","v":"GOOD"}]
[{"$f":"Data_Sheet!A43","v":"JEC18CS020"},{"$f":"Data_Sheet!B43","v":"ANN THERESA SHAJI"},{"$f":"Data_Sheet!E43","v":48},{"$f":"IF(C43=\"A\",\"ABSENT\",IF(C43>=Data_Sheet!$E$9*$E$124/100,\"EXCELLENT\",IF(C43>=Data_Sheet!$E$9*$E$123/100,\"GOOD\",IF(C43>=Data_Sheet!$E$9*$E$122/100,\"AVERAGE\",\"POOR\"))))","v":"EXCELLENT"}]
[{"$f":"Data_Sheet!A44","v":"JEC18CS021"},{"$f":"Data_Sheet!B44","v":"ANTONY ROY"},{"$f":"Data_Sheet!E44","v":23},{"$f":"IF(C44=\"A\",\"ABSENT\",IF(C44>=Data_Sheet!$E$9*$E$124/100,\"EXCELLENT\",IF(C44>=Data_Sheet!$E$9*$E$123/100,\"GOOD\",IF(C44>=Data_Sheet!$E$9*$E$122/100,\"AVERAGE\",\"POOR\"))))","v":"AVERAGE"}]
[{"$f":"Data_Sheet!A45","v":"JEC18CS022"},{"$f":"Data_Sheet!B45","v":"ANUGRAHA C"},{"$f":"Data_Sheet!E45","v":36},{"$f":"IF(C45=\"A\",\"ABSENT\",IF(C45>=Data_Sheet!$E$9*$E$124/100,\"EXCELLENT\",IF(C45>=Data_Sheet!$E$9*$E$123/100,\"GOOD\",IF(C45>=Data_Sheet!$E$9*$E$122/100,\"AVERAGE\",\"POOR\"))))","v":"GOOD"}]
[{"$f":"Data_Sheet!A46","v":"JEC18CS023"},{"$f":"Data_Sheet!B46","v":"APARNA.V"},{"$f":"Data_Sheet!E46","v":37},{"$f":"IF(C46=\"A\",\"ABSENT\",IF(C46>=Data_Sheet!$E$9*$E$124/100,\"EXCELLENT\",IF(C46>=Data_Sheet!$E$9*$E$123/100,\"GOOD\",IF(C46>=Data_Sheet!$E$9*$E$122/100,\"AVERAGE\",\"POOR\"))))","v":"GOOD"}]
[{"$f":"Data_Sheet!A47","v":"JEC18CS024"},{"$f":"Data_Sheet!B47","v":"ARAVIND S KUMAR"},{"$f":"Data_Sheet!E47","v":31},{"$f":"IF(C47=\"A\",\"ABSENT\",IF(C47>=Data_Sheet!$E$9*$E$124/100,\"EXCELLENT\",IF(C47>=Data_Sheet!$E$9*$E$123/100,\"GOOD\",IF(C47>=Data_Sheet!$E$9*$E$122/100,\"AVERAGE\",\"POOR\"))))","v":"GOOD"}]
[{"$f":"Data_Sheet!A48","v":"JEC18CS025"},{"$f":"Data_Sheet!B48","v":"ARJUN VINOD"},{"$f":"Data_Sheet!E48","v":24},{"$f":"IF(C48=\"A\",\"ABSENT\",IF(C48>=Data_Sheet!$E$9*$E$124/100,\"EXCELLENT\",IF(C48>=Data_Sheet!$E$9*$E$123/100,\"GOOD\",IF(C48>=Data_Sheet!$E$9*$E$122/100,\"AVERAGE\",\"POOR\"))))","v":"AVERAGE"}]
[{"$f":"Data_Sheet!A49","v":"JEC18CS026"},{"$f":"Data_Sheet!B49","v":"ARUN VG"},{"$f":"Data_Sheet!E49","v":25},{"$f":"IF(C49=\"A\",\"ABSENT\",IF(C49>=Data_Sheet!$E$9*$E$124/100,\"EXCELLENT\",IF(C49>=Data_Sheet!$E$9*$E$123/100,\"GOOD\",IF(C49>=Data_Sheet!$E$9*$E$122/100,\"AVERAGE\",\"POOR\"))))","v":"AVERAGE"}]
[{"$f":"Data_Sheet!A50","v":"JEC18CS027"},{"$f":"Data_Sheet!B50","v":"ASHRUL K"},{"$f":"Data_Sheet!E50","v":36},{"$f":"IF(C50=\"A\",\"ABSENT\",IF(C50>=Data_Sheet!$E$9*$E$124/100,\"EXCELLENT\",IF(C50>=Data_Sheet!$E$9*$E$123/100,\"GOOD\",IF(C50>=Data_Sheet!$E$9*$E$122/100,\"AVERAGE\",\"POOR\"))))","v":"GOOD"}]
[{"$f":"Data_Sheet!A51","v":"JEC18CS028"},{"$f":"Data_Sheet!B51","v":"ATHIL PAULY"},{"$f":"Data_Sheet!E51","v":23},{"$f":"IF(C51=\"A\",\"ABSENT\",IF(C51>=Data_Sheet!$E$9*$E$124/100,\"EXCELLENT\",IF(C51>=Data_Sheet!$E$9*$E$123/100,\"GOOD\",IF(C51>=Data_Sheet!$E$9*$E$122/100,\"AVERAGE\",\"POOR\"))))","v":"AVERAGE"}]
[{"$f":"Data_Sheet!A52","v":"JEC18CS029"},{"$f":"Data_Sheet!B52","v":"ATHIRA K P"},{"$f":"Data_Sheet!E52","v":42},{"$f":"IF(C52=\"A\",\"ABSENT\",IF(C52>=Data_Sheet!$E$9*$E$124/100,\"EXCELLENT\",IF(C52>=Data_Sheet!$E$9*$E$123/100,\"GOOD\",IF(C52>=Data_Sheet!$E$9*$E$122/100,\"AVERAGE\",\"POOR\"))))","v":"EXCELLENT"}]
[{"$f":"Data_Sheet!A53","v":"JEC18CS030"},{"$f":"Data_Sheet!B53","v":"AWIN ANTO"},{"$f":"Data_Sheet!E53","v":27},{"$f":"IF(C53=\"A\",\"ABSENT\",IF(C53>=Data_Sheet!$E$9*$E$124/100,\"EXCELLENT\",IF(C53>=Data_Sheet!$E$9*$E$123/100,\"GOOD\",IF(C53>=Data_Sheet!$E$9*$E$122/100,\"AVERAGE\",\"POOR\"))))","v":"AVERAGE"}]
[{"$f":"Data_Sheet!A54","v":"JEC18CS031"},{"$f":"Data_Sheet!B54","v":"CHARLES JOHNSON"},{"$f":"Data_Sheet!E54","v":29},{"$f":"IF(C54=\"A\",\"ABSENT\",IF(C54>=Data_Sheet!$E$9*$E$124/100,\"EXCELLENT\",IF(C54>=Data_Sheet!$E$9*$E$123/100,\"GOOD\",IF(C54>=Data_Sheet!$E$9*$E$122/100,\"AVERAGE\",\"POOR\"))))","v":"AVERAGE"}]
[{"$f":"Data_Sheet!A55","v":"JEC18CS032"},{"$f":"Data_Sheet!B55","v":"CHITTILAPPILLY JOVIA JOHNSON"},{"$f":"Data_Sheet!E55","v":41},{"$f":"IF(C55=\"A\",\"ABSENT\",IF(C55>=Data_Sheet!$E$9*$E$124/100,\"EXCELLENT\",IF(C55>=Data_Sheet!$E$9*$E$123/100,\"GOOD\",IF(C55>=Data_Sheet!$E$9*$E$122/100,\"AVERAGE\",\"POOR\"))))","v":"EXCELLENT"}]
[{"$f":"Data_Sheet!A56","v":"JEC18CS033"},{"$f":"Data_Sheet!B56","v":"CIYA BABU"},{"$f":"Data_Sheet!E56","v":23},{"$f":"IF(C56=\"A\",\"ABSENT\",IF(C56>=Data_Sheet!$E$9*$E$124/100,\"EXCELLENT\",IF(C56>=Data_Sheet!$E$9*$E$123/100,\"GOOD\",IF(C56>=Data_Sheet!$E$9*$E$122/100,\"AVERAGE\",\"POOR\"))))","v":"AVERAGE"}]
[{"$f":"Data_Sheet!A57","v":"JEC18CS034"},{"$f":"Data_Sheet!B57","v":"DAVID SALUS"},{"$f":"Data_Sheet!E57","v":30},{"$f":"IF(C57=\"A\",\"ABSENT\",IF(C57>=Data_Sheet!$E$9*$E$124/100,\"EXCELLENT\",IF(C57>=Data_Sheet!$E$9*$E$123/100,\"GOOD\",IF(C57>=Data_Sheet!$E$9*$E$122/100,\"AVERAGE\",\"POOR\"))))","v":"GOOD"}]
[{"$f":"Data_Sheet!A58","v":"JEC18CS035"},{"$f":"Data_Sheet!B58","v":"DELICIA REJI"},{"$f":"Data_Sheet!E58","v":41},{"$f":"IF(C58=\"A\",\"ABSENT\",IF(C58>=Data_Sheet!$E$9*$E$124/100,\"EXCELLENT\",IF(C58>=Data_Sheet!$E$9*$E$123/100,\"GOOD\",IF(C58>=Data_Sheet!$E$9*$E$122/100,\"AVERAGE\",\"POOR\"))))","v":"EXCELLENT"}]
[{"$f":"Data_Sheet!A59","v":"JEC18CS036"},{"$f":"Data_Sheet!B59","v":"DELMA SHAJAN"},{"$f":"Data_Sheet!E59","v":37},{"$f":"IF(C59=\"A\",\"ABSENT\",IF(C59>=Data_Sheet!$E$9*$E$124/100,\"EXCELLENT\",IF(C59>=Data_Sheet!$E$9*$E$123/100,\"GOOD\",IF(C59>=Data_Sheet!$E$9*$E$122/100,\"AVERAGE\",\"POOR\"))))","v":"GOOD"}]
[{"$f":"Data_Sheet!A60","v":"JEC18CS037"},{"$f":"Data_Sheet!B60","v":"DILBER SHA AP"},{"$f":"Data_Sheet!E60","v":29},{"$f":"IF(C60=\"A\",\"ABSENT\",IF(C60>=Data_Sheet!$E$9*$E$124/100,\"EXCELLENT\",IF(C60>=Data_Sheet!$E$9*$E$123/100,\"GOOD\",IF(C60>=Data_Sheet!$E$9*$E$122/100,\"AVERAGE\",\"POOR\"))))","v":"AVERAGE"}]
[{"$f":"Data_Sheet!A61","v":"JEC18CS038"},{"$f":"Data_Sheet!B61","v":"EDWIN T JOY"},{"$f":"Data_Sheet!E61","v":37},{"$f":"IF(C61=\"A\",\"ABSENT\",IF(C61>=Data_Sheet!$E$9*$E$124/100,\"EXCELLENT\",IF(C61>=Data_Sheet!$E$9*$E$123/100,\"GOOD\",IF(C61>=Data_Sheet!$E$9*$E$122/100,\"AVERAGE\",\"POOR\"))))","v":"GOOD"}]
[{"$f":"Data_Sheet!A62","v":"JEC18CS039"},{"$f":"Data_Sheet!B62","v":"EDWIN WILSON"},{"$f":"Data_Sheet!E62","v":24},{"$f":"IF(C62=\"A\",\"ABSENT\",IF(C62>=Data_Sheet!$E$9*$E$124/100,\"EXCELLENT\",IF(C62>=Data_Sheet!$E$9*$E$123/100,\"GOOD\",IF(C62>=Data_Sheet!$E$9*$E$122/100,\"AVERAGE\",\"POOR\"))))","v":"AVERAGE"}]
[{"$f":"Data_Sheet!A63","v":"JEC18CS040"},{"$f":"Data_Sheet!B63","v":"EMMANUEL SHIBU"},{"$f":"Data_Sheet!E63","v":32},{"$f":"IF(C63=\"A\",\"ABSENT\",IF(C63>=Data_Sheet!$E$9*$E$124/100,\"EXCELLENT\",IF(C63>=Data_Sheet!$E$9*$E$123/100,\"GOOD\",IF(C63>=Data_Sheet!$E$9*$E$122/100,\"AVERAGE\",\"POOR\"))))","v":"GOOD"}]
[{"$f":"Data_Sheet!A64","v":"JEC18CS041"},{"$f":"Data_Sheet!B64","v":"GAYATHRI DINESH"},{"$f":"Data_Sheet!E64","v":28},{"$f":"IF(C64=\"A\",\"ABSENT\",IF(C64>=Data_Sheet!$E$9*$E$124/100,\"EXCELLENT\",IF(C64>=Data_Sheet!$E$9*$E$123/100,\"GOOD\",IF(C64>=Data_Sheet!$E$9*$E$122/100,\"AVERAGE\",\"POOR\"))))","v":"AVERAGE"}]
[{"$f":"Data_Sheet!A65","v":"JEC18CS042"},{"$f":"Data_Sheet!B65","v":"GOKUL DAS M"},{"$f":"Data_Sheet!E65","v":32},{"$f":"IF(C65=\"A\",\"ABSENT\",IF(C65>=Data_Sheet!$E$9*$E$124/100,\"EXCELLENT\",IF(C65>=Data_Sheet!$E$9*$E$123/100,\"GOOD\",IF(C65>=Data_Sheet!$E$9*$E$122/100,\"AVERAGE\",\"POOR\"))))","v":"GOOD"}]
[{"$f":"Data_Sheet!A66","v":"JEC18CS043"},{"$f":"Data_Sheet!B66","v":"G RAMGOPAL"},{"$f":"Data_Sheet!E66","v":48},{"$f":"IF(C66=\"A\",\"ABSENT\",IF(C66>=Data_Sheet!$E$9*$E$124/100,\"EXCELLENT\",IF(C66>=Data_Sheet!$E$9*$E$123/100,\"GOOD\",IF(C66>=Data_Sheet!$E$9*$E$122/100,\"AVERAGE\",\"POOR\"))))","v":"EXCELLENT"}]
[{"$f":"Data_Sheet!A67","v":"JEC18CS044"},{"$f":"Data_Sheet!B67","v":"HARIES DAVIS"},{"$f":"Data_Sheet!E67","v":29},{"$f":"IF(C67=\"A\",\"ABSENT\",IF(C67>=Data_Sheet!$E$9*$E$124/100,\"EXCELLENT\",IF(C67>=Data_Sheet!$E$9*$E$123/100,\"GOOD\",IF(C67>=Data_Sheet!$E$9*$E$122/100,\"AVERAGE\",\"POOR\"))))","v":"AVERAGE"}]
[{"$f":"Data_Sheet!A68","v":"JEC18CS045"},{"$f":"Data_Sheet!B68","v":"HARISANKER P"},{"$f":"Data_Sheet!E68","v":34},{"$f":"IF(C68=\"A\",\"ABSENT\",IF(C68>=Data_Sheet!$E$9*$E$124/100,\"EXCELLENT\",IF(C68>=Data_Sheet!$E$9*$E$123/100,\"GOOD\",IF(C68>=Data_Sheet!$E$9*$E$122/100,\"AVERAGE\",\"POOR\"))))","v":"GOOD"}]
[{"$f":"Data_Sheet!A69","v":"JEC18CS046"},{"$f":"Data_Sheet!B69","v":"HARSHA.K.S."},{"$f":"Data_Sheet!E69","v":39},{"$f":"IF(C69=\"A\",\"ABSENT\",IF(C69>=Data_Sheet!$E$9*$E$124/100,\"EXCELLENT\",IF(C69>=Data_Sheet!$E$9*$E$123/100,\"GOOD\",IF(C69>=Data_Sheet!$E$9*$E$122/100,\"AVERAGE\",\"POOR\"))))","v":"GOOD"}]
[{"$f":"Data_Sheet!A70","v":"JEC18CS047"},{"$f":"Data_Sheet!B70","v":"HELNA THOMAS"},{"$f":"Data_Sheet!E70","v":42},{"$f":"IF(C70=\"A\",\"ABSENT\",IF(C70>=Data_Sheet!$E$9*$E$124/100,\"EXCELLENT\",IF(C70>=Data_Sheet!$E$9*$E$123/100,\"GOOD\",IF(C70>=Data_Sheet!$E$9*$E$122/100,\"AVERAGE\",\"POOR\"))))","v":"EXCELLENT"}]
[{"$f":"Data_Sheet!A71","v":"JEC18CS048"},{"$f":"Data_Sheet!B71","v":"HRIDI KRISHNA.H"},{"$f":"Data_Sheet!E71","v":28},{"$f":"IF(C71=\"A\",\"ABSENT\",IF(C71>=Data_Sheet!$E$9*$E$124/100,\"EXCELLENT\",IF(C71>=Data_Sheet!$E$9*$E$123/100,\"GOOD\",IF(C71>=Data_Sheet!$E$9*$E$122/100,\"AVERAGE\",\"POOR\"))))","v":"AVERAGE"}]
[{"$f":"Data_Sheet!A72","v":"JEC18CS049"},{"$f":"Data_Sheet!B72","v":"INDRAJIT R"},{"$f":"Data_Sheet!E72","v":23},{"$f":"IF(C72=\"A\",\"ABSENT\",IF(C72>=Data_Sheet!$E$9*$E$124/100,\"EXCELLENT\",IF(C72>=Data_Sheet!$E$9*$E$123/100,\"GOOD\",IF(C72>=Data_Sheet!$E$9*$E$122/100,\"AVERAGE\",\"POOR\"))))","v":"AVERAGE"}]
[{"$f":"Data_Sheet!A73","v":"JEC18CS050"},{"$f":"Data_Sheet!B73","v":"JESWIN JOJY"},{"$f":"Data_Sheet!E73","v":42},{"$f":"IF(C73=\"A\",\"ABSENT\",IF(C73>=Data_Sheet!$E$9*$E$124/100,\"EXCELLENT\",IF(C73>=Data_Sheet!$E$9*$E$123/100,\"GOOD\",IF(C73>=Data_Sheet!$E$9*$E$122/100,\"AVERAGE\",\"POOR\"))))","v":"EXCELLENT"}]
[{"$f":"Data_Sheet!A74","v":"JEC18CS051"},{"$f":"Data_Sheet!B74","v":"JIBIN A BABU"},{"$f":"Data_Sheet!E74","v":29},{"$f":"IF(C74=\"A\",\"ABSENT\",IF(C74>=Data_Sheet!$E$9*$E$124/100,\"EXCELLENT\",IF(C74>=Data_Sheet!$E$9*$E$123/100,\"GOOD\",IF(C74>=Data_Sheet!$E$9*$E$122/100,\"AVERAGE\",\"POOR\"))))","v":"AVERAGE"}]
[{"$f":"Data_Sheet!A75","v":"JEC18CS052"},{"$f":"Data_Sheet!B75","v":"JISSY JOY"},{"$f":"Data_Sheet!E75","v":45},{"$f":"IF(C75=\"A\",\"ABSENT\",IF(C75>=Data_Sheet!$E$9*$E$124/100,\"EXCELLENT\",IF(C75>=Data_Sheet!$E$9*$E$123/100,\"GOOD\",IF(C75>=Data_Sheet!$E$9*$E$122/100,\"AVERAGE\",\"POOR\"))))","v":"EXCELLENT"}]
[{"$f":"Data_Sheet!A76","v":"JEC18CS053"},{"$f":"Data_Sheet!B76","v":"JOEL JAMES KARIKKANDATHIL"},{"$f":"Data_Sheet!E76","v":26},{"$f":"IF(C76=\"A\",\"ABSENT\",IF(C76>=Data_Sheet!$E$9*$E$124/100,\"EXCELLENT\",IF(C76>=Data_Sheet!$E$9*$E$123/100,\"GOOD\",IF(C76>=Data_Sheet!$E$9*$E$122/100,\"AVERAGE\",\"POOR\"))))","v":"AVERAGE"}]
[{"$f":"Data_Sheet!A77","v":"JEC18CS054"},{"$f":"Data_Sheet!B77","v":"JOSE REJI KARIMADATHI"},{"$f":"Data_Sheet!E77","v":23},{"$f":"IF(C77=\"A\",\"ABSENT\",IF(C77>=Data_Sheet!$E$9*$E$124/100,\"EXCELLENT\",IF(C77>=Data_Sheet!$E$9*$E$123/100,\"GOOD\",IF(C77>=Data_Sheet!$E$9*$E$122/100,\"AVERAGE\",\"POOR\"))))","v":"AVERAGE"}]
[{"$f":"Data_Sheet!A78","v":"JEC18CS055"},{"$f":"Data_Sheet!B78","v":"JUMANA HASIN"},{"$f":"Data_Sheet!E78","v":40},{"$f":"IF(C78=\"A\",\"ABSENT\",IF(C78>=Data_Sheet!$E$9*$E$124/100,\"EXCELLENT\",IF(C78>=Data_Sheet!$E$9*$E$123/100,\"GOOD\",IF(C78>=Data_Sheet!$E$9*$E$122/100,\"AVERAGE\",\"POOR\"))))","v":"EXCELLENT"}]
[{"$f":"Data_Sheet!A79","v":"JEC18CS056"},{"$f":"Data_Sheet!B79","v":"KAILASHNATH"},{"$f":"Data_Sheet!E79","v":28},{"$f":"IF(C79=\"A\",\"ABSENT\",IF(C79>=Data_Sheet!$E$9*$E$124/100,\"EXCELLENT\",IF(C79>=Data_Sheet!$E$9*$E$123/100,\"GOOD\",IF(C79>=Data_Sheet!$E$9*$E$122/100,\"AVERAGE\",\"POOR\"))))","v":"AVERAGE"}]
[{"$f":"Data_Sheet!A80","v":"JEC18CS057"},{"$f":"Data_Sheet!B80","v":"K AJISHKUMAR"},{"$f":"Data_Sheet!E80","v":28},{"$f":"IF(C80=\"A\",\"ABSENT\",IF(C80>=Data_Sheet!$E$9*$E$124/100,\"EXCELLENT\",IF(C80>=Data_Sheet!$E$9*$E$123/100,\"GOOD\",IF(C80>=Data_Sheet!$E$9*$E$122/100,\"AVERAGE\",\"POOR\"))))","v":"AVERAGE"}]
[{"$f":"Data_Sheet!A81","v":"JEC18CS058"},{"$f":"Data_Sheet!B81","v":"KEERTHANA K S"},{"$f":"Data_Sheet!E81","v":23},{"$f":"IF(C81=\"A\",\"ABSENT\",IF(C81>=Data_Sheet!$E$9*$E$124/100,\"EXCELLENT\",IF(C81>=Data_Sheet!$E$9*$E$123/100,\"GOOD\",IF(C81>=Data_Sheet!$E$9*$E$122/100,\"AVERAGE\",\"POOR\"))))","v":"AVERAGE"}]
[{"$f":"Data_Sheet!A82","v":"JEC18CS059"},{"$f":"Data_Sheet!B82","v":"KEVIN VARGHESE"},{"$f":"Data_Sheet!E82","v":43},{"$f":"IF(C82=\"A\",\"ABSENT\",IF(C82>=Data_Sheet!$E$9*$E$124/100,\"EXCELLENT\",IF(C82>=Data_Sheet!$E$9*$E$123/100,\"GOOD\",IF(C82>=Data_Sheet!$E$9*$E$122/100,\"AVERAGE\",\"POOR\"))))","v":"EXCELLENT"}]
[{"$f":"Data_Sheet!A83","v":"JEC18CS060"},{"$f":"Data_Sheet!B83","v":"LAKSHMI SADANANDAN"},{"$f":"Data_Sheet!E83","v":25},{"$f":"IF(C83=\"A\",\"ABSENT\",IF(C83>=Data_Sheet!$E$9*$E$124/100,\"EXCELLENT\",IF(C83>=Data_Sheet!$E$9*$E$123/100,\"GOOD\",IF(C83>=Data_Sheet!$E$9*$E$122/100,\"AVERAGE\",\"POOR\"))))","v":"AVERAGE"}]
[{"$f":"Data_Sheet!A84","v":"JEC18CS061"},{"$f":"Data_Sheet!B84","v":"LEYA PALLAN"},{"$f":"Data_Sheet!E84","v":26},{"$f":"IF(C84=\"A\",\"ABSENT\",IF(C84>=Data_Sheet!$E$9*$E$124/100,\"EXCELLENT\",IF(C84>=Data_Sheet!$E$9*$E$123/100,\"GOOD\",IF(C84>=Data_Sheet!$E$9*$E$122/100,\"AVERAGE\",\"POOR\"))))","v":"AVERAGE"}]
[{"$f":"Data_Sheet!A85","v":"JEC18CS062"},{"$f":"Data_Sheet!B85","v":"MARVEL BABU"},{"$f":"Data_Sheet!E85","v":23},{"$f":"IF(C85=\"A\",\"ABSENT\",IF(C85>=Data_Sheet!$E$9*$E$124/100,\"EXCELLENT\",IF(C85>=Data_Sheet!$E$9*$E$123/100,\"GOOD\",IF(C85>=Data_Sheet!$E$9*$E$122/100,\"AVERAGE\",\"POOR\"))))","v":"AVERAGE"}]
[{"$f":"Data_Sheet!A86","v":"JEC18CS063"},{"$f":"Data_Sheet!B86","v":"MEDWIN PAUL"},{"$f":"Data_Sheet!E86","v":23},{"$f":"IF(C86=\"A\",\"ABSENT\",IF(C86>=Data_Sheet!$E$9*$E$124/100,\"EXCELLENT\",IF(C86>=Data_Sheet!$E$9*$E$123/100,\"GOOD\",IF(C86>=Data_Sheet!$E$9*$E$122/100,\"AVERAGE\",\"POOR\"))))","v":"AVERAGE"}]
[{"$f":"Data_Sheet!A87","v":0},{"$f":"Data_Sheet!B87","v":0},{"$f":"Data_Sheet!E87","v":0},{"$f":"IF(C87=\"A\",\"ABSENT\",IF(C87>=Data_Sheet!$E$9*$E$124/100,\"EXCELLENT\",IF(C87>=Data_Sheet!$E$9*$E$123/100,\"GOOD\",IF(C87>=Data_Sheet!$E$9*$E$122/100,\"AVERAGE\",\"POOR\"))))","v":"POOR"}]
[{"$f":"Data_Sheet!A88","v":0},{"$f":"Data_Sheet!B88","v":0},{"$f":"Data_Sheet!E88","v":0},{"$f":"IF(C88=\"A\",\"ABSENT\",IF(C88>=Data_Sheet!$E$9*$E$124/100,\"EXCELLENT\",IF(C88>=Data_Sheet!$E$9*$E$123/100,\"GOOD\",IF(C88>=Data_Sheet!$E$9*$E$122/100,\"AVERAGE\",\"POOR\"))))","v":"POOR"}]
[{"$f":"Data_Sheet!A89","v":"JEC18CS066"},{"$f":"Data_Sheet!B89","v":"MUHAMMED INSHADH"},{"$f":"Data_Sheet!E89","v":23},{"$f":"IF(C89=\"A\",\"ABSENT\",IF(C89>=Data_Sheet!$E$9*$E$124/100,\"EXCELLENT\",IF(C89>=Data_Sheet!$E$9*$E$123/100,\"GOOD\",IF(C89>=Data_Sheet!$E$9*$E$122/100,\"AVERAGE\",\"POOR\"))))","v":"AVERAGE"}]
[{"$f":"Data_Sheet!A90","v":"JEC18CS067"},{"$f":"Data_Sheet!B90","v":"NAIR MIDHUN RAMACHANDRAN"},{"$f":"Data_Sheet!E90","v":28},{"$f":"IF(C90=\"A\",\"ABSENT\",IF(C90>=Data_Sheet!$E$9*$E$124/100,\"EXCELLENT\",IF(C90>=Data_Sheet!$E$9*$E$123/100,\"GOOD\",IF(C90>=Data_Sheet!$E$9*$E$122/100,\"AVERAGE\",\"POOR\"))))","v":"AVERAGE"}]
[{"$f":"Data_Sheet!A91","v":"JEC18CS068"},{"$f":"Data_Sheet!B91","v":"NAVEENA ANTONY"},{"$f":"Data_Sheet!E91","v":30},{"$f":"IF(C91=\"A\",\"ABSENT\",IF(C91>=Data_Sheet!$E$9*$E$124/100,\"EXCELLENT\",IF(C91>=Data_Sheet!$E$9*$E$123/100,\"GOOD\",IF(C91>=Data_Sheet!$E$9*$E$122/100,\"AVERAGE\",\"POOR\"))))","v":"GOOD"}]
[{"$f":"Data_Sheet!A92","v":"JEC18CS069"},{"$f":"Data_Sheet!B92","v":"NITIN MADHU"},{"$f":"Data_Sheet!E92","v":37},{"$f":"IF(C92=\"A\",\"ABSENT\",IF(C92>=Data_Sheet!$E$9*$E$124/100,\"EXCELLENT\",IF(C92>=Data_Sheet!$E$9*$E$123/100,\"GOOD\",IF(C92>=Data_Sheet!$E$9*$E$122/100,\"AVERAGE\",\"POOR\"))))","v":"GOOD"}]
[{"$f":"Data_Sheet!A93","v":"JEC18CS070"},{"$f":"Data_Sheet!B93","v":"PRATHIUSH ARUN"},{"$f":"Data_Sheet!E93","v":29},{"$f":"IF(C93=\"A\",\"ABSENT\",IF(C93>=Data_Sheet!$E$9*$E$124/100,\"EXCELLENT\",IF(C93>=Data_Sheet!$E$9*$E$123/100,\"GOOD\",IF(C93>=Data_Sheet!$E$9*$E$122/100,\"AVERAGE\",\"POOR\"))))","v":"AVERAGE"}]
[{"$f":"Data_Sheet!A94","v":"JEC18CS071"},{"$f":"Data_Sheet!B94","v":"RACHEL CECER"},{"$f":"Data_Sheet!E94","v":42},{"$f":"IF(C94=\"A\",\"ABSENT\",IF(C94>=Data_Sheet!$E$9*$E$124/100,\"EXCELLENT\",IF(C94>=Data_Sheet!$E$9*$E$123/100,\"GOOD\",IF(C94>=Data_Sheet!$E$9*$E$122/100,\"AVERAGE\",\"POOR\"))))","v":"EXCELLENT"}]
[{"$f":"Data_Sheet!A95","v":"JEC18CS072"},{"$f":"Data_Sheet!B95","v":"RAHUL RAJU"},{"$f":"Data_Sheet!E95","v":24},{"$f":"IF(C95=\"A\",\"ABSENT\",IF(C95>=Data_Sheet!$E$9*$E$124/100,\"EXCELLENT\",IF(C95>=Data_Sheet!$E$9*$E$123/100,\"GOOD\",IF(C95>=Data_Sheet!$E$9*$E$122/100,\"AVERAGE\",\"POOR\"))))","v":"AVERAGE"}]
[{"$f":"Data_Sheet!A96","v":"JEC18CS073"},{"$f":"Data_Sheet!B96","v":"RAHUL T RAVI"},{"$f":"Data_Sheet!E96","v":28},{"$f":"IF(C96=\"A\",\"ABSENT\",IF(C96>=Data_Sheet!$E$9*$E$124/100,\"EXCELLENT\",IF(C96>=Data_Sheet!$E$9*$E$123/100,\"GOOD\",IF(C96>=Data_Sheet!$E$9*$E$122/100,\"AVERAGE\",\"POOR\"))))","v":"AVERAGE"}]
[{"$f":"Data_Sheet!A97","v":"JEC18CS074"},{"$f":"Data_Sheet!B97","v":"RAPHEAL K MOYALAN"},{"$f":"Data_Sheet!E97","v":23},{"$f":"IF(C97=\"A\",\"ABSENT\",IF(C97>=Data_Sheet!$E$9*$E$124/100,\"EXCELLENT\",IF(C97>=Data_Sheet!$E$9*$E$123/100,\"GOOD\",IF(C97>=Data_Sheet!$E$9*$E$122/100,\"AVERAGE\",\"POOR\"))))","v":"AVERAGE"}]
[{"$f":"Data_Sheet!A98","v":"JEC18CS075"},{"$f":"Data_Sheet!B98","v":"RISHIKESH. V"},{"$f":"Data_Sheet!E98","v":34},{"$f":"IF(C98=\"A\",\"ABSENT\",IF(C98>=Data_Sheet!$E$9*$E$124/100,\"EXCELLENT\",IF(C98>=Data_Sheet!$E$9*$E$123/100,\"GOOD\",IF(C98>=Data_Sheet!$E$9*$E$122/100,\"AVERAGE\",\"POOR\"))))","v":"GOOD"}]
[{"$f":"Data_Sheet!A99","v":"JEC18CS076"},{"$f":"Data_Sheet!B99","v":"ROCKSON T. AUGUSTINE"},{"$f":"Data_Sheet!E99","v":32},{"$f":"IF(C99=\"A\",\"ABSENT\",IF(C99>=Data_Sheet!$E$9*$E$124/100,\"EXCELLENT\",IF(C99>=Data_Sheet!$E$9*$E$123/100,\"GOOD\",IF(C99>=Data_Sheet!$E$9*$E$122/100,\"AVERAGE\",\"POOR\"))))","v":"GOOD"}]
[{"$f":"Data_Sheet!A100","v":"JEC18CS077"},{"$f":"Data_Sheet!B100","v":"SARATH C P"},{"$f":"Data_Sheet!E100","v":38},{"$f":"IF(C100=\"A\",\"ABSENT\",IF(C100>=Data_Sheet!$E$9*$E$124/100,\"EXCELLENT\",IF(C100>=Data_Sheet!$E$9*$E$123/100,\"GOOD\",IF(C100>=Data_Sheet!$E$9*$E$122/100,\"AVERAGE\",\"POOR\"))))","v":"GOOD"}]
[{"$f":"Data_Sheet!A101","v":"JEC18CS078"},{"$f":"Data_Sheet!B101","v":"SARATH SASI"},{"$f":"Data_Sheet!E101","v":40},{"$f":"IF(C101=\"A\",\"ABSENT\",IF(C101>=Data_Sheet!$E$9*$E$124/100,\"EXCELLENT\",IF(C101>=Data_Sheet!$E$9*$E$123/100,\"GOOD\",IF(C101>=Data_Sheet!$E$9*$E$122/100,\"AVERAGE\",\"POOR\"))))","v":"EXCELLENT"}]
[{"$f":"Data_Sheet!A102","v":"JEC18CS079"},{"$f":"Data_Sheet!B102","v":"SHAFNA"},{"$f":"Data_Sheet!E102","v":49},{"$f":"IF(C102=\"A\",\"ABSENT\",IF(C102>=Data_Sheet!$E$9*$E$124/100,\"EXCELLENT\",IF(C102>=Data_Sheet!$E$9*$E$123/100,\"GOOD\",IF(C102>=Data_Sheet!$E$9*$E$122/100,\"AVERAGE\",\"POOR\"))))","v":"EXCELLENT"}]
[{"$f":"Data_Sheet!A103","v":"JEC18CS080"},{"$f":"Data_Sheet!B103","v":"SHELMY SHABU"},{"$f":"Data_Sheet!E103","v":45},{"$f":"IF(C103=\"A\",\"ABSENT\",IF(C103>=Data_Sheet!$E$9*$E$124/100,\"EXCELLENT\",IF(C103>=Data_Sheet!$E$9*$E$123/100,\"GOOD\",IF(C103>=Data_Sheet!$E$9*$E$122/100,\"AVERAGE\",\"POOR\"))))","v":"EXCELLENT"}]
[{"$f":"Data_Sheet!A104","v":"JEC18CS081"},{"$f":"Data_Sheet!B104","v":"SHIZA SHIHAB PUVAMPARAMBIL"},{"$f":"Data_Sheet!E104","v":37},{"$f":"IF(C104=\"A\",\"ABSENT\",IF(C104>=Data_Sheet!$E$9*$E$124/100,\"EXCELLENT\",IF(C104>=Data_Sheet!$E$9*$E$123/100,\"GOOD\",IF(C104>=Data_Sheet!$E$9*$E$122/100,\"AVERAGE\",\"POOR\"))))","v":"GOOD"}]
[{"$f":"Data_Sheet!A105","v":"JEC18CS082"},{"$f":"Data_Sheet!B105","v":"SIJO GEORGE"},{"$f":"Data_Sheet!E105","v":33},{"$f":"IF(C105=\"A\",\"ABSENT\",IF(C105>=Data_Sheet!$E$9*$E$124/100,\"EXCELLENT\",IF(C105>=Data_Sheet!$E$9*$E$123/100,\"GOOD\",IF(C105>=Data_Sheet!$E$9*$E$122/100,\"AVERAGE\",\"POOR\"))))","v":"GOOD"}]
[{"$f":"Data_Sheet!A106","v":"JEC18CS083"},{"$f":"Data_Sheet!B106","v":"SOURAV K"},{"$f":"Data_Sheet!E106","v":23},{"$f":"IF(C106=\"A\",\"ABSENT\",IF(C106>=Data_Sheet!$E$9*$E$124/100,\"EXCELLENT\",IF(C106>=Data_Sheet!$E$9*$E$123/100,\"GOOD\",IF(C106>=Data_Sheet!$E$9*$E$122/100,\"AVERAGE\",\"POOR\"))))","v":"AVERAGE"}]
[{"$f":"Data_Sheet!A107","v":0},{"$f":"Data_Sheet!B107","v":0},{"$f":"Data_Sheet!E107","v":0},{"$f":"IF(C107=\"A\",\"ABSENT\",IF(C107>=Data_Sheet!$E$9*$E$124/100,\"EXCELLENT\",IF(C107>=Data_Sheet!$E$9*$E$123/100,\"GOOD\",IF(C107>=Data_Sheet!$E$9*$E$122/100,\"AVERAGE\",\"POOR\"))))","v":"POOR"}]
[{"$f":"Data_Sheet!A108","v":"JEC18CS085"},{"$f":"Data_Sheet!B108","v":"SREEHARI"},{"$f":"Data_Sheet!E108","v":23},{"$f":"IF(C108=\"A\",\"ABSENT\",IF(C108>=Data_Sheet!$E$9*$E$124/100,\"EXCELLENT\",IF(C108>=Data_Sheet!$E$9*$E$123/100,\"GOOD\",IF(C108>=Data_Sheet!$E$9*$E$122/100,\"AVERAGE\",\"POOR\"))))","v":"AVERAGE"}]
[{"$f":"Data_Sheet!A109","v":"JEC18CS086"},{"$f":"Data_Sheet!B109","v":"SREEKANTH P"},{"$f":"Data_Sheet!E109","v":23},{"$f":"IF(C109=\"A\",\"ABSENT\",IF(C109>=Data_Sheet!$E$9*$E$124/100,\"EXCELLENT\",IF(C109>=Data_Sheet!$E$9*$E$123/100,\"GOOD\",IF(C109>=Data_Sheet!$E$9*$E$122/100,\"AVERAGE\",\"POOR\"))))","v":"AVERAGE"}]
[{"$f":"Data_Sheet!A110","v":"JEC18CS087"},{"$f":"Data_Sheet!B110","v":"SREELEKSHMI H KUMAR"},{"$f":"Data_Sheet!E110","v":34},{"$f":"IF(C110=\"A\",\"ABSENT\",IF(C110>=Data_Sheet!$E$9*$E$124/100,\"EXCELLENT\",IF(C110>=Data_Sheet!$E$9*$E$123/100,\"GOOD\",IF(C110>=Data_Sheet!$E$9*$E$122/100,\"AVERAGE\",\"POOR\"))))","v":"GOOD"}]
[{"$f":"Data_Sheet!A111","v":"JEC18CS088"},{"$f":"Data_Sheet!B111","v":"SUFAIL BADUSHA.T"},{"$f":"Data_Sheet!E111","v":32},{"$f":"IF(C111=\"A\",\"ABSENT\",IF(C111>=Data_Sheet!$E$9*$E$124/100,\"EXCELLENT\",IF(C111>=Data_Sheet!$E$9*$E$123/100,\"GOOD\",IF(C111>=Data_Sheet!$E$9*$E$122/100,\"AVERAGE\",\"POOR\"))))","v":"GOOD"}]
[{"$f":"Data_Sheet!A112","v":"JEC18CS089"},{"$f":"Data_Sheet!B112","v":"TIYA THOMAS"},{"$f":"Data_Sheet!E112","v":45},{"$f":"IF(C112=\"A\",\"ABSENT\",IF(C112>=Data_Sheet!$E$9*$E$124/100,\"EXCELLENT\",IF(C112>=Data_Sheet!$E$9*$E$123/100,\"GOOD\",IF(C112>=Data_Sheet!$E$9*$E$122/100,\"AVERAGE\",\"POOR\"))))","v":"EXCELLENT"}]
[{"$f":"Data_Sheet!A113","v":"JEC18CS090"},{"$f":"Data_Sheet!B113","v":"TOMSUN PAVOO P"},{"$f":"Data_Sheet!E113","v":31},{"$f":"IF(C113=\"A\",\"ABSENT\",IF(C113>=Data_Sheet!$E$9*$E$124/100,\"EXCELLENT\",IF(C113>=Data_Sheet!$E$9*$E$123/100,\"GOOD\",IF(C113>=Data_Sheet!$E$9*$E$122/100,\"AVERAGE\",\"POOR\"))))","v":"GOOD"}]
[{"$f":"Data_Sheet!A114","v":"JEC18CS091"},{"$f":"Data_Sheet!B114","v":"ULLAS. S"},{"$f":"Data_Sheet!E114","v":23},{"$f":"IF(C114=\"A\",\"ABSENT\",IF(C114>=Data_Sheet!$E$9*$E$124/100,\"EXCELLENT\",IF(C114>=Data_Sheet!$E$9*$E$123/100,\"GOOD\",IF(C114>=Data_Sheet!$E$9*$E$122/100,\"AVERAGE\",\"POOR\"))))","v":"AVERAGE"}]
[{"$f":"Data_Sheet!A115","v":"JEC18CS092"},{"$f":"Data_Sheet!B115","v":"VAISHNAV M"},{"$f":"Data_Sheet!E115","v":23},{"$f":"IF(C115=\"A\",\"ABSENT\",IF(C115>=Data_Sheet!$E$9*$E$124/100,\"EXCELLENT\",IF(C115>=Data_Sheet!$E$9*$E$123/100,\"GOOD\",IF(C115>=Data_Sheet!$E$9*$E$122/100,\"AVERAGE\",\"POOR\"))))","v":"AVERAGE"}]
[{"$f":"Data_Sheet!A116","v":"JEC18CS093"},{"$f":"Data_Sheet!B116","v":"VANI PRAKASHAN CHOYYAN"},{"$f":"Data_Sheet!E116","v":49},{"$f":"IF(C116=\"A\",\"ABSENT\",IF(C116>=Data_Sheet!$E$9*$E$124/100,\"EXCELLENT\",IF(C116>=Data_Sheet!$E$9*$E$123/100,\"GOOD\",IF(C116>=Data_Sheet!$E$9*$E$122/100,\"AVERAGE\",\"POOR\"))))","v":"EXCELLENT"}]
[]
["Total Number of Students",null,{"$f":"Data_Sheet!$C$6","v":92}]
["Number of Students Absent",null,{"$f":"IF(COUNTIF(C25:INDIRECT(C131),\"=A\"),COUNTIF(C25:INDIRECT(C131),\"=A\"),0)","v":0}]
["Total Number of Students attended",null,{"$f":"C118-C119","v":92}]
[{"$f":"\"Number of Students with Marks less than \"&E122&\"%\"","v":"Number of Students with Marks less than 45%"},null,{"$f":"IF(COUNTIF(D25:INDIRECT(D131),\"=POOR\"),COUNTIF(D25:INDIRECT(D131),\"=POOR\"),0)","v":3},"POOR","Range"]
[{"$f":"\"Number of Students with Marks betweeen \"&E122&\"% to \"&E123&\"%\"","v":"Number of Students with Marks betweeen 45% to 60%"},null,{"$f":"IF(COUNTIF(D25:INDIRECT(D131),\"=AVERAGE\"),COUNTIF(D25:INDIRECT(D131),\"=AVERAGE\"),0)","v":45},"AVERAGE",45]
[{"$f":"\"Number of Students with Marks betweeen \"&E123&\"% to \"&E124&\"%\"","v":"Number of Students with Marks betweeen 60% to 80%"},null,{"$f":"IF(COUNTIF(D25:INDIRECT(D131),\"=GOOD\"),COUNTIF(D25:INDIRECT(D131),\"=GOOD\"),0)","v":27},"GOOD",60]
[{"$f":"\"Number of Students with Marks greater than \"&E124&\"%\"","v":"Number of Students with Marks greater than 80%"},null,{"$f":"IF(COUNTIF(D25:INDIRECT(D131),\"=EXCELLENT\"),COUNTIF(D25:INDIRECT(D131),\"=EXCELLENT\"),0)","v":17},"EXCELLENT",80]
["Class Average",null,{"$f":"ROUND(AVERAGE(C25:INDIRECT(C131)),2)","v":30.49}]
["Pass Percentage",null,{"$f":"ROUND(((C120-C121)/C120)*100,2)","v":96.74}]
[]
[null,{"$f":"Data_Sheet!B10","v":"Name of Faculty : "},{"$f":"Data_Sheet!B11","v":"Namitha T N"}]
[null,{"$f":"Data_Sheet!B136","v":"Dated Signature :  "}]
[]
[{"$f":"ROW(A118)-2","v":116},"Last Row Count",{"$f":"\"$C$\"&$A$131","v":"$C$116"},{"$f":"\"$D$\"&$A$131","v":"$D$116"}]

{"sheet":"T1","index":2,"n_rows":181,"n_cols":26,"rows_kept":181,"cut":false,"hidden":false,"merged":[[147,22,152,22],[154,22,159,22],[161,22,166,22],[168,22,173,22],[140,22,145,22],[121,0,121,2],[117,0,117,2],[118,0,118,2],[119,0,119,2],[120,0,120,2],[17,18,21,18],[2,6,2,14],[3,6,3,14],[2,0,4,1],[4,2,4,4],[2,2,2,5],[3,2,3,5],[6,0,6,15],[8,0,8,15],[10,0,10,15],[12,0,12,15],[17,0,21,0],[17,1,21,1],[17,15,21,15]]}
[]
[]
["Add questions one by one as needed..",null,"Assessment Category",null,null,null,"Date : ",null,null,null,null,null,null,null,null,null,"CO1","First Internal Exam"]
[null,null,"First Internal Exam",null,null,null,"2018-02-12",null,null,null,null,null,null,null,null,null,"CO2","Second Internal Exam",null,null,{"$f":"TEXT(G4,\"dd-mm-yy\")","v":"12-02-18"}]
[null,null,"Total Marks : ",null,null,50,null,null,null,null,null,null,null,null,null,null,"CO3","Assessment Exam - 1"]
[null,null,null,null,null,null,null,null,null,null,null,null,null,null,null,null,"CO4","Assessment Exam - 2"]
[{"$f":"Data_Sheet!A2","v":"Jyothi Engineering College, Cheruthuruthy"},null,null,null,null,null,null,null,null,null,null,null,null,null,null,null,"CO5","Assignment - 1"]
[null,null,null,null,null,null,null,null,null,null,null,null,null,null,null,null,"CO6","Assignment - 2"]
[{"$f":"Data_Sheet!A4","v":"Department of Computer Science Engineering"},null,null,null,null,null,null,null,null,null,null,null,null,null,null,null,null,"Retest"]
[null,null,null,null,null,null,null,null,null,null,null,null,null,null,null,null,1]
[{"$f":"\"CO Analysis - Internal Marks : \"&C4 &\"                       \" &TEXT(G4,\"dd-mm-yy\")","v":"CO Analysis - Internal Marks : First Internal Exam                       12-02-18"},null,null,null,null,null,null,null,null,null,null,null,null,null,null,null,2]
[null,null,null,null,null,null,null,null,null,null,null,null,null,null,null,null,3]
[{"$f":"Internal_Analysis!A9","v":"S3 CS              CS203 Switching Theory and Logic Design               2019-20"},null,null,null,null,null,null,null,null,null,null,null,null,null,null,null,4]
[null,null,null,null,null,null,null,null,null,null,null,null,null,null,null,null,5]
[null,null,null,null,null,null,null,null,null,null,null,null,null,null,null,null,6]
[]
[]
["Register No.","Name of Student","Qn. No.",1,2,3,4,5,6,7,8,9,10,11,12,{"$f":" \"Total Marks (\" &F5 & \")\"","v":"Total Marks (50)"},null,null,"Calculated Total Marks (50)"]
[null,null,"CO's","CO1","CO1","CO1","CO2","CO2","CO1","CO1","CO1","CO1","CO1","CO1","CO1"]
[null,null,"Blooms Taxonomy Lavel",1,1,1,2,1,1,1,1,1,1,1,1]
[null,null,"Max. Marks",3,3,3,3,2,3,3,3,9,9,9,9]
[null,null,"Difficulty Level in %",60,60,60,60,60,60,60,60,60,60,60,60]
[]
["Column1","Column2","Column3","Column4","Column5","Column6","Column7","Column4","Column4","Column4","Column4","Column4","Column4","Column4","Column8","Column32"]
[{"$f":"Data_Sheet!A25","v":"JEC18CS001"},{"$f":"Data_Sheet!B25","v":"ABHISHEK KRISHNAN MENON E"},null,2,2.5,0,1.5,1,1.5,0,0,1.5,5,5,null,20,null,null,{"$f":"SUM(D25:O25)","v":20}]
[{"$f":"Data_Sheet!A26","v":"JEC18CS002"},{"$f":"Data_Sheet!B26","v":"ABHISHEK SAJEEVAN"},null,3,2,0,3,2,null,null,null,null,null,null,null,10,null,null,{"$f":"SUM(D26:O26)","v":10}]
[{"$f":"Data_Sheet!A27","v":"JEC18CS003"},{"$f":"Data_Sheet!B27","v":"ABHITH SHAJI"},null,3,3,3,2,2,3,0,0,1,3,1,null,21,null,null,21]
[{"$f":"Data_Sheet!A28","v":"JEC18CS004"},{"$f":"Data_Sheet!B28","v":"ABIN SANTHOSH ALAPATT"},null,3,3,3,2,2,3,0,0,4,4,4,null,28,null,null,28]
[{"$f":"Data_Sheet!A29","v":"JEC18CS005"},{"$f":"Data_Sheet!B29","v":"ADARSH KUMAR M A"},null,2,2.5,0,1.5,1,1.5,0,1.5,6,9,9,null,34,null,null,34]
[{"$f":"Data_Sheet!A30","v":"JEC18CS006"},{"$f":"Data_Sheet!B30","v":"ADHITHYA KRISHNA S"},null,3,2,2,1,1,2,0,3,7,4,null,null,25,null,null,25]
[{"$f":"Data_Sheet!A31","v":"JEC18CS007"},{"$f":"Data_Sheet!B31","v":"ADITHYA HARIDAS"},null,2.5,4.5,4.5,2,0.5,2,1,0,7,7,7,null,40,null,null,38]
[{"$f":"Data_Sheet!A32","v":"JEC18CS008"},{"$f":"Data_Sheet!B32","v":"AJMAL BASHEER"},null,3,3,3,3,3,2,null,null,null,null,null,null,17,null,null,17]
[{"$f":"Data_Sheet!A33","v":"JEC18CS009"},{"$f":"Data_Sheet!B33","v":"AKASH.V"},null,3,3,3,3,3,3,0,1,null,null,null,null,19,null,null,19]
[{"$f":"Data_Sheet!A34","v":"JEC18CS010"},{"$f":"Data_Sheet!B34","v":"AKHIL AZEEZ UPPILAMKUNNATH"},null,3,3,3,3,3,3,0,0,6,null,null,null,24,null,null,24]
[{"$f":"Data_Sheet!A35","v":"JEC18CS011"},{"$f":"Data_Sheet!B35","v":"AKHIL KRISHNA UK"},null,3,1,3,0,1,0,3,3,7,7,7,null,35,null,null,35]
[{"$f":"Data_Sheet!A36","v":"JEC18CS012"},{"$f":"Data_Sheet!B36","v":"ALAN GEORGE"},null,3,1.5,3,0,2,1,0.5,0,7,7,7,null,32,null,null,32]
[{"$f":"Data_Sheet!A37","v":"JEC18CS013"},{"$f":"Data_Sheet!B37","v":"ALEN VARGHESE"},null,3,1.5,0,0,2.5,0,2,3,7,7,2,null,28,null,null,28]
[{"$f":"Data_Sheet!A38","v":"JEC18CS014"},{"$f":"Data_Sheet!B38","v":"AMAL SEBASTIAN"},null,3,3,3,3,3,3,1,2,9,9,9,null,48,null,null,48]
[{"$f":"Data_Sheet!A39","v":"JEC18CS015"},{"$f":"Data_Sheet!B39","v":"AMAL SONY"},null,3,3,3,3,3,3,null,null,null,null,null,null,18,null,null,18]
[{"$f":"Data_Sheet!A40","v":"JEC18CS016"},{"$f":"Data_Sheet!B40","v":"ANAGHA WILSON"},null,3,1.5,0,0,2,2,1.5,null,null,null,null,null,10,null,null,10]
[{"$f":"Data_Sheet!A41","v":"JEC18CS017"},{"$f":"Data_Sheet!B41","v":"ANETTE ANTO"},null,null,1,3,3,null,null,null,null,null,null,null,null,7,null,null,7]
[{"$f":"Data_Sheet!A42","v":"JEC18CS018"},{"$f":"Data_Sheet!B42","v":"ANIT MARY THOMAS"},null,3,3,3,3,3,3,0,3,7,7,null,null,35,null,null,35]
[{"$f":"Data_Sheet!A43","v":"JEC18CS020"},{"$f":"Data_Sheet!B43","v":"ANN THERESA SHAJI"},null,null,null,null,null,null,null,null,null,null,null,null,null,"A"]
[{"$f":"Data_Sheet!A44","v":"JEC18CS021"},{"$f":"Data_Sheet!B44","v":"ANTONY ROY"},null,3,1.5,0.5,3,1,3,0,null,null,null,null,null,12,null,null,12]
[{"$f":"Data_Sheet!A45","v":"JEC18CS022"},{"$f":"Data_Sheet!B45","v":"ANUGRAHA C"},null,2.5,2,0.5,0,2,0.5,0,0.5,7,7,7,null,29,null,null,29]
[{"$f":"Data_Sheet!A46","v":"JEC18CS023"},{"$f":"Data_Sheet!B46","v":"APARNA.V"},null,3,3,3,3,2.5,2.5,1,2,7,5,null,1,33,null,null,33]
[{"$f":"Data_Sheet!A47","v":"JEC18CS024"},{"$f":"Data_Sheet!B47","v":"ARAVIND S KUMAR"},null,2,1.5,3,3,2,2.5,0,2,null,3,null,null,19,null,null,19]
[{"$f":"Data_Sheet!A48","v":"JEC18CS025"},{"$f":"Data_Sheet!B48","v":"ARJUN VINOD"},null,2,2,0,1,0,1,1,0,7,7,7,null,28,null,null,28]
[{"$f":"Data_Sheet!A49","v":"JEC18CS026"},{"$f":"Data_Sheet!B49","v":"ARUN VG"},null,3,3,3,3,3,3,0,0,null,null,null,null,18,null,null,18]
[{"$f":"Data_Sheet!A50","v":"JEC18CS027"},{"$f":"Data_Sheet!B50","v":"ASHRUL K"},null,3,3,3,3,3,2,3,3,7,4,null,null,34,null,null,34]
[{"$f":"Data_Sheet!A51","v":"JEC18CS028"},{"$f":"Data_Sheet!B51","v":"ATHIL PAULY"},null,2.5,3,3,0,1.5,1,2,3,null,null,4,null,20,null,null,20]
[{"$f":"Data_Sheet!A52","v":"JEC18CS029"},{"$f":"Data_Sheet!B52","v":"ATHIRA K P"},null,3,3,3,3,3,3,2,3,9,9,3,null,44,null,null,44]
[{"$f":"Data_Sheet!A53","v":"JEC18CS030"},{"$f":"Data_Sheet!B53","v":"AWIN ANTO"},null,3,3,0,0,0.5,0,0,0,7,7,6.5,null,27,null,null,27]
[{"$f":"Data_Sheet!A54","v":"JEC18CS031"},{"$f":"Data_Sheet!B54","v":"CHARLES JOHNSON"},null,3,3,3,3,3,3,2,3,null,1,null,null,24,null,null,24]
[{"$f":"Data_Sheet!A55","v":"JEC18CS032"},{"$f":"Data_Sheet!B55","v":"CHITTILAPPILLY JOVIA JOHNSON"},null,3,3,3,3,3,0.5,3,0,9,9,9,null,46,null,null,45.5]
[{"$f":"Data_Sheet!A56","v":"JEC18CS033"},{"$f":"Data_Sheet!B56","v":"CIYA BABU"},null,1,3,3,3,2,null,null,3,null,null,null,null,15,null,null,15]
[{"$f":"Data_Sheet!A57","v":"JEC18CS034"},{"$f":"Data_Sheet!B57","v":"DAVID SALUS"},null,1,3,3,3,3,3,1,3,7,7,1,null,35,null,null,35]
[{"$f":"Data_Sheet!A58","v":"JEC18CS035"},{"$f":"Data_Sheet!B58","v":"DELICIA REJI"},null,3,1.5,2,3,2,2,0,2,7,8,3.5,null,34,null,null,34]
[{"$f":"Data_Sheet!A59","v":"JEC18CS036"},{"$f":"Data_Sheet!B59","v":"DELMA SHAJAN"},null,3,3,3,3,3,3,2,3,4,4,null,4,35,null,null,35]
[{"$f":"Data_Sheet!A60","v":"JEC18CS037"},{"$f":"Data_Sheet!B60","v":"DILBER SHA AP"},null,3,3,3,3,3,3,2,3,null,null,null,null,23,null,null,23]
[{"$f":"Data_Sheet!A61","v":"JEC18CS038"},{"$f":"Data_Sheet!B61","v":"EDWIN T JOY"},null,3,1.5,3,3,3,2,2,1.5,8,8,8,null,43,null,null,43]
[{"$f":"Data_Sheet!A62","v":"JEC18CS039"},{"$f":"Data_Sheet!B62","v":"EDWIN WILSON"},null,3,3,3,3,2,3,0,0,null,2,null,null,19,null,null,19]
[{"$f":"Data_Sheet!A63","v":"JEC18CS040"},{"$f":"Data_Sheet!B63","v":"EMMANUEL SHIBU"},null,1,3,3,3,3,3,1,3,8,null,8,null,36,null,null,36]
[{"$f":"Data_Sheet!A64","v":"JEC18CS041"},{"$f":"Data_Sheet!B64","v":"GAYATHRI DINESH"},null,1,1.5,3,3,3,1,0.5,0,null,8,null,null,21,null,null,21]
[{"$f":"Data_Sheet!A65","v":"JEC18CS042"},{"$f":"Data_Sheet!B65","v":"GOKUL DAS M"},null,3,3,3,3,3,3,2,3,null,null,null,null,23,null,null,23]
[{"$f":"Data_Sheet!A66","v":"JEC18CS043"},{"$f":"Data_Sheet!B66","v":"G RAMGOPAL"},null,3,3,3,3,3,3,2,3,9,9,8,null,49,null,null,49]
[{"$f":"Data_Sheet!A67","v":"JEC18CS044"},{"$f":"Data_Sheet!B67","v":"HARIES DAVIS"},null,3,1.5,3,3,2,2,2,1.5,8,8,1,null,35,null,null,35]
[{"$f":"Data_Sheet!A68","v":"JEC18CS045"},{"$f":"Data_Sheet!B68","v":"HARISANKER P"},null,1,1.5,3,3,3,2,0.5,0,7,7,null,null,29,null,null,28]
[{"$f":"Data_Sheet!A69","v":"JEC18CS046"},{"$f":"Data_Sheet!B69","v":"HARSHA.K.S."},null,3,2.5,2,0.5,0.5,3,2,2.5,8,8,9,null,41,null,null,41]
[{"$f":"Data_Sheet!A70","v":"JEC18CS047"},{"$f":"Data_Sheet!B70","v":"HELNA THOMAS"},null,3,3,3,3,3,3,2,3,8,8,5,null,44,null,null,44]
[{"$f":"Data_Sheet!A71","v":"JEC18CS048"},{"$f":"Data_Sheet!B71","v":"HRIDI KRISHNA.H"},null,3,3,3,3,3,3,2,3,5,null,4,null,32,null,null,32]
[{"$f":"Data_Sheet!A72","v":"JEC18CS049"},{"$f":"Data_Sheet!B72","v":"INDRAJIT R"},null,0,0,3,3,0,2,0,0,null,7,null,8,23,null,null,23]
[{"$f":"Data_Sheet!A73","v":"JEC18CS050"},{"$f":"Data_Sheet!B73","v":"JESWIN JOJY"},null,3,3,3,3,3,3,2,3,9,9,null,7,48,null,null,48]
[{"$f":"Data_Sheet!A74","v":"JEC18CS051"},{"$f":"Data_Sheet!B74","v":"JIBIN A BABU"},null,1,1.5,3,3,3,2,0.5,0,null,5,null,8,27,null,null,27]
[{"$f":"Data_Sheet!A75","v":"JEC18CS052"},{"$f":"Data_Sheet!B75","v":"JISSY JOY"},null,3,2,3,3,3,3,0,2.5,9,null,9,6.5,44,null,null,44]
[{"$f":"Data_Sheet!A76","v":"JEC18CS053"},{"$f":"Data_Sheet!B76","v":"JOEL JAMES KARIKKANDATHIL"},null,3,3,3,3,3,3,2,3,null,null,5,null,28,null,null,28]
[{"$f":"Data_Sheet!A77","v":"JEC18CS054"},{"$f":"Data_Sheet!B77","v":"JOSE REJI KARIMADATHI"},null,2,1.5,3,3,2,2.5,0,2,null,null,null,null,16,null,null,16]
[{"$f":"Data_Sheet!A78","v":"JEC18CS055"},{"$f":"Data_Sheet!B78","v":"JUMANA HASIN"},null,3,3,3,3,3,3,2,3,8,null,8,4,43,null,null,43]
[{"$f":"Data_Sheet!A79","v":"JEC18CS056"},{"$f":"Data_Sheet!B79","v":"KAILASHNATH"},null,3,3,3,3,3,3,0,3,8,null,3,null,32,null,null,32]
[{"$f":"Data_Sheet!A80","v":"JEC18CS057"},{"$f":"Data_Sheet!B80","v":"K AJISHKUMAR"},null,3,3,3,3,3,2,3,3,null,null,6,null,29,null,null,29]
[{"$f":"Data_Sheet!A81","v":"JEC18CS058"},{"$f":"Data_Sheet!B81","v":"KEERTHANA K S"},null,2.5,3,3,0,1.5,1,2,1,null,null,null,null,14,null,null,14]
[{"$f":"Data_Sheet!A82","v":"JEC18CS059"},{"$f":"Data_Sheet!B82","v":"KEVIN VARGHESE"},null,3,3,3,3,3,3,2,3,8,8,5,null,44,null,null,44]
[{"$f":"Data_Sheet!A83","v":"JEC18CS060"},{"$f":"Data_Sheet!B83","v":"LAKSHMI SADANANDAN"},null,3,3,0,0,0.5,0,0,0,5,5,6.5,null,23,null,null,23]
[{"$f":"Data_Sheet!A84","v":"JEC18CS061"},{"$f":"Data_Sheet!B84","v":"LEYA PALLAN"},null,null,null,null,null,null,null,null,null,null,null,null,null,"A"]
[{"$f":"Data_Sheet!A85","v":"JEC18CS062"},{"$f":"Data_Sheet!B85","v":"MARVEL BABU"},null,1.5,1.5,0,1.5,1,0.5,2,0,5,5,5,null,23,null,null,23]
[{"$f":"Data_Sheet!A86","v":"JEC18CS063"},{"$f":"Data_Sheet!B86","v":"MEDWIN PAUL"},null,1,3,3,3,3,3,1,3,null,null,null,5,25,null,null,25]
[{"$f":"Data_Sheet!A87","v":0},{"$f":"Data_Sheet!B87","v":0},null,null,null,null,null,null,null,null,null,null,null,null,null,"A",null,null,0]
[{"$f":"Data_Sheet!A88","v":0},{"$f":"Data_Sheet!B88","v":0},null,null,null,null,null,null,null,null,null,null,null,null,null,"A",null,null,0]
[{"$f":"Data_Sheet!A89","v":"JEC18CS066"},{"$f":"Data_Sheet!B89","v":"MUHAMMED INSHADH"},null,1.5,1.5,0,1.5,1,0.5,2,1,null,5,5,7,26,null,null,26]
[{"$f":"Data_Sheet!A90","v":"JEC18CS067"},{"$f":"Data_Sheet!B90","v":"NAIR MIDHUN RAMACHANDRAN"},null,1,3,3,3,3,2,1,3,5,2,null,null,26,null,null,{"$f":"SUM(D90:O90)","v":26}]
[{"$f":"Data_Sheet!A91","v":"JEC18CS068"},{"$f":"Data_Sheet!B91","v":"NAVEENA ANTONY"},null,3,1.5,3,3,3,2,2,1.5,null,2,null,null,21,null,null,21]
[{"$f":"Data_Sheet!A92","v":"JEC18CS069"},{"$f":"Data_Sheet!B92","v":"NITIN MADHU"},null,3,3,3,3,2.5,3,0.5,0,9,9,9,null,45,null,null,45]
[{"$f":"Data_Sheet!A93","v":"JEC18CS070"},{"$f":"Data_Sheet!B93","v":"PRATHIUSH ARUN"},null,1,3,3,3,3,3,1,3,5,5,5,null,33,null,null,35]
[{"$f":"Data_Sheet!A94","v":"JEC18CS071"},{"$f":"Data_Sheet!B94","v":"RACHEL CECER"},null,1,1.5,3,3,3,1,2,0.5,8,8,8,null,39,null,null,39]
[{"$f":"Data_Sheet!A95","v":"JEC18CS072"},{"$f":"Data_Sheet!B95","v":"RAHUL RAJU"},null,null,null,null,null,null,null,null,null,null,null,null,null,"A",null,null,0]
[{"$f":"Data_Sheet!A96","v":"JEC18CS073"},{"$f":"Data_Sheet!B96","v":"RAHUL T RAVI"},null,1,1,1,3,3,1,2,3,8,6,null,5,34,null,null,34]
[{"$f":"Data_Sheet!A97","v":"JEC18CS074"},{"$f":"Data_Sheet!B97","v":"RAPHEAL K MOYALAN"},null,3,1.5,3,3,2,2,2,1.5,null,null,1,null,19,null,null,19]
[{"$f":"Data_Sheet!A98","v":"JEC18CS075"},{"$f":"Data_Sheet!B98","v":"RISHIKESH. V"},null,1,1.5,3,3,3,2,0.5,0,5,8,4,null,31,null,null,31]
[{"$f":"Data_Sheet!A99","v":"JEC18CS076"},{"$f":"Data_Sheet!B99","v":"ROCKSON T. AUGUSTINE"},null,3,2.5,2,0.5,0.5,3,2,2.5,8,8,4,null,36,null,null,36]
[{"$f":"Data_Sheet!A100","v":"JEC18CS077"},{"$f":"Data_Sheet!B100","v":"SARATH C P"},null,3,3,3,3,3,3,2,3,8,7,null,4,42,null,null,42]
[{"$f":"Data_Sheet!A101","v":"JEC18CS078"},{"$f":"Data_Sheet!B101","v":"SARATH SASI"},null,3,3,3,3,3,3,2,3,8,8,null,6,45,null,null,45]
[{"$f":"Data_Sheet!A102","v":"JEC18CS079"},{"$f":"Data_Sheet!B102","v":"SHAFNA"},null,3,3,3,3,3,3,2,3,9,9,9,null,50,null,null,50]
[{"$f":"Data_Sheet!A103","v":"JEC18CS080"},{"$f":"Data_Sheet!B103","v":"SHELMY SHABU"},null,3,3,3,3,3,2,2,0,8,8,5,null,40,null,null,40]
[{"$f":"Data_Sheet!A104","v":"JEC18CS081"},{"$f":"Data_Sheet!B104","v":"SHIZA SHIHAB PUVAMPARAMBIL"},null,3,3,3,3,3,2,3,3,8,null,8,8,47,null,null,47]
[{"$f":"Data_Sheet!A105","v":"JEC18CS082"},{"$f":"Data_Sheet!B105","v":"SIJO GEORGE"},null,3,2,3,3,3,3,0,2.5,8,3,0.5,null,31,null,null,31]
[{"$f":"Data_Sheet!A106","v":"JEC18CS083"},{"$f":"Data_Sheet!B106","v":"SOURAV K"},null,3,3,3,3,3,3,2,3,null,null,3,null,26,null,null,26]
[{"$f":"Data_Sheet!A107","v":0},{"$f":"Data_Sheet!B107","v":0},null,3,1.5,3,3,3,2,2,1.5,null,null,null,null,"A"]
[{"$f":"Data_Sheet!A108","v":"JEC18CS085"},{"$f":"Data_Sheet!B108","v":"SREEHARI"},null,3,3,3,3,2.5,3,0,0,5,3.5,1,null,27,null,null,27]
[{"$f":"Data_Sheet!A109","v":"JEC18CS086"},{"$f":"Data_Sheet!B109","v":"SREEKANTH P"},null,1,3,3,3,3,3,0,1,null,null,null,null,17,null,null,17]
[{"$f":"Data_Sheet!A110","v":"JEC18CS087"},{"$f":"Data_Sheet!B110","v":"SREELEKSHMI H KUMAR"},null,1,1.5,3,3,3,1,0.5,0,8,null,4,null,25,null,null,25]
[{"$f":"Data_Sheet!A111","v":"JEC18CS088"},{"$f":"Data_Sheet!B111","v":"SUFAIL BADUSHA.T"},null,3,3,3,3,3,3,2,3,null,8,null,null,31,null,null,31]
[{"$f":"Data_Sheet!A112","v":"JEC18CS089"},{"$f":"Data_Sheet!B112","v":"TIYA THOMAS"},null,3,3,3,3,3,3,2,3,9,9,null,8,49,null,null,49]
[{"$f":"Data_Sheet!A113","v":"JEC18CS090"},{"$f":"Data_Sheet!B113","v":"TOMSUN PAVOO P"},null,3,1.5,3,3,2,2,2,1.5,null,null,6,8,32,null,null,32]
[{"$f":"Data_Sheet!A114","v":"JEC18CS091"},{"$f":"Data_Sheet!B114","v":"ULLAS. S"},null,1,1.5,3,3,3,2,0.5,0,8,null,1,null,23,null,null,23]
[{"$f":"Data_Sheet!A115","v":"JEC18CS092"},{"$f":"Data_Sheet!B115","v":"VAISHNAV M"},null,3,2.5,2,0.5,0.5,3,2,2.5,8,7,null,null,31,null,null,31]
[{"$f":"Data_Sheet!A116","v":"JEC18CS093"},{"$f":"Data_Sheet!B116","v":"VANI PRAKASHAN CHOYYAN"},null,3,3,3,3,2,3,3,3,8.5,9,9,null,49.5,null,null,49.5]
[]
["Total Marks scored for the Question",null,null,{"$f":"IF(D$22<>\"\",IF(SUM(D25:INDIRECT(D138))>=0,SUM(D25:INDIRECT(D138)),\"\"),\"\")","v":215},{"$f":"IF(E$22<>\"\",IF(SUM(E25:INDIRECT(E138))>=0,SUM(E25:INDIRECT(E138)),\"\"),\"\")","v":212},{"$f":"IF(F$22<>\"\",IF(SUM(F25:INDIRECT(F138))>=0,SUM(F25:INDIRECT(F138)),\"\"),\"\")","v":220.5},{"$f":"IF(G$22<>\"\",IF(SUM(G25:INDIRECT(G138))>=0,SUM(G25:INDIRECT(G138)),\"\"),\"\")","v":213.5},{"$f":"IF(H$22<>\"\",IF(SUM(H25:INDIRECT(H138))>=0,SUM(H25:INDIRECT(H138)),\"\"),\"\")","v":203},{"$f":"IF(I$22<>\"\",IF(SUM(I25:INDIRECT(I138))>=0,SUM(I25:INDIRECT(I138)),\"\"),\"\")","v":188.5},{"$f":"IF(J$22<>\"\",IF(SUM(J25:INDIRECT(J138))>=0,SUM(J25:INDIRECT(J138)),\"\"),\"\")","v":102.5},{"$f":"IF(K$22<>\"\",IF(SUM(K25:INDIRECT(K138))>=0,SUM(K25:INDIRECT(K138)),\"\"),\"\")","v":143},{"$f":"IF(L$22<>\"\",IF(SUM(L25:INDIRECT(L138))>=0,SUM(L25:INDIRECT(L138)),\"\"),\"\")","v":397},{"$f":"IF(M$22<>\"\",IF(SUM(M25:INDIRECT(M138))>=0,SUM(M25:INDIRECT(M138)),\"\"),\"\")","v":361.5},{"$f":"IF(N$22<>\"\",IF(SUM(N25:INDIRECT(N138))>=0,SUM(N25:INDIRECT(N138)),\"\"),\"\")","v":265},{"$f":"IF(O$22<>\"\",IF(SUM(O25:INDIRECT(O138))>=0,SUM(O25:INDIRECT(O138)),\"\"),\"\")","v":89.5}]
["No. of Students who attended the Question",null,null,{"$f":"IF(D$22<>\"\",IF(COUNT(D25:INDIRECT(D138))>=0,COUNT(D25:INDIRECT(D138)),\"\"),\"\")","v":86},{"$f":"IF(E$22<>\"\",IF(COUNT(E25:INDIRECT(E138))>=0,COUNT(E25:INDIRECT(E138)),\"\"),\"\")","v":87},{"$f":"IF(F$22<>\"\",IF(COUNT(F25:INDIRECT(F138))>=0,COUNT(F25:INDIRECT(F138)),\"\"),\"\")","v":87},{"$f":"IF(G$22<>\"\",IF(COUNT(G25:INDIRECT(G138))>=0,COUNT(G25:INDIRECT(G138)),\"\"),\"\")","v":87},{"$f":"IF(H$22<>\"\",IF(COUNT(H25:INDIRECT(H138))>=0,COUNT(H25:INDIRECT(H138)),\"\"),\"\")","v":86},{"$f":"IF(I$22<>\"\",IF(COUNT(I25:INDIRECT(I138))>=0,COUNT(I25:INDIRECT(I138)),\"\"),\"\")","v":84},{"$f":"IF(J$22<>\"\",IF(COUNT(J25:INDIRECT(J138))>=0,COUNT(J25:INDIRECT(J138)),\"\"),\"\")","v":82},{"$f":"IF(K$22<>\"\",IF(COUNT(K25:INDIRECT(K138))>=0,COUNT(K25:INDIRECT(K138)),\"\"),\"\")","v":81},{"$f":"IF(L$22<>\"\",IF(COUNT(L25:INDIRECT(L138))>=0,COUNT(L25:INDIRECT(L138)),\"\"),\"\")","v":56},{"$f":"IF(M$22<>\"\",IF(COUNT(M25:INDIRECT(M138))>=0,COUNT(M25:INDIRECT(M138)),\"\"),\"\")","v":56},{"$f":"IF(N$22<>\"\",IF(COUNT(N25:INDIRECT(N138))>=0,COUNT(N25:INDIRECT(N138)),\"\"),\"\")","v":49},{"$f":"IF(O$22<>\"\",IF(COUNT(O25:INDIRECT(O138))>=0,COUNT(O25:INDIRECT(O138)),\"\"),\"\")","v":15}]
["Difficulty Level marks of the Question",null,null,{"$f":"IF(D21*D22/100=0,\"\",D21*D22/100)","v":1.8},1.8,1.8,1.8,{"$f":"IF(H21*H22/100=0,\"\",H21*H22/100)","v":1.2},{"$f":"IF(I21*I22/100=0,\"\",I21*I22/100)","v":1.8},{"$f":"IF(J21*J22/100=0,\"\",J21*J22/100)","v":1.8},{"$f":"IF(K21*K22/100=0,\"\",K21*K22/100)","v":1.8},{"$f":"IF(L21*L22/100=0,\"\",L21*L22/100)","v":5.4},{"$f":"IF(M21*M22/100=0,\"\",M21*M22/100)","v":5.4},{"$f":"IF(N21*N22/100=0,\"\",N21*N22/100)","v":5.4},{"$f":"IF(O21*O22/100=0,\"\",O21*O22/100)","v":5.4}]
["No. of Students who scored above the Difficulty Level",null,null,{"$f":"IF(COUNTIF(D25:INDIRECT(D138),\">=\"&D120)=0,\"\",COUNTIF(D25:INDIRECT(D138),\">=\"&D120))","v":68},{"$f":"IF(COUNTIF(E25:INDIRECT(E138),\">=\"&E120)=0,\"\",COUNTIF(E25:INDIRECT(E138),\">=\"&E120))","v":61},{"$f":"IF(COUNTIF(F25:INDIRECT(F138),\">=\"&F120)=0,\"\",COUNTIF(F25:INDIRECT(F138),\">=\"&F120))","v":74},{"$f":"IF(COUNTIF(G25:INDIRECT(G138),\">=\"&G120)=0,\"\",COUNTIF(G25:INDIRECT(G138),\">=\"&G120))","v":69},{"$f":"IF(COUNTIF(H25:INDIRECT(H138),\">=\"&H120)=0,\"\",COUNTIF(H25:INDIRECT(H138),\">=\"&H120))","v":71},{"$f":"IF(COUNTIF(I25:INDIRECT(I138),\">=\"&I120)=0,\"\",COUNTIF(I25:INDIRECT(I138),\">=\"&I120))","v":66},{"$f":"IF(COUNTIF(J25:INDIRECT(J138),\">=\"&J120)=0,\"\",COUNTIF(J25:INDIRECT(J138),\">=\"&J120))","v":41},{"$f":"IF(COUNTIF(K25:INDIRECT(K138),\">=\"&K120)=0,\"\",COUNTIF(K25:INDIRECT(K138),\">=\"&K120))","v":45},{"$f":"IF(COUNTIF(L25:INDIRECT(L138),\">=\"&L120)=0,\"\",COUNTIF(L25:INDIRECT(L138),\">=\"&L120))","v":45},{"$f":"IF(COUNTIF(M25:INDIRECT(M138),\">=\"&M120)=0,\"\",COUNTIF(M25:INDIRECT(M138),\">=\"&M120))","v":37},{"$f":"IF(COUNTIF(N25:INDIRECT(N138),\">=\"&N120)=0,\"\",COUNTIF(N25:INDIRECT(N138),\">=\"&N120))","v":23},{"$f":"IF(COUNTIF(O25:INDIRECT(O138),\">=\"&O120)=0,\"\",COUNTIF(O25:INDIRECT(O138),\">=\"&O120))","v":9}]
["% of Students who scored above the Difficulty Level",null,null,{"$f":"IFERROR(ROUND(D121/D119*100,2),\"\")","v":79.069999999999993},70.11,85.06,79.31,82.56,78.569999999999993,50,55.56,80.36,66.069999999999993,46.94,60]
[null,null,null,{"$f":"IF(D122=\"\",0,IF(D122>=80,3,IF(D122>=70,2,IF(D122>=60,1,0))))","v":2},2,3,2,3,2,0,0,3,1,0,1,"Marks",null,null,null,"T_Marks","S_Marks","Students","Level","Above","Above %","Attainment"]
[null,{"$f":"IF(Data_Sheet!A119<>\"\",\"Total Attainment level for \"&Data_Sheet!A119&\" :\",\"\")","v":"Total Attainment level for CO1 :"},{"$f":"IF(Data_Sheet!A119<>\"\",S124,\"\")","v":1.33},{"$f":"IFERROR((IF(ISNUMBER(SEARCH(\"1\", D$19)),D$21,\"0\")),\"0\")*D123","v":6},6,9,0,0,6,0,0,27,9,0,9,{"$f":"P141","v":54},null,null,{"$f":"IF(P124=0,\"\",ROUND(SUM(D124:O124)/P124,2))","v":1.33},{"$f":"P141","v":54},{"$f":"P148","v":2194.5},{"$f":"P155","v":683},{"$f":"P162","v":32.4},{"$f":"P169","v":469},{"$f":"IFERROR(ROUND(X124/V124*100,2),\"\")","v":68.67},{"$f":"IF(Y124=\"\",\"\",IF(Y124>=80,3,IF(Y124>=70,2,IF(Y124>=60,1,0))))","v":1}]
[null,{"$f":"IF(Data_Sheet!A120<>\"\",\"Total Attainment level for \"&Data_Sheet!A120&\" :\",\"\")","v":"Total Attainment level for CO2 :"},{"$f":"IF(Data_Sheet!A120<>\"\",S125,\"\")","v":2.4},{"$f":"IFERROR((IF(ISNUMBER(SEARCH(\"2\", D$19)),D$21,\"0\")),\"0\")*D123","v":0},0,0,6,6,0,0,0,0,0,0,0,5,null,null,2.4,5,416.5,173,3,140,80.92,3]
[null,{"$f":"IF(Data_Sheet!A121<>\"\",\"Total Attainment level for \"&Data_Sheet!A121&\" :\",\"\")","v":"Total Attainment level for CO3 :"},{"$f":"IF(Data_Sheet!A121<>\"\",S126,\"\")","v":""},{"$f":"IFERROR((IF(ISNUMBER(SEARCH(\"3\", D$19)),D$21,\"0\")),\"0\")*D123","v":0},0,0,0,0,0,0,0,0,0,0,0,0,null,null,"",0,0,0,0,0,"",""]
[null,{"$f":"IF(Data_Sheet!A122<>\"\",\"Total Attainment level for \"&Data_Sheet!A122&\" :\",\"\")","v":"Total Attainment level for CO4 :"},{"$f":"IF(Data_Sheet!A122<>\"\",S127,\"\")","v":""},{"$f":"IFERROR((IF(ISNUMBER(SEARCH(\"4\", D$19)),D$21,\"0\")),\"0\")*D123","v":0},0,0,0,0,0,0,0,0,0,0,0,0,null,null,"",0,0,0,0,0,"",""]
[null,{"$f":"IF(Data_Sheet!A123<>\"\",\"Total Attainment level for \"&Data_Sheet!A123&\" :\",\"\")","v":"Total Attainment level for CO5 :"},{"$f":"IF(Data_Sheet!A123<>\"\",S128,\"\")","v":""},{"$f":"IFERROR((IF(ISNUMBER(SEARCH(\"5\", D$19)),D$21,\"0\")),\"0\")*D123","v":0},0,0,0,0,0,0,0,0,0,0,0,0,null,null,"",0,0,0,0,0,"",""]
[null,{"$f":"IF(Data_Sheet!A124<>\"\",\"Total Attainment level for \"&Data_Sheet!A124&\" :\",\"\")","v":"Total Attainment level for CO6 :"},{"$f":"IF(Data_Sheet!A124<>\"\",S129,\"\")","v":""},{"$f":"IFERROR((IF(ISNUMBER(SEARCH(\"6\", D$19)),D$21,\"0\")),\"0\")*D123","v":0},0,0,0,0,0,0,0,0,0,0,0,0,null,null,"",0,0,0,0,0,"",""]
[]
[{"$f":"Data_Sheet!A127","v":"Attainment Level 1: 60% students scoring more than 60% of the Total Marks"}]
[{"$f":"Data_Sheet!A128","v":"Attainment Level 2: 70% students scoring more than 60% of the Total Marks"}]
[{"$f":"Data_Sheet!A129","v":"Attainment Level 3: 80% students scoring more than 60% of the Total Marks"}]
[]
[null,{"$f":"Data_Sheet!B10","v":"Name of Faculty : "},{"$f":"Data_Sheet!B11","v":"Namitha T N"}]
[null,{"$f":"Data_Sheet!B136","v":"Dated Signature :  "}]
[]
[null,"Last Row Count",{"$f":"ROW(A118)-2","v":116},{"$f":"SUBSTITUTE(ADDRESS(1,COLUMN(D1),2),\"1\",\"\")&$C$138","v":"D$116"},{"$f":"\"E\"&$C$138","v":"E116"},{"$f":"SUBSTITUTE(ADDRESS(1,COLUMN(F1),2),\"1\",\"\")&$C$138","v":"F$116"},"G$116","H$116","I$116","J$116","K$116","L$116","M$116","N$116","O$116"]
[]
[]
[null,null,"CO1",{"$f":"IFERROR((IF(ISNUMBER(SEARCH(\"1\", D$19)),D$21,\"0\")),\"0\")","v":3},3,3,"0","0",3,3,3,9,9,9,9,{"$f":"IFERROR(SUM($D141:INDIRECT($S141)),\"0\")","v":54},null,null,{"$f":"SUBSTITUTE(ADDRESS(1,U141,4),1,\"\")&ROW($P141)","v":"O141"},{"$f":"COUNTIF($D$19:INDIRECT($V141),\"*1*\")","v":10},{"$f":"COLUMN($P$18)-1","v":15},{"$f":"SUBSTITUTE(ADDRESS(1,U141,4),1,\"\")&ROW($P$18)+1","v":"O19"},"Total Marks"]
[null,null,"CO2",{"$f":"IFERROR((IF(ISNUMBER(SEARCH(\"2\", D$19)),D$21,\"0\")),\"0\")","v":"0"},"0","0",3,2,"0","0","0","0","0","0","0",{"$f":"IFERROR(SUM($D142:INDIRECT($S142)),\"0\")","v":5},null,null,"O142",{"$f":"COUNTIF($D$19:INDIRECT($V142),\"*2*\")","v":2},15,{"$f":"SUBSTITUTE(ADDRESS(1,U142,4),1,\"\")&ROW($P$18)+1","v":"O19"}]
[null,null,"CO3",{"$f":"IFERROR((IF(ISNUMBER(SEARCH(\"3\", D$19)),D$21,\"0\")),\"0\")","v":"0"},"0","0","0","0","0","0","0","0","0","0","0",{"$f":"IFERROR(SUM($D143:INDIRECT($S143)),\"0\")","v":0},null,null,"O143",{"$f":"COUNTIF($D$19:INDIRECT($V143),\"*3*\")","v":0},15,"O19"]
[null,null,"CO4",{"$f":"IFERROR((IF(ISNUMBER(SEARCH(\"4\", D$19)),D$21,\"0\")),\"0\")","v":"0"},"0","0","0","0","0","0","0","0","0","0","0",{"$f":"IFERROR(SUM($D144:INDIRECT($S144)),\"0\")","v":0},null,null,"O144",{"$f":"COUNTIF($D$19:INDIRECT($V144),\"*4*\")","v":0},15,"O19"]
[null,null,"CO5",{"$f":"IFERROR((IF(ISNUMBER(SEARCH(\"5\", D$19)),D$21,\"0\")),\"0\")","v":"0"},"0","0","0","0","0","0","0","0","0","0","0",{"$f":"IFERROR(SUM($D145:INDIRECT($S145)),\"0\")","v":0},null,null,"O145",{"$f":"COUNTIF($D$19:INDIRECT($V145),\"*5*\")","v":0},15,"O19"]
[null,null,"CO6",{"$f":"IFERROR((IF(ISNUMBER(SEARCH(\"6\", D$19)),D$21,\"0\")),\"0\")","v":"0"},"0","0","0","0","0","0","0","0","0","0","0",{"$f":"IFERROR(SUM($D146:INDIRECT($S146)),\"0\")","v":0},null,null,"O146",{"$f":"COUNTIF($D$19:INDIRECT($V146),\"*6*\")","v":0},15,"O19"]
[]
[null,null,"CO1",{"$f":"IFERROR((IF(ISNUMBER(SEARCH(\"1\", D$19)),D$118,\"0\")),\"0\")","v":215},212,220.5,"0","0",188.5,102.5,143,397,361.5,265,89.5,{"$f":"IFERROR(SUM($D148:INDIRECT($S148)),\"0\")","v":2194.5},null,null,{"$f":"SUBSTITUTE(ADDRESS(1,U148,4),1,\"\")&ROW($P148)","v":"O148"},{"$f":"COUNTIF($D$19:INDIRECT($V148),\"*1*\")","v":10},{"$f":"COLUMN($P$18)-1","v":15},{"$f":"SUBSTITUTE(ADDRESS(1,U148,4),1,\"\")&ROW($P$18)+1","v":"O19"},"Total Marks Scored"]
[null,null,"CO2",{"$f":"IFERROR((IF(ISNUMBER(SEARCH(\"2\", D$19)),D$118,\"0\")),\"0\")","v":"0"},"0","0",213.5,203,"0","0","0","0","0","0","0",{"$f":"IFERROR(SUM($D149:INDIRECT($S149)),\"0\")","v":416.5},null,null,"O149",{"$f":"COUNTIF($D$19:INDIRECT($V149),\"*2*\")","v":2},15,{"$f":"SUBSTITUTE(ADDRESS(1,U149,4),1,\"\")&ROW($P$18)+1","v":"O19"}]
[null,null,"CO3",{"$f":"IFERROR((IF(ISNUMBER(SEARCH(\"3\", D$19)),D$118,\"0\")),\"0\")","v":"0"},"0","0","0","0","0","0","0","0","0","0","0",{"$f":"IFERROR(SUM($D150:INDIRECT($S150)),\"0\")","v":0},null,null,"O150",{"$f":"COUNTIF($D$19:INDIRECT($V150),\"*3*\")","v":0},15,"O19"]
[null,null,"CO4",{"$f":"IFERROR((IF(ISNUMBER(SEARCH(\"4\", D$19)),D$118,\"0\")),\"0\")","v":"0"},"0","0","0","0","0","0","0","0","0","0","0",{"$f":"IFERROR(SUM($D151:INDIRECT($S151)),\"0\")","v":0},null,null,"O151",{"$f":"COUNTIF($D$19:INDIRECT($V151),\"*4*\")","v":0},15,"O19"]
[null,null,"CO5",{"$f":"IFERROR((IF(ISNUMBER(SEARCH(\"5\", D$19)),D$118,\"0\")),\"0\")","v":"0"},"0","0","0","0","0","0","0","0","0","0","0",{"$f":"IFERROR(SUM($D152:INDIRECT($S152)),\"0\")","v":0},null,null,"O152",{"$f":"COUNTIF($D$19:INDIRECT($V152),\"*5*\")","v":0},15,"O19"]
[null,null,"CO6",{"$f":"IFERROR((IF(ISNUMBER(SEARCH(\"6\", D$19)),D$118,\"0\")),\"0\")","v":"0"},"0","0","0","0","0","0","0","0","0","0","0",{"$f":"IFERROR(SUM($D153:INDIRECT($S153)),\"0\")","v":0},null,null,"O153",{"$f":"COUNTIF($D$19:INDIRECT($V153),\"*6*\")","v":0},15,"O19"]
[]
[null,null,"CO1",{"$f":"IFERROR((IF(ISNUMBER(SEARCH(\"1\", D$19)),D$119,\"0\")),\"0\")","v":86},87,87,"0","0",84,82,81,56,56,49,15,{"$f":"IFERROR(SUM($D155:INDIRECT($S155)),\"0\")","v":683},null,null,{"$f":"SUBSTITUTE(ADDRESS(1,U155,4),1,\"\")&ROW($P155)","v":"O155"},{"$f":"COUNTIF($D$19:INDIRECT($V155),\"*1*\")","v":10},{"$f":"COLUMN($P$18)-1","v":15},{"$f":"SUBSTITUTE(ADDRESS(1,U155,4),1,\"\")&ROW($P$18)+1","v":"O19"},"No of Studdents Attended"]
[null,null,"CO2",{"$f":"IFERROR((IF(ISNUMBER(SEARCH(\"2\", D$19)),D$119,\"0\")),\"0\")","v":"0"},"0","0",87,86,"0","0","0","0","0","0","0",{"$f":"IFERROR(SUM($D156:INDIRECT($S156)),\"0\")","v":173},null,null,"O156",{"$f":"COUNTIF($D$19:INDIRECT($V156),\"*2*\")","v":2},15,{"$f":"SUBSTITUTE(ADDRESS(1,U156,4),1,\"\")&ROW($P$18)+1","v":"O19"}]
[null,null,"CO3",{"$f":"IFERROR((IF(ISNUMBER(SEARCH(\"3\", D$19)),D$119,\"0\")),\"0\")","v":"0"},"0","0","0","0","0","0","0","0","0","0","0",{"$f":"IFERROR(SUM($D157:INDIRECT($S157)),\"0\")","v":0},null,null,"O157",{"$f":"COUNTIF($D$19:INDIRECT($V157),\"*3*\")","v":0},15,"O19"]
[null,null,"CO4",{"$f":"IFERROR((IF(ISNUMBER(SEARCH(\"4\", D$19)),D$119,\"0\")),\"0\")","v":"0"},"0","0","0","0","0","0","0","0","0","0","0",{"$f":"IFERROR(SUM($D158:INDIRECT($S158)),\"0\")","v":0},null,null,"O158",{"$f":"COUNTIF($D$19:INDIRECT($V158),\"*4*\")","v":0},15,"O19"]
[null,null,"CO5",{"$f":"IFERROR((IF(ISNUMBER(SEARCH(\"5\", D$19)),D$119,\"0\")),\"0\")","v":"0"},"0","0","0","0","0","0","0","0","0","0","0",{"$f":"IFERROR(SUM($D159:INDIRECT($S159)),\"0\")","v":0},null,null,"O159",{"$f":"COUNTIF($D$19:INDIRECT($V159),\"*5*\")","v":0},15,"O19"]
[null,null,"CO6",{"$f":"IFERROR((IF(ISNUMBER(SEARCH(\"6\", D$19)),D$119,\"0\")),\"0\")","v":"0"},"0","0","0","0","0","0","0","0","0","0","0",{"$f":"IFERROR(SUM($D160:INDIRECT($S160)),\"0\")","v":0},null,null,"O160",{"$f":"COUNTIF($D$19:INDIRECT($V160),\"*6*\")","v":0},15,"O19"]
[]
[null,null,"CO1",{"$f":"IFERROR((IF(ISNUMBER(SEARCH(\"1\", D$19)),D$120,\"0\")),\"0\")","v":1.8},1.8,1.8,"0","0",1.8,1.8,1.8,5.4,5.4,5.4,5.4,{"$f":"IFERROR(SUM($D162:INDIRECT($S162)),\"0\")","v":32.4},null,null,{"$f":"SUBSTITUTE(ADDRESS(1,U162,4),1,\"\")&ROW($P162)","v":"O162"},{"$f":"COUNTIF($D$19:INDIRECT($V162),\"*1*\")","v":10},{"$f":"COLUMN($P$18)-1","v":15},{"$f":"SUBSTITUTE(ADDRESS(1,U162,4),1,\"\")&ROW($P$18)+1","v":"O19"},"Difficulty Level"]
[null,null,"CO2",{"$f":"IFERROR((IF(ISNUMBER(SEARCH(\"2\", D$19)),D$120,\"0\")),\"0\")","v":"0"},"0","0",1.8,1.2,"0","0","0","0","0","0","0",{"$f":"IFERROR(SUM($D163:INDIRECT($S163)),\"0\")","v":3},null,null,"O163",{"$f":"COUNTIF($D$19:INDIRECT($V163),\"*2*\")","v":2},15,{"$f":"SUBSTITUTE(ADDRESS(1,U163,4),1,\"\")&ROW($P$18)+1","v":"O19"}]
[null,null,"CO3",{"$f":"IFERROR((IF(ISNUMBER(SEARCH(\"3\", D$19)),D$120,\"0\")),\"0\")","v":"0"},"0","0","0","0","0","0","0","0","0","0","0",{"$f":"IFERROR(SUM($D164:INDIRECT($S164)),\"0\")","v":0},null,null,"O164",{"$f":"COUNTIF($D$19:INDIRECT($V164),\"*3*\")","v":0},15,"O19"]
[null,null,"CO4",{"$f":"IFERROR((IF(ISNUMBER(SEARCH(\"4\", D$19)),D$120,\"0\")),\"0\")","v":"0"},"0","0","0","0","0","0","0","0","0","0","0",{"$f":"IFERROR(SUM($D165:INDIRECT($S165)),\"0\")","v":0},null,null,"O165",{"$f":"COUNTIF($D$19:INDIRECT($V165),\"*4*\")","v":0},15,"O19"]
[null,null,"CO5",{"$f":"IFERROR((IF(ISNUMBER(SEARCH(\"5\", D$19)),D$120,\"0\")),\"0\")","v":"0"},"0","0","0","0","0","0","0","0","0","0","0",{"$f":"IFERROR(SUM($D166:INDIRECT($S166)),\"0\")","v":0},null,null,"O166",{"$f":"COUNTIF($D$19:INDIRECT($V166),\"*5*\")","v":0},15,"O19"]
[null,null,"CO6",{"$f":"IFERROR((IF(ISNUMBER(SEARCH(\"6\", D$19)),D$120,\"0\")),\"0\")","v":"0"},"0","0","0","0","0","0","0","0","0","0","0",{"$f":"IFERROR(SUM($D167:INDIRECT($S167)),\"0\")","v":0},null,null,"O167",{"$f":"COUNTIF($D$19:INDIRECT($V167),\"*6*\")","v":0},15,"O19"]
[]
[null,null,"CO1",{"$f":"IFERROR((IF(ISNUMBER(SEARCH(\"1\", D$19)),D$121,\"0\")),\"0\")","v":68},61,74,"0","0",66,41,45,45,37,23,9,{"$f":"IFERROR(SUM($D169:INDIRECT($S169)),\"0\")","v":469},null,null,{"$f":"SUBSTITUTE(ADDRESS(1,U169,4),1,\"\")&ROW($P169)","v":"O169"},{"$f":"COUNTIF($D$19:INDIRECT($V169),\"*1*\")","v":10},{"$f":"COLUMN($P$18)-1","v":15},{"$f":"SUBSTITUTE(ADDRESS(1,U169,4),1,\"\")&ROW($P$18)+1","v":"O19"},"No of Studdents Above Difficulty Level"]
[null,null,"CO2",{"$f":"IFERROR((IF(ISNUMBER(SEARCH(\"2\", D$19)),D$121,\"0\")),\"0\")","v":"0"},"0","0",69,71,"0","0","0","0","0","0","0",{"$f":"IFERROR(SUM($D170:INDIRECT($S170)),\"0\")","v":140},null,null,"O170",{"$f":"COUNTIF($D$19:INDIRECT($V170),\"*2*\")","v":2},15,{"$f":"SUBSTITUTE(ADDRESS(1,U170,4),1,\"\")&ROW($P$18)+1","v":"O19"}]
[null,null,"CO3",{"$f":"IFERROR((IF(ISNUMBER(SEARCH(\"3\", D$19)),D$121,\"0\")),\"0\")","v":"0"},"0","0","0","0","0","0","0","0","0","0","0",{"$f":"IFERROR(SUM($D171:INDIRECT($S171)),\"0\")","v":0},null,null,"O171",{"$f":"COUNTIF($D$19:INDIRECT($V171),\"*3*\")","v":0},15,"O19"]
[null,null,"CO4",{"$f":"IFERROR((IF(ISNUMBER(SEARCH(\"4\", D$19)),D$121,\"0\")),\"0\")","v":"0"},"0","0","0","0","0","0","0","0","0","0","0",{"$f":"IFERROR(SUM($D172:INDIRECT($S172)),\"0\")","v":0},null,null,"O172",{"$f":"COUNTIF($D$19:INDIRECT($V172),\"*4*\")","v":0},15,"O19"]
[null,null,"CO5",{"$f":"IFERROR((IF(ISNUMBER(SEARCH(\"5\", D$19)),D$121,\"0\")),\"0\")","v":"0"},"0","0","0","0","0","0","0","0","0","0","0",{"$f":"IFERROR(SUM($D173:INDIRECT($S173)),\"0\")","v":0},null,null,"O173",{"$f":"COUNTIF($D$19:INDIRECT($V173),\"*5*\")","v":0},15,"O19"]
[null,null,"CO6",{"$f":"IFERROR((IF(ISNUMBER(SEARCH(\"6\", D$19)),D$121,\"0\")),\"0\")","v":"0"},"0","0","0","0","0","0","0","0","0","0","0",{"$f":"IFERROR(SUM($D174:INDIRECT($S174)),\"0\")","v":0},null,null,"O174",{"$f":"COUNTIF($D$19:INDIRECT($V174),\"*6*\")","v":0},15,"O19"]
[]
[null,null,1,{"$f":"IFERROR((IF(ISNUMBER(SEARCH(\"1\", D$20)),D$21/IF(LEN(D20)=16,6,IF(LEN(D20)=13,5,IF(LEN(D20)=10,4,IF(LEN(D20)=7,3,IF(LEN(D20)=4,2,1))))),\"0\")),\"0\")","v":3},3,3,"0",2,3,3,3,9,9,9,9,{"$f":"IFERROR(SUM($D176:INDIRECT($S176)),\"0\")","v":56},null,null,{"$f":"SUBSTITUTE(ADDRESS(1,U176,4),1,\"\")&ROW($P176)","v":"O176"},{"$f":"COUNTIF($D$20:INDIRECT($V176),\"1\")","v":11},{"$f":"COLUMN($P$18)-1","v":15},{"$f":"SUBSTITUTE(ADDRESS(1,U176,4),1,\"\")&ROW($P$19)+1","v":"O20"}]
[null,null,2,{"$f":"IFERROR((IF(ISNUMBER(SEARCH(\"2\", D$20)),D$21/IF(LEN(D20)=16,6,IF(LEN(D20)=13,5,IF(LEN(D20)=10,4,IF(LEN(D20)=7,3,IF(LEN(D20)=4,2,1))))),\"0\")),\"0\")","v":"0"},"0","0",3,"0","0","0","0","0","0","0","0",{"$f":"IFERROR(SUM($D177:INDIRECT($S177)),\"0\")","v":3},null,null,{"$f":"SUBSTITUTE(ADDRESS(1,U177,4),1,\"\")&ROW($P177)","v":"O177"},{"$f":"COUNTIF($D$20:INDIRECT($V177),\"2\")","v":1},15,"O20"]
[null,null,3,{"$f":"IFERROR((IF(ISNUMBER(SEARCH(\"3\", D$20)),D$21/IF(LEN(D20)=16,6,IF(LEN(D20)=13,5,IF(LEN(D20)=10,4,IF(LEN(D20)=7,3,IF(LEN(D20)=4,2,1))))),\"0\")),\"0\")","v":"0"},"0","0","0","0","0","0","0","0","0","0","0",{"$f":"IFERROR(SUM($D178:INDIRECT($S178)),\"0\")","v":0},null,null,"O178",{"$f":"COUNTIF($D$20:INDIRECT($V178),\"3\")","v":0},15,"O20"]
[null,null,4,{"$f":"IFERROR((IF(ISNUMBER(SEARCH(\"4\", D$20)),D$21/IF(LEN(D20)=16,6,IF(LEN(D20)=13,5,IF(LEN(D20)=10,4,IF(LEN(D20)=7,3,IF(LEN(D20)=4,2,1))))),\"0\")),\"0\")","v":"0"},"0","0","0","0","0","0","0","0","0","0","0",{"$f":"IFERROR(SUM($D179:INDIRECT($S179)),\"0\")","v":0},null,null,"O179",{"$f":"COUNTIF($D$20:INDIRECT($V179),\"4\")","v":0},15,"O20"]
[null,null,5,{"$f":"IFERROR((IF(ISNUMBER(SEARCH(\"5\", D$20)),D$21/IF(LEN(D20)=16,6,IF(LEN(D20)=13,5,IF(LEN(D20)=10,4,IF(LEN(D20)=7,3,IF(LEN(D20)=4,2,1))))),\"0\")),\"0\")","v":"0"},"0","0","0","0","0","0","0","0","0","0","0",{"$f":"IFERROR(SUM($D180:INDIRECT($S180)),\"0\")","v":0},null,null,"O180",{"$f":"COUNTIF($D$20:INDIRECT($V180),\"5\")","v":0},15,"O20"]
[null,null,6,{"$f":"IFERROR((IF(ISNUMBER(SEARCH(\"6\", D$20)),D$21/IF(LEN(D20)=16,6,IF(LEN(D20)=13,5,IF(LEN(D20)=10,4,IF(LEN(D20)=7,3,IF(LEN(D20)=4,2,1))))),\"0\")),\"0\")","v":"0"},"0","0","0","0","0","0","0","0","0","0","0",{"$f":"IFERROR(SUM($D181:INDIRECT($S181)),\"0\")","v":0},null,null,"O181",{"$f":"COUNTIF($D$20:INDIRECT($V181),\"6\")","v":0},15,"O20"]

{"sheet":"T1_Analysis","index":3,"n_rows":131,"n_cols":5,"rows_kept":131,"cut":false,"hidden":false,"merged":[[2,0,2,3],[4,0,4,3],[6,0,6,3],[8,0,8,3]]}
[]
[]
[{"$f":"Data_Sheet!A2","v":"Jyothi Engineering College, Cheruthuruthy"}]
[]
[{"$f":"'T1'!A9","v":"Department of Computer Science Engineering"}]
[]
[{"$f":"'T1'!A11","v":"CO Analysis - Internal Marks : First Internal Exam                       12-02-18"}]
[]
[{"$f":"Data_Sheet!A17","v":"S3 CS              CS203 Switching Theory and Logic Design               2019-20"}]
[]
[]
[]
[]
[]
[]
[]
[]
[]
[]
[]
[]
[{"$f":"'T1'!A18","v":"Register No."},{"$f":"'T1'!B18","v":"Name of Student"},{"$f":"'T1'!P18","v":"Total Marks (50)"},"Category"]
[]
["Column1","Column2","Column3","Column4"]
[{"$f":"Data_Sheet!A25","v":"JEC18CS001"},{"$f":"Data_Sheet!B25","v":"ABHISHEK KRISHNAN MENON E"},{"$f":"'T1'!P25","v":20},{"$f":"IF(C25=\"A\",\"ABSENT\",IF(C25>='T1'!$F$5*$E$124/100,\"EXCELLENT\",IF(C25>='T1'!$F$5*$E$123/100,\"GOOD\",IF(C25>='T1'!$F$5*$E$122/100,\"AVERAGE\",\"POOR\"))))","v":"POOR"}]
[{"$f":"Data_Sheet!A26","v":"JEC18CS002"},{"$f":"Data_Sheet!B26","v":"ABHISHEK SAJEEVAN"},{"$f":"'T1'!P26","v":10},{"$f":"IF(C26=\"A\",\"ABSENT\",IF(C26>='T1'!$F$5*$E$124/100,\"EXCELLENT\",IF(C26>='T1'!$F$5*$E$123/100,\"GOOD\",IF(C26>='T1'!$F$5*$E$122/100,\"AVERAGE\",\"POOR\"))))","v":"POOR"}]
[{"$f":"Data_Sheet!A27","v":"JEC18CS003"},{"$f":"Data_Sheet!B27","v":"ABHITH SHAJI"},{"$f":"'T1'!P27","v":21},{"$f":"IF(C27=\"A\",\"ABSENT\",IF(C27>='T1'!$F$5*$E$124/100,\"EXCELLENT\",IF(C27>='T1'!$F$5*$E$123/100,\"GOOD\",IF(C27>='T1'!$F$5*$E$122/100,\"AVERAGE\",\"POOR\"))))","v":"POOR"}]
[{"$f":"Data_Sheet!A28","v":"JEC18CS004"},{"$f":"Data_Sheet!B28","v":"ABIN SANTHOSH ALAPATT"},{"$f":"'T1'!P28","v":28},{"$f":"IF(C28=\"A\",\"ABSENT\",IF(C28>='T1'!$F$5*$E$124/100,\"EXCELLENT\",IF(C28>='T1'!$F$5*$E$123/100,\"GOOD\",IF(C28>='T1'!$F$5*$E$122/100,\"AVERAGE\",\"POOR\"))))","v":"AVERAGE"}]
[{"$f":"Data_Sheet!A29","v":"JEC18CS005"},{"$f":"Data_Sheet!B29","v":"ADARSH KUMAR M A"},{"$f":"'T1'!P29","v":34},{"$f":"IF(C29=\"A\",\"ABSENT\",IF(C29>='T1'!$F$5*$E$124/100,\"EXCELLENT\",IF(C29>='T1'!$F$5*$E$123/100,\"GOOD\",IF(C29>='T1'!$F$5*$E$122/100,\"AVERAGE\",\"POOR\"))))","v":"GOOD"}]
[{"$f":"Data_Sheet!A30","v":"JEC18CS006"},{"$f":"Data_Sheet!B30","v":"ADHITHYA KRISHNA S"},{"$f":"'T1'!P30","v":25},{"$f":"IF(C30=\"A\",\"ABSENT\",IF(C30>='T1'!$F$5*$E$124/100,\"EXCELLENT\",IF(C30>='T1'!$F$5*$E$123/100,\"GOOD\",IF(C30>='T1'!$F$5*$E$122/100,\"AVERAGE\",\"POOR\"))))","v":"AVERAGE"}]
[{"$f":"Data_Sheet!A31","v":"JEC18CS007"},{"$f":"Data_Sheet!B31","v":"ADITHYA HARIDAS"},{"$f":"'T1'!P31","v":40},{"$f":"IF(C31=\"A\",\"ABSENT\",IF(C31>='T1'!$F$5*$E$124/100,\"EXCELLENT\",IF(C31>='T1'!$F$5*$E$123/100,\"GOOD\",IF(C31>='T1'!$F$5*$E$122/100,\"AVERAGE\",\"POOR\"))))","v":"EXCELLENT"}]
[{"$f":"Data_Sheet!A32","v":"JEC18CS008"},{"$f":"Data_Sheet!B32","v":"AJMAL BASHEER"},{"$f":"'T1'!P32","v":17},{"$f":"IF(C32=\"A\",\"ABSENT\",IF(C32>='T1'!$F$5*$E$124/100,\"EXCELLENT\",IF(C32>='T1'!$F$5*$E$123/100,\"GOOD\",IF(C32>='T1'!$F$5*$E$122/100,\"AVERAGE\",\"POOR\"))))","v":"POOR"}]
[{"$f":"Data_Sheet!A33","v":"JEC18CS009"},{"$f":"Data_Sheet!B33","v":"AKASH.V"},{"$f":"'T1'!P33","v":19},{"$f":"IF(C33=\"A\",\"ABSENT\",IF(C33>='T1'!$F$5*$E$124/100,\"EXCELLENT\",IF(C33>='T1'!$F$5*$E$123/100,\"GOOD\",IF(C33>='T1'!$F$5*$E$122/100,\"AVERAGE\",\"POOR\"))))","v":"POOR"}]
[{"$f":"Data_Sheet!A34","v":"JEC18CS010"},{"$f":"Data_Sheet!B34","v":"AKHIL AZEEZ UPPILAMKUNNATH"},{"$f":"'T1'!P34","v":24},{"$f":"IF(C34=\"A\",\"ABSENT\",IF(C34>='T1'!$F$5*$E$124/100,\"EXCELLENT\",IF(C34>='T1'!$F$5*$E$123/100,\"GOOD\",IF(C34>='T1'!$F$5*$E$122/100,\"AVERAGE\",\"POOR\"))))","v":"AVERAGE"}]
[{"$f":"Data_Sheet!A35","v":"JEC18CS011"},{"$f":"Data_Sheet!B35","v":"AKHIL KRISHNA UK"},{"$f":"'T1'!P35","v":35},{"$f":"IF(C35=\"A\",\"ABSENT\",IF(C35>='T1'!$F$5*$E$124/100,\"EXCELLENT\",IF(C35>='T1'!$F$5*$E$123/100,\"GOOD\",IF(C35>='T1'!$F$5*$E$122/100,\"AVERAGE\",\"POOR\"))))","v":"GOOD"}]
[{"$f":"Data_Sheet!A36","v":"JEC18CS012"},{"$f":"Data_Sheet!B36","v":"ALAN GEORGE"},{"$f":"'T1'!P36","v":32},{"$f":"IF(C36=\"A\",\"ABSENT\",IF(C36>='T1'!$F$5*$E$124/100,\"EXCELLENT\",IF(C36>='T1'!$F$5*$E$123/100,\"GOOD\",IF(C36>='T1'!$F$5*$E$122/100,\"AVERAGE\",\"POOR\"))))","v":"GOOD"}]
[{"$f":"Data_Sheet!A37","v":"JEC18CS013"},{"$f":"Data_Sheet!B37","v":"ALEN VARGHESE"},{"$f":"'T1'!P37","v":28},{"$f":"IF(C37=\"A\",\"ABSENT\",IF(C37>='T1'!$F$5*$E$124/100,\"EXCELLENT\",IF(C37>='T1'!$F$5*$E$123/100,\"GOOD\",IF(C37>='T1'!$F$5*$E$122/100,\"AVERAGE\",\"POOR\"))))","v":"AVERAGE"}]
[{"$f":"Data_Sheet!A38","v":"JEC18CS014"},{"$f":"Data_Sheet!B38","v":"AMAL SEBASTIAN"},{"$f":"'T1'!P38","v":48},{"$f":"IF(C38=\"A\",\"ABSENT\",IF(C38>='T1'!$F$5*$E$124/100,\"EXCELLENT\",IF(C38>='T1'!$F$5*$E$123/100,\"GOOD\",IF(C38>='T1'!$F$5*$E$122/100,\"AVERAGE\",\"POOR\"))))","v":"EXCELLENT"}]
[{"$f":"Data_Sheet!A39","v":"JEC18CS015"},{"$f":"Data_Sheet!B39","v":"AMAL SONY"},{"$f":"'T1'!P39","v":18},{"$f":"IF(C39=\"A\",\"ABSENT\",IF(C39>='T1'!$F$5*$E$124/100,\"EXCELLENT\",IF(C39>='T1'!$F$5*$E$123/100,\"GOOD\",IF(C39>='T1'!$F$5*$E$122/100,\"AVERAGE\",\"POOR\"))))","v":"POOR"}]
[{"$f":"Data_Sheet!A40","v":"JEC18CS016"},{"$f":"Data_Sheet!B40","v":"ANAGHA WILSON"},{"$f":"'T1'!P40","v":10},{"$f":"IF(C40=\"A\",\"ABSENT\",IF(C40>='T1'!$F$5*$E$124/100,\"EXCELLENT\",IF(C40>='T1'!$F$5*$E$123/100,\"GOOD\",IF(C40>='T1'!$F$5*$E$122/100,\"AVERAGE\",\"POOR\"))))","v":"POOR"}]
[{"$f":"Data_Sheet!A41","v":"JEC18CS017"},{"$f":"Data_Sheet!B41","v":"ANETTE ANTO"},{"$f":"'T1'!P41","v":7},{"$f":"IF(C41=\"A\",\"ABSENT\",IF(C41>='T1'!$F$5*$E$124/100,\"EXCELLENT\",IF(C41>='T1'!$F$5*$E$123/100,\"GOOD\",IF(C41>='T1'!$F$5*$E$122/100,\"AVERAGE\",\"POOR\"))))","v":"POOR"}]
[{"$f":"Data_Sheet!A42","v":"JEC18CS018"},{"$f":"Data_Sheet!B42","v":"ANIT MARY THOMAS"},{"$f":"'T1'!P42","v":35},{"$f":"IF(C42=\"A\",\"ABSENT\",IF(C42>='T1'!$F$5*$E$124/100,\"EXCELLENT\",IF(C42>='T1'!$F$5*$E$123/100,\"GOOD\",IF(C42>='T1'!$F$5*$E$122/100,\"AVERAGE\",\"POOR\"))))","v":"GOOD"}]
[{"$f":"Data_Sheet!A43","v":"JEC18CS020"},{"$f":"Data_Sheet!B43","v":"ANN THERESA SHAJI"},{"$f":"'T1'!P43","v":"A"},{"$f":"IF(C43=\"A\",\"ABSENT\",IF(C43>='T1'!$F$5*$E$124/100,\"EXCELLENT\",IF(C43>='T1'!$F$5*$E$123/100,\"GOOD\",IF(C43>='T1'!$F$5*$E$122/100,\"AVERAGE\",\"POOR\"))))","v":"ABSENT"}]
[{"$f":"Data_Sheet!A44","v":"JEC18CS021"},{"$f":"Data_Sheet!B44","v":"ANTONY ROY"},{"$f":"'T1'!P44","v":12},{"$f":"IF(C44=\"A\",\"ABSENT\",IF(C44>='T1'!$F$5*$E$124/100,\"EXCELLENT\",IF(C44>='T1'!$F$5*$E$123/100,\"GOOD\",IF(C44>='T1'!$F$5*$E$122/100,\"AVERAGE\",\"POOR\"))))","v":"POOR"}]
[{"$f":"Data_Sheet!A45","v":"JEC18CS022"},{"$f":"Data_Sheet!B45","v":"ANUGRAHA C"},{"$f":"'T1'!P45","v":29},{"$f":"IF(C45=\"A\",\"ABSENT\",IF(C45>='T1'!$F$5*$E$124/100,\"EXCELLENT\",IF(C45>='T1'!$F$5*$E$123/100,\"GOOD\",IF(C45>='T1'!$F$5*$E$122/100,\"AVERAGE\",\"POOR\"))))","v":"AVERAGE"}]
[{"$f":"Data_Sheet!A46","v":"JEC18CS023"},{"$f":"Data_Sheet!B46","v":"APARNA.V"},{"$f":"'T1'!P46","v":33},{"$f":"IF(C46=\"A\",\"ABSENT\",IF(C46>='T1'!$F$5*$E$124/100,\"EXCELLENT\",IF(C46>='T1'!$F$5*$E$123/100,\"GOOD\",IF(C46>='T1'!$F$5*$E$122/100,\"AVERAGE\",\"POOR\"))))","v":"GOOD"}]
[{"$f":"Data_Sheet!A47","v":"JEC18CS024"},{"$f":"Data_Sheet!B47","v":"ARAVIND S KUMAR"},{"$f":"'T1'!P47","v":19},{"$f":"IF(C47=\"A\",\"ABSENT\",IF(C47>='T1'!$F$5*$E$124/100,\"EXCELLENT\",IF(C47>='T1'!$F$5*$E$123/100,\"GOOD\",IF(C47>='T1'!$F$5*$E$122/100,\"AVERAGE\",\"POOR\"))))","v":"POOR"}]
[{"$f":"Data_Sheet!A48","v":"JEC18CS025"},{"$f":"Data_Sheet!B48","v":"ARJUN VINOD"},{"$f":"'T1'!P48","v":28},{"$f":"IF(C48=\"A\",\"ABSENT\",IF(C48>='T1'!$F$5*$E$124/100,\"EXCELLENT\",IF(C48>='T1'!$F$5*$E$123/100,\"GOOD\",IF(C48>='T1'!$F$5*$E$122/100,\"AVERAGE\",\"POOR\"))))","v":"AVERAGE"}]
[{"$f":"Data_Sheet!A49","v":"JEC18CS026"},{"$f":"Data_Sheet!B49","v":"ARUN VG"},{"$f":"'T1'!P49","v":18},{"$f":"IF(C49=\"A\",\"ABSENT\",IF(C49>='T1'!$F$5*$E$124/100,\"EXCELLENT\",IF(C49>='T1'!$F$5*$E$123/100,\"GOOD\",IF(C49>='T1'!$F$5*$E$122/100,\"AVERAGE\",\"POOR\"))))","v":"POOR"}]
[{"$f":"Data_Sheet!A50","v":"JEC18CS027"},{"$f":"Data_Sheet!B50","v":"ASHRUL K"},{"$f":"'T1'!P50","v":34},{"$f":"IF(C50=\"A\",\"ABSENT\",IF(C50>='T1'!$F$5*$E$124/100,\"EXCELLENT\",IF(C50>='T1'!$F$5*$E$123/100,\"GOOD\",IF(C50>='T1'!$F$5*$E$122/100,\"AVERAGE\",\"POOR\"))))","v":"GOOD"}]
[{"$f":"Data_Sheet!A51","v":"JEC18CS028"},{"$f":"Data_Sheet!B51","v":"ATHIL PAULY"},{"$f":"'T1'!P51","v":20},{"$f":"IF(C51=\"A\",\"ABSENT\",IF(C51>='T1'!$F$5*$E$124/100,\"EXCELLENT\",IF(C51>='T1'!$F$5*$E$123/100,\"GOOD\",IF(C51>='T1'!$F$5*$E$122/100,\"AVERAGE\",\"POOR\"))))","v":"POOR"}]
[{"$f":"Data_Sheet!A52","v":"JEC18CS029"},{"$f":"Data_Sheet!B52","v":"ATHIRA K P"},{"$f":"'T1'!P52","v":44},{"$f":"IF(C52=\"A\",\"ABSENT\",IF(C52>='T1'!$F$5*$E$124/100,\"EXCELLENT\",IF(C52>='T1'!$F$5*$E$123/100,\"GOOD\",IF(C52>='T1'!$F$5*$E$122/100,\"AVERAGE\",\"POOR\"))))","v":"EXCELLENT"}]
[{"$f":"Data_Sheet!A53","v":"JEC18CS030"},{"$f":"Data_Sheet!B53","v":"AWIN ANTO"},{"$f":"'T1'!P53","v":27},{"$f":"IF(C53=\"A\",\"ABSENT\",IF(C53>='T1'!$F$5*$E$124/100,\"EXCELLENT\",IF(C53>='T1'!$F$5*$E$123/100,\"GOOD\",IF(C53>='T1'!$F$5*$E$122/100,\"AVERAGE\",\"POOR\"))))","v":"AVERAGE"}]
[{"$f":"Data_Sheet!A54","v":"JEC18CS031"},{"$f":"Data_Sheet!B54","v":"CHARLES JOHNSON"},{"$f":"'T1'!P54","v":24},{"$f":"IF(C54=\"A\",\"ABSENT\",IF(C54>='T1'!$F$5*$E$124/100,\"EXCELLENT\",IF(C54>='T1'!$F$5*$E$123/100,\"GOOD\",IF(C54>='T1'!$F$5*$E$122/100,\"AVERAGE\",\"POOR\"))))","v":"AVERAGE"}]
[{"$f":"Data_Sheet!A55","v":"JEC18CS032"},{"$f":"Data_Sheet!B55","v":"CHITTILAPPILLY JOVIA JOHNSON"},{"$f":"'T1'!P55","v":46},{"$f":"IF(C55=\"A\",\"ABSENT\",IF(C55>='T1'!$F$5*$E$124/100,\"EXCELLENT\",IF(C55>='T1'!$F$5*$E$123/100,\"GOOD\",IF(C55>='T1'!$F$5*$E$122/100,\"AVERAGE\",\"POOR\"))))","v":"EXCELLENT"}]
[{"$f":"Data_Sheet!A56","v":"JEC18CS033"},{"$f":"Data_Sheet!B56","v":"CIYA BABU"},{"$f":"'T1'!P56","v":15},{"$f":"IF(C56=\"A\",\"ABSENT\",IF(C56>='T1'!$F$5*$E$124/100,\"EXCELLENT\",IF(C56>='T1'!$F$5*$E$123/100,\"GOOD\",IF(C56>='T1'!$F$5*$E$122/100,\"AVERAGE\",\"POOR\"))))","v":"POOR"}]
[{"$f":"Data_Sheet!A57","v":"JEC18CS034"},{"$f":"Data_Sheet!B57","v":"DAVID SALUS"},{"$f":"'T1'!P57","v":35},{"$f":"IF(C57=\"A\",\"ABSENT\",IF(C57>='T1'!$F$5*$E$124/100,\"EXCELLENT\",IF(C57>='T1'!$F$5*$E$123/100,\"GOOD\",IF(C57>='T1'!$F$5*$E$122/100,\"AVERAGE\",\"POOR\"))))","v":"GOOD"}]
[{"$f":"Data_Sheet!A58","v":"JEC18CS035"},{"$f":"Data_Sheet!B58","v":"DELICIA REJI"},{"$f":"'T1'!P58","v":34},{"$f":"IF(C58=\"A\",\"ABSENT\",IF(C58>='T1'!$F$5*$E$124/100,\"EXCELLENT\",IF(C58>='T1'!$F$5*$E$123/100,\"GOOD\",IF(C58>='T1'!$F$5*$E$122/100,\"AVERAGE\",\"POOR\"))))","v":"GOOD"}]
[{"$f":"Data_Sheet!A59","v":"JEC18CS036"},{"$f":"Data_Sheet!B59","v":"DELMA SHAJAN"},{"$f":"'T1'!P59","v":35},{"$f":"IF(C59=\"A\",\"ABSENT\",IF(C59>='T1'!$F$5*$E$124/100,\"EXCELLENT\",IF(C59>='T1'!$F$5*$E$123/100,\"GOOD\",IF(C59>='T1'!$F$5*$E$122/100,\"AVERAGE\",\"POOR\"))))","v":"GOOD"}]
[{"$f":"Data_Sheet!A60","v":"JEC18CS037"},{"$f":"Data_Sheet!B60","v":"DILBER SHA AP"},{"$f":"'T1'!P60","v":23},{"$f":"IF(C60=\"A\",\"ABSENT\",IF(C60>='T1'!$F$5*$E$124/100,\"EXCELLENT\",IF(C60>='T1'!$F$5*$E$123/100,\"GOOD\",IF(C60>='T1'!$F$5*$E$122/100,\"AVERAGE\",\"POOR\"))))","v":"AVERAGE"}]
[{"$f":"Data_Sheet!A61","v":"JEC18CS038"},{"$f":"Data_Sheet!B61","v":"EDWIN T JOY"},{"$f":"'T1'!P61","v":43},{"$f":"IF(C61=\"A\",\"ABSENT\",IF(C61>='T1'!$F$5*$E$124/100,\"EXCELLENT\",IF(C61>='T1'!$F$5*$E$123/100,\"GOOD\",IF(C61>='T1'!$F$5*$E$122/100,\"AVERAGE\",\"POOR\"))))","v":"EXCELLENT"}]
[{"$f":"Data_Sheet!A62","v":"JEC18CS039"},{"$f":"Data_Sheet!B62","v":"EDWIN WILSON"},{"$f":"'T1'!P62","v":19},{"$f":"IF(C62=\"A\",\"ABSENT\",IF(C62>='T1'!$F$5*$E$124/100,\"EXCELLENT\",IF(C62>='T1'!$F$5*$E$123/100,\"GOOD\",IF(C62>='T1'!$F$5*$E$122/100,\"AVERAGE\",\"POOR\"))))","v":"POOR"}]
[{"$f":"Data_Sheet!A63","v":"JEC18CS040"},{"$f":"Data_Sheet!B63","v":"EMMANUEL SHIBU"},{"$f":"'T1'!P63","v":36},{"$f":"IF(C63=\"A\",\"ABSENT\",IF(C63>='T1'!$F$5*$E$124/100,\"EXCELLENT\",IF(C63>='T1'!$F$5*$E$123/100,\"GOOD\",IF(C63>='T1'!$F$5*$E$122/100,\"AVERAGE\",\"POOR\"))))","v":"GOOD"}]
[{"$f":"Data_Sheet!A64","v":"JEC18CS041"},{"$f":"Data_Sheet!B64","v":"GAYATHRI DINESH"},{"$f":"'T1'!P64","v":21},{"$f":"IF(C64=\"A\",\"ABSENT\",IF(C64>='T1'!$F$5*$E$124/100,\"EXCELLENT\",IF(C64>='T1'!$F$5*$E$123/100,\"GOOD\",IF(C64>='T1'!$F$5*$E$122/100,\"AVERAGE\",\"POOR\"))))","v":"POOR"}]
[{"$f":"Data_Sheet!A65","v":"JEC18CS042"},{"$f":"Data_Sheet!B65","v":"GOKUL DAS M"},{"$f":"'T1'!P65","v":23},{"$f":"IF(C65=\"A\",\"ABSENT\",IF(C65>='T1'!$F$5*$E$124/100,\"EXCELLENT\",IF(C65>='T1'!$F$5*$E$123/100,\"GOOD\",IF(C65>='T1'!$F$5*$E$122/100,\"AVERAGE\",\"POOR\"))))","v":"AVERAGE"}]
[{"$f":"Data_Sheet!A66","v":"JEC18CS043"},{"$f":"Data_Sheet!B66","v":"G RAMGOPAL"},{"$f":"'T1'!P66","v":49},{"$f":"IF(C66=\"A\",\"ABSENT\",IF(C66>='T1'!$F$5*$E$124/100,\"EXCELLENT\",IF(C66>='T1'!$F$5*$E$123/100,\"GOOD\",IF(C66>='T1'!$F$5*$E$122/100,\"AVERAGE\",\"POOR\"))))","v":"EXCELLENT"}]
[{"$f":"Data_Sheet!A67","v":"JEC18CS044"},{"$f":"Data_Sheet!B67","v":"HARIES DAVIS"},{"$f":"'T1'!P67","v":35},{"$f":"IF(C67=\"A\",\"ABSENT\",IF(C67>='T1'!$F$5*$E$124/100,\"EXCELLENT\",IF(C67>='T1'!$F$5*$E$123/100,\"GOOD\",IF(C67>='T1'!$F$5*$E$122/100,\"AVERAGE\",\"POOR\"))))","v":"GOOD"}]
[{"$f":"Data_Sheet!A68","v":"JEC18CS045"},{"$f":"Data_Sheet!B68","v":"HARISANKER P"},{"$f":"'T1'!P68","v":29},{"$f":"IF(C68=\"A\",\"ABSENT\",IF(C68>='T1'!$F$5*$E$124/100,\"EXCELLENT\",IF(C68>='T1'!$F$5*$E$123/100,\"GOOD\",IF(C68>='T1'!$F$5*$E$122/100,\"AVERAGE\",\"POOR\"))))","v":"AVERAGE"}]
[{"$f":"Data_Sheet!A69","v":"JEC18CS046"},{"$f":"Data_Sheet!B69","v":"HARSHA.K.S."},{"$f":"'T1'!P69","v":41},{"$f":"IF(C69=\"A\",\"ABSENT\",IF(C69>='T1'!$F$5*$E$124/100,\"EXCELLENT\",IF(C69>='T1'!$F$5*$E$123/100,\"GOOD\",IF(C69>='T1'!$F$5*$E$122/100,\"AVERAGE\",\"POOR\"))))","v":"EXCELLENT"}]
[{"$f":"Data_Sheet!A70","v":"JEC18CS047"},{"$f":"Data_Sheet!B70","v":"HELNA THOMAS"},{"$f":"'T1'!P70","v":44},{"$f":"IF(C70=\"A\",\"ABSENT\",IF(C70>='T1'!$F$5*$E$124/100,\"EXCELLENT\",IF(C70>='T1'!$F$5*$E$123/100,\"GOOD\",IF(C70>='T1'!$F$5*$E$122/100,\"AVERAGE\",\"POOR\"))))","v":"EXCELLENT"}]
[{"$f":"Data_Sheet!A71","v":"JEC18CS048"},{"$f":"Data_Sheet!B71","v":"HRIDI KRISHNA.H"},{"$f":"'T1'!P71","v":32},{"$f":"IF(C71=\"A\",\"ABSENT\",IF(C71>='T1'!$F$5*$E$124/100,\"EXCELLENT\",IF(C71>='T1'!$F$5*$E$123/100,\"GOOD\",IF(C71>='T1'!$F$5*$E$122/100,\"AVERAGE\",\"POOR\"))))","v":"GOOD"}]
[{"$f":"Data_Sheet!A72","v":"JEC18CS049"},{"$f":"Data_Sheet!B72","v":"INDRAJIT R"},{"$f":"'T1'!P72","v":23},{"$f":"IF(C72=\"A\",\"ABSENT\",IF(C72>='T1'!$F$5*$E$124/100,\"EXCELLENT\",IF(C72>='T1'!$F$5*$E$123/100,\"GOOD\",IF(C72>='T1'!$F$5*$E$122/100,\"AVERAGE\",\"POOR\"))))","v":"AVERAGE"}]
[{"$f":"Data_Sheet!A73","v":"JEC18CS050"},{"$f":"Data_Sheet!B73","v":"JESWIN JOJY"},{"$f":"'T1'!P73","v":48},{"$f":"IF(C73=\"A\",\"ABSENT\",IF(C73>='T1'!$F$5*$E$124/100,\"EXCELLENT\",IF(C73>='T1'!$F$5*$E$123/100,\"GOOD\",IF(C73>='T1'!$F$5*$E$122/100,\"AVERAGE\",\"POOR\"))))","v":"EXCELLENT"}]
[{"$f":"Data_Sheet!A74","v":"JEC18CS051"},{"$f":"Data_Sheet!B74","v":"JIBIN A BABU"},{"$f":"'T1'!P74","v":27},{"$f":"IF(C74=\"A\",\"ABSENT\",IF(C74>='T1'!$F$5*$E$124/100,\"EXCELLENT\",IF(C74>='T1'!$F$5*$E$123/100,\"GOOD\",IF(C74>='T1'!$F$5*$E$122/100,\"AVERAGE\",\"POOR\"))))","v":"AVERAGE"}]
[{"$f":"Data_Sheet!A75","v":"JEC18CS052"},{"$f":"Data_Sheet!B75","v":"JISSY JOY"},{"$f":"'T1'!P75","v":44},{"$f":"IF(C75=\"A\",\"ABSENT\",IF(C75>='T1'!$F$5*$E$124/100,\"EXCELLENT\",IF(C75>='T1'!$F$5*$E$123/100,\"GOOD\",IF(C75>='T1'!$F$5*$E$122/100,\"AVERAGE\",\"POOR\"))))","v":"EXCELLENT"}]
[{"$f":"Data_Sheet!A76","v":"JEC18CS053"},{"$f":"Data_Sheet!B76","v":"JOEL JAMES KARIKKANDATHIL"},{"$f":"'T1'!P76","v":28},{"$f":"IF(C76=\"A\",\"ABSENT\",IF(C76>='T1'!$F$5*$E$124/100,\"EXCELLENT\",IF(C76>='T1'!$F$5*$E$123/100,\"GOOD\",IF(C76>='T1'!$F$5*$E$122/100,\"AVERAGE\",\"POOR\"))))","v":"AVERAGE"}]
[{"$f":"Data_Sheet!A77","v":"JEC18CS054"},{"$f":"Data_Sheet!B77","v":"JOSE REJI KARIMADATHI"},{"$f":"'T1'!P77","v":16},{"$f":"IF(C77=\"A\",\"ABSENT\",IF(C77>='T1'!$F$5*$E$124/100,\"EXCELLENT\",IF(C77>='T1'!$F$5*$E$123/100,\"GOOD\",IF(C77>='T1'!$F$5*$E$122/100,\"AVERAGE\",\"POOR\"))))","v":"POOR"}]
[{"$f":"Data_Sheet!A78","v":"JEC18CS055"},{"$f":"Data_Sheet!B78","v":"JUMANA HASIN"},{"$f":"'T1'!P78","v":43},{"$f":"IF(C78=\"A\",\"ABSENT\",IF(C78>='T1'!$F$5*$E$124/100,\"EXCELLENT\",IF(C78>='T1'!$F$5*$E$123/100,\"GOOD\",IF(C78>='T1'!$F$5*$E$122/100,\"AVERAGE\",\"POOR\"))))","v":"EXCELLENT"}]
[{"$f":"Data_Sheet!A79","v":"JEC18CS056"},{"$f":"Data_Sheet!B79","v":"KAILASHNATH"},{"$f":"'T1'!P79","v":32},{"$f":"IF(C79=\"A\",\"ABSENT\",IF(C79>='T1'!$F$5*$E$124/100,\"EXCELLENT\",IF(C79>='T1'!$F$5*$E$123/100,\"GOOD\",IF(C79>='T1'!$F$5*$E$122/100,\"AVERAGE\",\"POOR\"))))","v":"GOOD"}]
[{"$f":"Data_Sheet!A80","v":"JEC18CS057"},{"$f":"Data_Sheet!B80","v":"K AJISHKUMAR"},{"$f":"'T1'!P80","v":29},{"$f":"IF(C80=\"A\",\"ABSENT\",IF(C80>='T1'!$F$5*$E$124/100,\"EXCELLENT\",IF(C80>='T1'!$F$5*$E$123/100,\"GOOD\",IF(C80>='T1'!$F$5*$E$122/100,\"AVERAGE\",\"POOR\"))))","v":"AVERAGE"}]
[{"$f":"Data_Sheet!A81","v":"JEC18CS058"},{"$f":"Data_Sheet!B81","v":"KEERTHANA K S"},{"$f":"'T1'!P81","v":14},{"$f":"IF(C81=\"A\",\"ABSENT\",IF(C81>='T1'!$F$5*$E$124/100,\"EXCELLENT\",IF(C81>='T1'!$F$5*$E$123/100,\"GOOD\",IF(C81>='T1'!$F$5*$E$122/100,\"AVERAGE\",\"POOR\"))))","v":"POOR"}]
[{"$f":"Data_Sheet!A82","v":"JEC18CS059"},{"$f":"Data_Sheet!B82","v":"KEVIN VARGHESE"},{"$f":"'T1'!P82","v":44},{"$f":"IF(C82=\"A\",\"ABSENT\",IF(C82>='T1'!$F$5*$E$124/100,\"EXCELLENT\",IF(C82>='T1'!$F$5*$E$123/100,\"GOOD\",IF(C82>='T1'!$F$5*$E$122/100,\"AVERAGE\",\"POOR\"))))","v":"EXCELLENT"}]
[{"$f":"Data_Sheet!A83","v":"JEC18CS060"},{"$f":"Data_Sheet!B83","v":"LAKSHMI SADANANDAN"},{"$f":"'T1'!P83","v":23},{"$f":"IF(C83=\"A\",\"ABSENT\",IF(C83>='T1'!$F$5*$E$124/100,\"EXCELLENT\",IF(C83>='T1'!$F$5*$E$123/100,\"GOOD\",IF(C83>='T1'!$F$5*$E$122/100,\"AVERAGE\",\"POOR\"))))","v":"AVERAGE"}]
[{"$f":"Data_Sheet!A84","v":"JEC18CS061"},{"$f":"Data_Sheet!B84","v":"LEYA PALLAN"},{"$f":"'T1'!P84","v":"A"},{"$f":"IF(C84=\"A\",\"ABSENT\",IF(C84>='T1'!$F$5*$E$124/100,\"EXCELLENT\",IF(C84>='T1'!$F$5*$E$123/100,\"GOOD\",IF(C84>='T1'!$F$5*$E$122/100,\"AVERAGE\",\"POOR\"))))","v":"ABSENT"}]
[{"$f":"Data_Sheet!A85","v":"JEC18CS062"},{"$f":"Data_Sheet!B85","v":"MARVEL BABU"},{"$f":"'T1'!P85","v":23},{"$f":"IF(C85=\"A\",\"ABSENT\",IF(C85>='T1'!$F$5*$E$124/100,\"EXCELLENT\",IF(C85>='T1'!$F$5*$E$123/100,\"GOOD\",IF(C85>='T1'!$F$5*$E$122/100,\"AVERAGE\",\"POOR\"))))","v":"AVERAGE"}]
[{"$f":"Data_Sheet!A86","v":"JEC18CS063"},{"$f":"Data_Sheet!B86","v":"MEDWIN PAUL"},{"$f":"'T1'!P86","v":25},{"$f":"IF(C86=\"A\",\"ABSENT\",IF(C86>='T1'!$F$5*$E$124/100,\"EXCELLENT\",IF(C86>='T1'!$F$5*$E$123/100,\"GOOD\",IF(C86>='T1'!$F$5*$E$122/100,\"AVERAGE\",\"POOR\"))))","v":"AVERAGE"}]
[{"$f":"Data_Sheet!A87","v":0},{"$f":"Data_Sheet!B87","v":0},{"$f":"'T1'!P87","v":"A"},{"$f":"IF(C87=\"A\",\"ABSENT\",IF(C87>='T1'!$F$5*$E$124/100,\"EXCELLENT\",IF(C87>='T1'!$F$5*$E$123/100,\"GOOD\",IF(C87>='T1'!$F$5*$E$122/100,\"AVERAGE\",\"POOR\"))))","v":"ABSENT"}]
[{"$f":"Data_Sheet!A88","v":0},{"$f":"Data_Sheet!B88","v":0},{"$f":"'T1'!P88","v":"A"},{"$f":"IF(C88=\"A\",\"ABSENT\",IF(C88>='T1'!$F$5*$E$124/100,\"EXCELLENT\",IF(C88>='T1'!$F$5*$E$123/100,\"GOOD\",IF(C88>='T1'!$F$5*$E$122/100,\"AVERAGE\",\"POOR\"))))","v":"ABSENT"}]
[{"$f":"Data_Sheet!A89","v":"JEC18CS066"},{"$f":"Data_Sheet!B89","v":"MUHAMMED INSHADH"},{"$f":"'T1'!P89","v":26},{"$f":"IF(C89=\"A\",\"ABSENT\",IF(C89>='T1'!$F$5*$E$124/100,\"EXCELLENT\",IF(C89>='T1'!$F$5*$E$123/100,\"GOOD\",IF(C89>='T1'!$F$5*$E$122/100,\"AVERAGE\",\"POOR\"))))","v":"AVERAGE"}]
[{"$f":"Data_Sheet!A90","v":"JEC18CS067"},{"$f":"Data_Sheet!B90","v":"NAIR MIDHUN RAMACHANDRAN"},{"$f":"'T1'!P90","v":26},{"$f":"IF(C90=\"A\",\"ABSENT\",IF(C90>='T1'!$F$5*$E$124/100,\"EXCELLENT\",IF(C90>='T1'!$F$5*$E$123/100,\"GOOD\",IF(C90>='T1'!$F$5*$E$122/100,\"AVERAGE\",\"POOR\"))))","v":"AVERAGE"}]
[{"$f":"Data_Sheet!A91","v":"JEC18CS068"},{"$f":"Data_Sheet!B91","v":"NAVEENA ANTONY"},{"$f":"'T1'!P91","v":21},{"$f":"IF(C91=\"A\",\"ABSENT\",IF(C91>='T1'!$F$5*$E$124/100,\"EXCELLENT\",IF(C91>='T1'!$F$5*$E$123/100,\"GOOD\",IF(C91>='T1'!$F$5*$E$122/100,\"AVERAGE\",\"POOR\"))))","v":"POOR"}]
[{"$f":"Data_Sheet!A92","v":"JEC18CS069"},{"$f":"Data_Sheet!B92","v":"NITIN MADHU"},{"$f":"'T1'!P92","v":45},{"$f":"IF(C92=\"A\",\"ABSENT\",IF(C92>='T1'!$F$5*$E$124/100,\"EXCELLENT\",IF(C92>='T1'!$F$5*$E$123/100,\"GOOD\",IF(C92>='T1'!$F$5*$E$122/100,\"AVERAGE\",\"POOR\"))))","v":"EXCELLENT"}]
[{"$f":"Data_Sheet!A93","v":"JEC18CS070"},{"$f":"Data_Sheet!B93","v":"PRATHIUSH ARUN"},{"$f":"'T1'!P93","v":33},{"$f":"IF(C93=\"A\",\"ABSENT\",IF(C93>='T1'!$F$5*$E$124/100,\"EXCELLENT\",IF(C93>='T1'!$F$5*$E$123/100,\"GOOD\",IF(C93>='T1'!$F$5*$E$122/100,\"AVERAGE\",\"POOR\"))))","v":"GOOD"}]
[{"$f":"Data_Sheet!A94","v":"JEC18CS071"},{"$f":"Data_Sheet!B94","v":"RACHEL CECER"},{"$f":"'T1'!P94","v":39},{"$f":"IF(C94=\"A\",\"ABSENT\",IF(C94>='T1'!$F$5*$E$124/100,\"EXCELLENT\",IF(C94>='T1'!$F$5*$E$123/100,\"GOOD\",IF(C94>='T1'!$F$5*$E$122/100,\"AVERAGE\",\"POOR\"))))","v":"GOOD"}]
[{"$f":"Data_Sheet!A95","v":"JEC18CS072"},{"$f":"Data_Sheet!B95","v":"RAHUL RAJU"},{"$f":"'T1'!P95","v":"A"},{"$f":"IF(C95=\"A\",\"ABSENT\",IF(C95>='T1'!$F$5*$E$124/100,\"EXCELLENT\",IF(C95>='T1'!$F$5*$E$123/100,\"GOOD\",IF(C95>='T1'!$F$5*$E$122/100,\"AVERAGE\",\"POOR\"))))","v":"ABSENT"}]
[{"$f":"Data_Sheet!A96","v":"JEC18CS073"},{"$f":"Data_Sheet!B96","v":"RAHUL T RAVI"},{"$f":"'T1'!P96","v":34},{"$f":"IF(C96=\"A\",\"ABSENT\",IF(C96>='T1'!$F$5*$E$124/100,\"EXCELLENT\",IF(C96>='T1'!$F$5*$E$123/100,\"GOOD\",IF(C96>='T1'!$F$5*$E$122/100,\"AVERAGE\",\"POOR\"))))","v":"GOOD"}]
[{"$f":"Data_Sheet!A97","v":"JEC18CS074"},{"$f":"Data_Sheet!B97","v":"RAPHEAL K MOYALAN"},{"$f":"'T1'!P97","v":19},{"$f":"IF(C97=\"A\",\"ABSENT\",IF(C97>='T1'!$F$5*$E$124/100,\"EXCELLENT\",IF(C97>='T1'!$F$5*$E$123/100,\"GOOD\",IF(C97>='T1'!$F$5*$E$122/100,\"AVERAGE\",\"POOR\"))))","v":"POOR"}]
[{"$f":"Data_Sheet!A98","v":"JEC18CS075"},{"$f":"Data_Sheet!B98","v":"RISHIKESH. V"},{"$f":"'T1'!P98","v":31},{"$f":"IF(C98=\"A\",\"ABSENT\",IF(C98>='T1'!$F$5*$E$124/100,\"EXCELLENT\",IF(C98>='T1'!$F$5*$E$123/100,\"GOOD\",IF(C98>='T1'!$F$5*$E$122/100,\"AVERAGE\",\"POOR\"))))","v":"GOOD"}]
[{"$f":"Data_Sheet!A99","v":"JEC18CS076"},{"$f":"Data_Sheet!B99","v":"ROCKSON T. AUGUSTINE"},{"$f":"'T1'!P99","v":36},{"$f":"IF(C99=\"A\",\"ABSENT\",IF(C99>='T1'!$F$5*$E$124/100,\"EXCELLENT\",IF(C99>='T1'!$F$5*$E$123/100,\"GOOD\",IF(C99>='T1'!$F$5*$E$122/100,\"AVERAGE\",\"POOR\"))))","v":"GOOD"}]
[{"$f":"Data_Sheet!A100","v":"JEC18CS077"},{"$f":"Data_Sheet!B100","v":"SARATH C P"},{"$f":"'T1'!P100","v":42},{"$f":"IF(C100=\"A\",\"ABSENT\",IF(C100>='T1'!$F$5*$E$124/100,\"EXCELLENT\",IF(C100>='T1'!$F$5*$E$123/100,\"GOOD\",IF(C100>='T1'!$F$5*$E$122/100,\"AVERAGE\",\"POOR\"))))","v":"EXCELLENT"}]
[{"$f":"Data_Sheet!A101","v":"JEC18CS078"},{"$f":"Data_Sheet!B101","v":"SARATH SASI"},{"$f":"'T1'!P101","v":45},{"$f":"IF(C101=\"A\",\"ABSENT\",IF(C101>='T1'!$F$5*$E$124/100,\"EXCELLENT\",IF(C101>='T1'!$F$5*$E$123/100,\"GOOD\",IF(C101>='T1'!$F$5*$E$122/100,\"AVERAGE\",\"POOR\"))))","v":"EXCELLENT"}]
[{"$f":"Data_Sheet!A102","v":"JEC18CS079"},{"$f":"Data_Sheet!B102","v":"SHAFNA"},{"$f":"'T1'!P102","v":50},{"$f":"IF(C102=\"A\",\"ABSENT\",IF(C102>='T1'!$F$5*$E$124/100,\"EXCELLENT\",IF(C102>='T1'!$F$5*$E$123/100,\"GOOD\",IF(C102>='T1'!$F$5*$E$122/100,\"AVERAGE\",\"POOR\"))))","v":"EXCELLENT"}]
[{"$f":"Data_Sheet!A103","v":"JEC18CS080"},{"$f":"Data_Sheet!B103","v":"SHELMY SHABU"},{"$f":"'T1'!P103","v":40},{"$f":"IF(C103=\"A\",\"ABSENT\",IF(C103>='T1'!$F$5*$E$124/100,\"EXCELLENT\",IF(C103>='T1'!$F$5*$E$123/100,\"GOOD\",IF(C103>='T1'!$F$5*$E$122/100,\"AVERAGE\",\"POOR\"))))","v":"EXCELLENT"}]
[{"$f":"Data_Sheet!A104","v":"JEC18CS081"},{"$f":"Data_Sheet!B104","v":"SHIZA SHIHAB PUVAMPARAMBIL"},{"$f":"'T1'!P104","v":47},{"$f":"IF(C104=\"A\",\"ABSENT\",IF(C104>='T1'!$F$5*$E$124/100,\"EXCELLENT\",IF(C104>='T1'!$F$5*$E$123/100,\"GOOD\",IF(C104>='T1'!$F$5*$E$122/100,\"AVERAGE\",\"POOR\"))))","v":"EXCELLENT"}]
[{"$f":"Data_Sheet!A105","v":"JEC18CS082"},{"$f":"Data_Sheet!B105","v":"SIJO GEORGE"},{"$f":"'T1'!P105","v":31},{"$f":"IF(C105=\"A\",\"ABSENT\",IF(C105>='T1'!$F$5*$E$124/100,\"EXCELLENT\",IF(C105>='T1'!$F$5*$E$123/100,\"GOOD\",IF(C105>='T1'!$F$5*$E$122/100,\"AVERAGE\",\"POOR\"))))","v":"GOOD"}]
[{"$f":"Data_Sheet!A106","v":"JEC18CS083"},{"$f":"Data_Sheet!B106","v":"SOURAV K"},{"$f":"'T1'!P106","v":26},{"$f":"IF(C106=\"A\",\"ABSENT\",IF(C106>='T1'!$F$5*$E$124/100,\"EXCELLENT\",IF(C106>='T1'!$F$5*$E$123/100,\"GOOD\",IF(C106>='T1'!$F$5*$E$122/100,\"AVERAGE\",\"POOR\"))))","v":"AVERAGE"}]
[{"$f":"Data_Sheet!A107","v":0},{"$f":"Data_Sheet!B107","v":0},{"$f":"'T1'!P107","v":"A"},{"$f":"IF(C107=\"A\",\"ABSENT\",IF(C107>='T1'!$F$5*$E$124/100,\"EXCELLENT\",IF(C107>='T1'!$F$5*$E$123/100,\"GOOD\",IF(C107>='T1'!$F$5*$E$122/100,\"AVERAGE\",\"POOR\"))))","v":"ABSENT"}]
[{"$f":"Data_Sheet!A108","v":"JEC18CS085"},{"$f":"Data_Sheet!B108","v":"SREEHARI"},{"$f":"'T1'!P108","v":27},{"$f":"IF(C108=\"A\",\"ABSENT\",IF(C108>='T1'!$F$5*$E$124/100,\"EXCELLENT\",IF(C108>='T1'!$F$5*$E$123/100,\"GOOD\",IF(C108>='T1'!$F$5*$E$122/100,\"AVERAGE\",\"POOR\"))))","v":"AVERAGE"}]
[{"$f":"Data_Sheet!A109","v":"JEC18CS086"},{"$f":"Data_Sheet!B109","v":"SREEKANTH P"},{"$f":"'T1'!P109","v":17},{"$f":"IF(C109=\"A\",\"ABSENT\",IF(C109>='T1'!$F$5*$E$124/100,\"EXCELLENT\",IF(C109>='T1'!$F$5*$E$123/100,\"GOOD\",IF(C109>='T1'!$F$5*$E$122/100,\"AVERAGE\",\"POOR\"))))","v":"POOR"}]
[{"$f":"Data_Sheet!A110","v":"JEC18CS087"},{"$f":"Data_Sheet!B110","v":"SREELEKSHMI H KUMAR"},{"$f":"'T1'!P110","v":25},{"$f":"IF(C110=\"A\",\"ABSENT\",IF(C110>='T1'!$F$5*$E$124/100,\"EXCELLENT\",IF(C110>='T1'!$F$5*$E$123/100,\"GOOD\",IF(C110>='T1'!$F$5*$E$122/100,\"AVERAGE\",\"POOR\"))))","v":"AVERAGE"}]
[{"$f":"Data_Sheet!A111","v":"JEC18CS088"},{"$f":"Data_Sheet!B111","v":"SUFAIL BADUSHA.T"},{"$f":"'T1'!P111","v":31},{"$f":"IF(C111=\"A\",\"ABSENT\",IF(C111>='T1'!$F$5*$E$124/100,\"EXCELLENT\",IF(C111>='T1'!$F$5*$E$123/100,\"GOOD\",IF(C111>='T1'!$F$5*$E$122/100,\"AVERAGE\",\"POOR\"))))","v":"GOOD"}]
[{"$f":"Data_Sheet!A112","v":"JEC18CS089"},{"$f":"Data_Sheet!B112","v":"TIYA THOMAS"},{"$f":"'T1'!P112","v":49},{"$f":"IF(C112=\"A\",\"ABSENT\",IF(C112>='T1'!$F$5*$E$124/100,\"EXCELLENT\",IF(C112>='T1'!$F$5*$E$123/100,\"GOOD\",IF(C112>='T1'!$F$5*$E$122/100,\"AVERAGE\",\"POOR\"))))","v":"EXCELLENT"}]
[{"$f":"Data_Sheet!A113","v":"JEC18CS090"},{"$f":"Data_Sheet!B113","v":"TOMSUN PAVOO P"},{"$f":"'T1'!P113","v":32},{"$f":"IF(C113=\"A\",\"ABSENT\",IF(C113>='T1'!$F$5*$E$124/100,\"EXCELLENT\",IF(C113>='T1'!$F$5*$E$123/100,\"GOOD\",IF(C113>='T1'!$F$5*$E$122/100,\"AVERAGE\",\"POOR\"))))","v":"GOOD"}]
[{"$f":"Data_Sheet!A114","v":"JEC18CS091"},{"$f":"Data_Sheet!B114","v":"ULLAS. S"},{"$f":"'T1'!P114","v":23},{"$f":"IF(C114=\"A\",\"ABSENT\",IF(C114>='T1'!$F$5*$E$124/100,\"EXCELLENT\",IF(C114>='T1'!$F$5*$E$123/100,\"GOOD\",IF(C114>='T1'!$F$5*$E$122/100,\"AVERAGE\",\"POOR\"))))","v":"AVERAGE"}]
[{"$f":"Data_Sheet!A115","v":"JEC18CS092"},{"$f":"Data_Sheet!B115","v":"VAISHNAV M"},{"$f":"'T1'!P115","v":31},{"$f":"IF(C115=\"A\",\"ABSENT\",IF(C115>='T1'!$F$5*$E$124/100,\"EXCELLENT\",IF(C115>='T1'!$F$5*$E$123/100,\"GOOD\",IF(C115>='T1'!$F$5*$E$122/100,\"AVERAGE\",\"POOR\"))))","v":"GOOD"}]
[{"$f":"Data_Sheet!A116","v":"JEC18CS093"},{"$f":"Data_Sheet!B116","v":"VANI PRAKASHAN CHOYYAN"},{"$f":"'T1'!P116","v":49.5},{"$f":"IF(C116=\"A\",\"ABSENT\",IF(C116>='T1'!$F$5*$E$124/100,\"EXCELLENT\",IF(C116>='T1'!$F$5*$E$123/100,\"GOOD\",IF(C116>='T1'!$F$5*$E$122/100,\"AVERAGE\",\"POOR\"))))","v":"EXCELLENT"}]
[]
["Total Number of Students",null,{"$f":"Data_Sheet!$C$6","v":92}]
["Number of Students Absent",null,{"$f":"IF(COUNTIF(C25:INDIRECT(C131),\"=A\"),COUNTIF(C25:INDIRECT(C131),\"=A\"),0)","v":6}]
["Total Number of Students attended",null,{"$f":"C118-C119","v":86}]
[{"$f":"\"Number of Students with Marks less than \"&E122&\"%\"","v":"Number of Students with Marks less than 45%"},null,{"$f":"IF(COUNTIF(D25:INDIRECT(D131),\"=POOR\"),COUNTIF(D25:INDIRECT(D131),\"=POOR\"),0)","v":20},"POOR","Range"]
[{"$f":"\"Number of Students with Marks betweeen \"&E122&\"% to \"&E123&\"%\"","v":"Number of Students with Marks betweeen 45% to 60%"},null,{"$f":"IF(COUNTIF(D25:INDIRECT(D131),\"=AVERAGE\"),COUNTIF(D25:INDIRECT(D131),\"=AVERAGE\"),0)","v":24},"AVERAGE",45]
[{"$f":"\"Number of Students with Marks betweeen \"&E123&\"% to \"&E124&\"%\"","v":"Number of Students with Marks betweeen 60% to 80%"},null,{"$f":"IF(COUNTIF(D25:INDIRECT(D131),\"=GOOD\"),COUNTIF(D25:INDIRECT(D131),\"=GOOD\"),0)","v":22},"GOOD",60]
[{"$f":"\"Number of Students with Marks greater than \"&E124&\"%\"","v":"Number of Students with Marks greater than 80%"},null,{"$f":"IF(COUNTIF(D25:INDIRECT(D131),\"=EXCELLENT\"),COUNTIF(D25:INDIRECT(D131),\"=EXCELLENT\"),0)","v":20},"EXCELLENT",80]
["Class Average",null,{"$f":"ROUND(AVERAGE(C25:INDIRECT(C131)),2)","v":30.16}]
["Pass Percentage",null,{"$f":"ROUND(((C120-C121)/C120)*100,2)","v":76.739999999999995}]
[]
[null,{"$f":"Data_Sheet!B10","v":"Name of Faculty : "},{"$f":"Data_Sheet!B11","v":"Namitha T N"}]
[null,{"$f":"Data_Sheet!B136","v":"Dated Signature :  "}]
[]
[{"$f":"ROW(A118)-2","v":116},"Last Row Count",{"$f":"\"$C$\"&$A$131","v":"$C$116"},{"$f":"\"$D$\"&$A$131","v":"$D$116"}]

{"sheet":"T2","index":4,"n_rows":181,"n_cols":28,"rows_kept":181,"cut":false,"hidden":false,"merged":[[118,0,118,2],[119,0,119,2],[120,0,120,2],[121,0,121,2],[17,20,21,20],[168,24,173,24],[140,24,145,24],[147,24,152,24],[154,24,159,24],[161,24,166,24],[6,0,6,17],[8,0,8,17],[10,0,10,17],[12,0,12,17],[117,0,117,2],[17,0,21,0],[17,1,21,1],[17,17,21,17],[2,0,4,1],[2,2,2,5],[2,6,2,16],[3,2,3,5],[3,6,3,16],[4,2,4,4]]}
[]
[]
["Add questions one by one as needed..",null,"Assessment Category",null,null,null,"Date : ",null,null,null,null,null,null,null,null,null,null,null,"CO1","First Internal Exam"]
[null,null,"Second Internal Exam",null,null,null,"14-03-18",null,null,null,null,null,null,null,null,null,null,null,"CO2","Second Internal Exam"]
[null,null,"Total Marks : ",null,null,50,null,null,null,null,null,null,null,null,null,null,null,null,"CO3","Assessment Exam - 1"]
[null,null,null,null,null,null,null,null,null,null,null,null,null,null,null,null,null,null,"CO4","Assessment Exam - 2"]
[{"$f":"Data_Sheet!A2","v":"Jyothi Engineering College, Cheruthuruthy"},null,null,null,null,null,null,null,null,null,null,null,null,null,null,null,null,null,"CO5","Assignment - 1"]
[null,null,null,null,null,null,null,null,null,null,null,null,null,null,null,null,null,null,"CO6","Assignment - 2"]
[{"$f":"Data_Sheet!A4","v":"Department of Computer Science Engineering"},null,null,null,null,null,null,null,null,null,null,null,null,null,null,null,null,null,null,"Retest"]
[null,null,null,null,null,null,null,null,null,null,null,null,null,null,null,null,null,null,1]
[{"$f":"\"CO Analysis - Internal Marks : \"&C4 &\"                       \" &TEXT(G4,\"dd-mm-yy\")","v":"CO Analysis - Internal Marks : Second Internal Exam                       14-03-18"},null,null,null,null,null,null,null,null,null,null,null,null,null,null,null,null,null,2]
[null,null,null,null,null,null,null,null,null,null,null,null,null,null,null,null,null,null,3]
[{"$f":"Data_Sheet!A17","v":"S3 CS              CS203 Switching Theory and Logic Design               2019-20"},null,null,null,null,null,null,null,null,null,null,null,null,null,null,null,null,null,4]
[null,null,null,null,null,null,null,null,null,null,null,null,null,null,null,null,null,null,5]
[null,null,null,null,null,null,null,null,null,null,null,null,null,null,null,null,null,null,6]
[]
[]
["Register No.","Name of Student","Qn. No.",1,2,3,4,5,6,7,8,9,10,"10b",11,"12a","12b",{"$f":" \"Total Marks (\" &F5 & \")\"","v":"Total Marks (50)"},null,null,"Calculated Total Marks (50)"]
[null,null,"CO's","CO3","CO3","CO4","CO4","CO3","CO3","CO3","CO3","CO3","CO3","CO3","CO3","CO3","CO5"]
[null,null,"Blooms Taxonomy Lavel",3,3,3,4,3,3,3,3,3,3,3,3,3,4]
[null,null,"Max. Marks",5,5,5,5,5,5,5,5,5,5,5,5,5,5]
[null,null,"Difficulty Level in %",60,60,60,60,60,60,60,60,60,60,60,60,60,60]
[]
["Column1","Column2","Column3","Column4","Column5","Column6","Column7","Column4","Column4","Column4","Column4","Column4","Column4","Column4","Column4","Column4","Column8","Column32"]
[{"$f":"Data_Sheet!A25","v":"JEC18CS001"},{"$f":"Data_Sheet!B25","v":"ABHISHEK KRISHNAN MENON E"},null,0,0,1,null,null,0,3,3,3,null,0,0,1,2,{"$f":"SUM(D25:Q25)","v":13}]
[{"$f":"Data_Sheet!A26","v":"JEC18CS002"},{"$f":"Data_Sheet!B26","v":"ABHISHEK SAJEEVAN"},null,null,null,null,null,null,null,null,null,null,null,null,null,null,null,{"$f":"SUM(D26:Q26)","v":0}]
[{"$f":"Data_Sheet!A27","v":"JEC18CS003"},{"$f":"Data_Sheet!B27","v":"ABHITH SHAJI"},null,null,null,null,null,2,null,null,0,9,null,null,5,null,null,16]
[{"$f":"Data_Sheet!A28","v":"JEC18CS004"},{"$f":"Data_Sheet!B28","v":"ABIN SANTHOSH ALAPATT"},null,null,null,null,null,2,null,null,null,9,2,3,9,null,4,29]
[{"$f":"Data_Sheet!A29","v":"JEC18CS005"},{"$f":"Data_Sheet!B29","v":"ADARSH KUMAR M A"},null,null,2,2,null,null,2,null,3,5,null,null,8,2,2,26]
[{"$f":"Data_Sheet!A30","v":"JEC18CS006"},{"$f":"Data_Sheet!B30","v":"ADHITHYA KRISHNA S"},null,2,null,null,3,1,null,null,2,4,null,null,9,4,null,25]
[{"$f":"Data_Sheet!A31","v":"JEC18CS007"},{"$f":"Data_Sheet!B31","v":"ADITHYA HARIDAS"},null,null,2,1,null,null,1,1,3,7,3,3,2,null,null,23]
[{"$f":"Data_Sheet!A32","v":"JEC18CS008"},{"$f":"Data_Sheet!B32","v":"AJMAL BASHEER"},null,null,null,null,null,null,null,null,null,null,null,null,null,null,null,0]
[{"$f":"Data_Sheet!A33","v":"JEC18CS009"},{"$f":"Data_Sheet!B33","v":"AKASH.V"},null,0,null,null,null,null,null,null,null,4,null,null,6,2,3,15]
[{"$f":"Data_Sheet!A34","v":"JEC18CS010"},{"$f":"Data_Sheet!B34","v":"AKHIL AZEEZ UPPILAMKUNNATH"},null,null,2,2,null,null,2,3,3,9,null,null,8,5,1,35]
[{"$f":"Data_Sheet!A35","v":"JEC18CS011"},{"$f":"Data_Sheet!B35","v":"AKHIL KRISHNA UK"},null,null,null,null,null,1,2,1,3,3,null,null,2,null,null,12]
[{"$f":"Data_Sheet!A36","v":"JEC18CS012"},{"$f":"Data_Sheet!B36","v":"ALAN GEORGE"},null,null,3,null,null,null,1,1,3,8,2,null,null,null,null,18]
[{"$f":"Data_Sheet!A37","v":"JEC18CS013"},{"$f":"Data_Sheet!B37","v":"ALEN VARGHESE"},null,2,3,2,null,null,1,null,3,5,null,null,9,5,4,34]
[{"$f":"Data_Sheet!A38","v":"JEC18CS014"},{"$f":"Data_Sheet!B38","v":"AMAL SEBASTIAN"},null,2.5,2,2,3,1.5,2.5,3,3,9,null,null,9,4,4,45.5]
[{"$f":"Data_Sheet!A39","v":"JEC18CS015"},{"$f":"Data_Sheet!B39","v":"AMAL SONY"},null,null,null,null,null,1,null,null,null,4,null,null,4,null,null,9]
[{"$f":"Data_Sheet!A40","v":"JEC18CS016"},{"$f":"Data_Sheet!B40","v":"ANAGHA WILSON"},null,2,3,2,3,null,1,3,2,9,3,null,null,null,null,28]
[{"$f":"Data_Sheet!A41","v":"JEC18CS017"},{"$f":"Data_Sheet!B41","v":"ANETTE ANTO"},null,null,1,null,null,null,null,null,3,3,null,null,2,1,3,13]
[{"$f":"Data_Sheet!A42","v":"JEC18CS018"},{"$f":"Data_Sheet!B42","v":"ANIT MARY THOMAS"},null,null,3,null,null,null,2,3,3,9,null,null,8,3,4,35]
[{"$f":"Data_Sheet!A43","v":"JEC18CS020"},{"$f":"Data_Sheet!B43","v":"ANN THERESA SHAJI"},null,3,3,3,3,2,3,3,2,9,5,4,null,5,4,49]
[{"$f":"Data_Sheet!A44","v":"JEC18CS021"},{"$f":"Data_Sheet!B44","v":"ANTONY ROY"},null,null,null,null,null,1,1,3,0,1,null,null,null,null,null,6]
[{"$f":"Data_Sheet!A45","v":"JEC18CS022"},{"$f":"Data_Sheet!B45","v":"ANUGRAHA C"},null,2,3,null,3,null,2,3,3,5,null,null,4,5,4,34]
[{"$f":"Data_Sheet!A46","v":"JEC18CS023"},{"$f":"Data_Sheet!B46","v":"APARNA.V"},null,null,null,2,null,null,2,3,2,7,5,4,null,5,4,34]
[{"$f":"Data_Sheet!A47","v":"JEC18CS024"},{"$f":"Data_Sheet!B47","v":"ARAVIND S KUMAR"},null,null,3,null,3,2,null,null,3,9,null,null,9,2,4,35]
[{"$f":"Data_Sheet!A48","v":"JEC18CS025"},{"$f":"Data_Sheet!B48","v":"ARJUN VINOD"},null,null,null,null,null,2,null,null,null,5,null,null,9,null,null,16]
[{"$f":"Data_Sheet!A49","v":"JEC18CS026"},{"$f":"Data_Sheet!B49","v":"ARUN VG"},null,null,3,null,null,1,1,null,1,null,4,4,9,null,null,23]
[{"$f":"Data_Sheet!A50","v":"JEC18CS027"},{"$f":"Data_Sheet!B50","v":"ASHRUL K"},null,null,2,1,null,2,1,1,1,7,3,3,null,5,4,30]
[{"$f":"Data_Sheet!A51","v":"JEC18CS028"},{"$f":"Data_Sheet!B51","v":"ATHIL PAULY"},null,null,null,null,null,2,null,null,1,8,3,null,null,3,null,17]
[{"$f":"Data_Sheet!A52","v":"JEC18CS029"},{"$f":"Data_Sheet!B52","v":"ATHIRA K P"},null,null,3,null,null,null,null,3,3,5,5,3,null,5,4,31]
[{"$f":"Data_Sheet!A53","v":"JEC18CS030"},{"$f":"Data_Sheet!B53","v":"AWIN ANTO"},null,null,null,1,null,null,1,null,3,3,null,null,5,4,null,17]
[{"$f":"Data_Sheet!A54","v":"JEC18CS031"},{"$f":"Data_Sheet!B54","v":"CHARLES JOHNSON"},null,2,3,null,null,2,1,null,3,4,2,null,4,3,2,26]
[{"$f":"Data_Sheet!A55","v":"JEC18CS032"},{"$f":"Data_Sheet!B55","v":"CHITTILAPPILLY JOVIA JOHNSON"},null,null,2,2,null,2,null,3,null,9,null,4,5,null,4,31]
[{"$f":"Data_Sheet!A56","v":"JEC18CS033"},{"$f":"Data_Sheet!B56","v":"CIYA BABU"},null,null,null,null,null,1,null,null,1,4,5,4,null,4,null,19]
[{"$f":"Data_Sheet!A57","v":"JEC18CS034"},{"$f":"Data_Sheet!B57","v":"DAVID SALUS"},null,null,null,null,null,2,1,null,3,7,null,null,2,null,2,17]
[{"$f":"Data_Sheet!A58","v":"JEC18CS035"},{"$f":"Data_Sheet!B58","v":"DELICIA REJI"},null,3,3,null,3,2,1,3,3,9,1,null,9,3,4,44]
[{"$f":"Data_Sheet!A59","v":"JEC18CS036"},{"$f":"Data_Sheet!B59","v":"DELMA SHAJAN"},null,2,3,3,null,null,2,3,3,5,2,3,null,5,3,34]
[{"$f":"Data_Sheet!A60","v":"JEC18CS037"},{"$f":"Data_Sheet!B60","v":"DILBER SHA AP"},null,null,null,null,null,null,null,null,null,null,null,null,null,null,null,0]
[{"$f":"Data_Sheet!A61","v":"JEC18CS038"},{"$f":"Data_Sheet!B61","v":"EDWIN T JOY"},null,null,null,2,null,2,null,1,2,8,null,null,7,1,4,27]
[{"$f":"Data_Sheet!A62","v":"JEC18CS039"},{"$f":"Data_Sheet!B62","v":"EDWIN WILSON"},null,null,null,null,1,null,null,null,1,8,null,null,null,4,3,17]
[{"$f":"Data_Sheet!A63","v":"JEC18CS040"},{"$f":"Data_Sheet!B63","v":"EMMANUEL SHIBU"},null,null,null,2,3,1,2,2,null,8,null,null,null,null,1,19]
[{"$f":"Data_Sheet!A64","v":"JEC18CS041"},{"$f":"Data_Sheet!B64","v":"GAYATHRI DINESH"},null,null,3,1,null,2,1,3,2,4,null,null,4,2,2,24]
[{"$f":"Data_Sheet!A65","v":"JEC18CS042"},{"$f":"Data_Sheet!B65","v":"GOKUL DAS M"},null,null,null,2,null,2,2,3,3,9,4,3,null,3,4,35]
[{"$f":"Data_Sheet!A66","v":"JEC18CS043"},{"$f":"Data_Sheet!B66","v":"G RAMGOPAL"},null,3,3,3,null,2,2.5,3,3,9,4,4,null,5,4,45.5]
[{"$f":"Data_Sheet!A67","v":"JEC18CS044"},{"$f":"Data_Sheet!B67","v":"HARIES DAVIS"},null,null,null,null,3,null,2,null,2,5,null,null,3,null,1,16]
[{"$f":"Data_Sheet!A68","v":"JEC18CS045"},{"$f":"Data_Sheet!B68","v":"HARISANKER P"},null,null,3,null,3,2,2,3,1,9,null,null,9,null,null,32]
[{"$f":"Data_Sheet!A69","v":"JEC18CS046"},{"$f":"Data_Sheet!B69","v":"HARSHA.K.S."},null,1,3,2,null,2,2,3,3,9,1,1,3,null,3,33]
[{"$f":"Data_Sheet!A70","v":"JEC18CS047"},{"$f":"Data_Sheet!B70","v":"HELNA THOMAS"},null,null,3,1,null,2,2,3,3,7,4,3,null,4,4,36]
[{"$f":"Data_Sheet!A71","v":"JEC18CS048"},{"$f":"Data_Sheet!B71","v":"HRIDI KRISHNA.H"},null,null,null,null,null,null,null,3,2,5,null,1,null,1,4,16]
[{"$f":"Data_Sheet!A72","v":"JEC18CS049"},{"$f":"Data_Sheet!B72","v":"INDRAJIT R"},null,0.5,null,null,null,null,null,2,2,null,0.5,null,3,1,null,9]
[{"$f":"Data_Sheet!A73","v":"JEC18CS050"},{"$f":"Data_Sheet!B73","v":"JESWIN JOJY"},null,2,null,null,3,null,2,3,3,9,null,null,4,2.5,2,30.5]
[{"$f":"Data_Sheet!A74","v":"JEC18CS051"},{"$f":"Data_Sheet!B74","v":"JIBIN A BABU"},null,2,0.5,null,2,null,3,1.5,3.5,5,null,null,null,3,2.5,23]
[{"$f":"Data_Sheet!A75","v":"JEC18CS052"},{"$f":"Data_Sheet!B75","v":"JISSY JOY"},null,3,2.5,1,3,2,2.5,3,3,7,null,null,5,5,4,41]
[{"$f":"Data_Sheet!A76","v":"JEC18CS053"},{"$f":"Data_Sheet!B76","v":"JOEL JAMES KARIKKANDATHIL"},null,3,null,null,3,null,null,0.5,3,2,null,null,null,1,1,13.5]
[{"$f":"Data_Sheet!A77","v":"JEC18CS054"},{"$f":"Data_Sheet!B77","v":"JOSE REJI KARIMADATHI"},null,null,2.5,null,3,null,2.5,null,2,7,null,0.5,null,2,1,20.5]
[{"$f":"Data_Sheet!A78","v":"JEC18CS055"},{"$f":"Data_Sheet!B78","v":"JUMANA HASIN"},null,1,null,null,0.5,2,1,2,1,9,null,4,0.5,4,3,28]
[{"$f":"Data_Sheet!A79","v":"JEC18CS056"},{"$f":"Data_Sheet!B79","v":"KAILASHNATH"},null,3,1.5,null,null,null,1.5,3,null,6,1,null,null,null,null,16]
[{"$f":"Data_Sheet!A80","v":"JEC18CS057"},{"$f":"Data_Sheet!B80","v":"K AJISHKUMAR"},null,null,null,null,null,null,null,null,null,null,null,null,null,null,null,0]
[{"$f":"Data_Sheet!A81","v":"JEC18CS058"},{"$f":"Data_Sheet!B81","v":"KEERTHANA K S"},null,null,0.5,null,0.5,null,null,3,3,3,null,null,2,1,2,15]
[{"$f":"Data_Sheet!A82","v":"JEC18CS059"},{"$f":"Data_Sheet!B82","v":"KEVIN VARGHESE"},null,3,2,0.5,3,0.5,3,3,3,5,null,null,9,5,3,40]
[{"$f":"Data_Sheet!A83","v":"JEC18CS060"},{"$f":"Data_Sheet!B83","v":"LAKSHMI SADANANDAN"},null,3,null,null,2,null,1,1,null,7,null,null,null,2.5,0.5,17]
[{"$f":"Data_Sheet!A84","v":"JEC18CS061"},{"$f":"Data_Sheet!B84","v":"LEYA PALLAN"},null,0.5,1.5,null,0.5,1,null,3,2,4,null,null,1,null,4,17.5]
[{"$f":"Data_Sheet!A85","v":"JEC18CS062"},{"$f":"Data_Sheet!B85","v":"MARVEL BABU"},null,null,null,null,null,0.5,null,0.5,1,5,null,null,3,1,2,13]
[{"$f":"Data_Sheet!A86","v":"JEC18CS063"},{"$f":"Data_Sheet!B86","v":"MEDWIN PAUL"},null,null,null,null,null,null,null,null,1,4,null,null,null,null,null,5]
[{"$f":"Data_Sheet!A87","v":0},{"$f":"Data_Sheet!B87","v":0}]
[{"$f":"Data_Sheet!A88","v":0},{"$f":"Data_Sheet!B88","v":0}]
[{"$f":"Data_Sheet!A89","v":"JEC18CS066"},{"$f":"Data_Sheet!B89","v":"MUHAMMED INSHADH"},null,null,1,null,null,null,null,null,1,4,null,null,3,null,null,{"$f":"SUM(D89:Q89)","v":9}]
[{"$f":"Data_Sheet!A90","v":"JEC18CS067"},{"$f":"Data_Sheet!B90","v":"NAIR MIDHUN RAMACHANDRAN"},null,null,null,null,null,null,null,null,2.5,6,null,null,5,5,4,{"$f":"SUM(D90:Q90)","v":22.5}]
[{"$f":"Data_Sheet!A91","v":"JEC18CS068"},{"$f":"Data_Sheet!B91","v":"NAVEENA ANTONY"},null,3,2,null,3,null,1.5,2,2.5,null,null,null,5,1,2,22]
[{"$f":"Data_Sheet!A92","v":"JEC18CS069"},{"$f":"Data_Sheet!B92","v":"NITIN MADHU"},null,3,3,null,3,null,2,3,0.5,null,2.5,null,3,1,3,24]
[{"$f":"Data_Sheet!A93","v":"JEC18CS070"},{"$f":"Data_Sheet!B93","v":"PRATHIUSH ARUN"},null,null,1,2,1,null,1,2,1,null,1,4,1,1,2,17]
[{"$f":"Data_Sheet!A94","v":"JEC18CS071"},{"$f":"Data_Sheet!B94","v":"RACHEL CECER"},null,3,3,1,3,1,2,3,2.5,9,null,null,9,2,4,42.5]
[{"$f":"Data_Sheet!A95","v":"JEC18CS072"},{"$f":"Data_Sheet!B95","v":"RAHUL RAJU"},null,null,2,null,null,null,null,null,1.5,3,null,1,1,3,null,11.5]
[{"$f":"Data_Sheet!A96","v":"JEC18CS073"},{"$f":"Data_Sheet!B96","v":"RAHUL T RAVI"},null,null,null,null,null,null,null,null,2,7,null,null,2,null,2,13]
[{"$f":"Data_Sheet!A97","v":"JEC18CS074"},{"$f":"Data_Sheet!B97","v":"RAPHEAL K MOYALAN"},null,1.5,null,null,2,null,null,null,1,4,null,null,null,1,1,10.5]
[{"$f":"Data_Sheet!A98","v":"JEC18CS075"},{"$f":"Data_Sheet!B98","v":"RISHIKESH. V"},null,2,3,null,2,1,null,3,2,6,null,4,null,5,4,32]
[{"$f":"Data_Sheet!A99","v":"JEC18CS076"},{"$f":"Data_Sheet!B99","v":"ROCKSON T. AUGUSTINE"},null,1,1.5,1.5,null,0.5,1.5,3,1,8,1,4,1,null,null,24]
[{"$f":"Data_Sheet!A100","v":"JEC18CS077"},{"$f":"Data_Sheet!B100","v":"SARATH C P"},null,3,2,null,3,1.5,2,null,1,9,4,null,null,4,null,29.5]
[{"$f":"Data_Sheet!A101","v":"JEC18CS078"},{"$f":"Data_Sheet!B101","v":"SARATH SASI"},null,3,3,null,3,0.5,2.5,3,2,7,null,null,5,1,4,34]
[{"$f":"Data_Sheet!A102","v":"JEC18CS079"},{"$f":"Data_Sheet!B102","v":"SHAFNA"},null,3,3,1.5,3,2,2.5,3,3,9,null,null,9,5,4,48]
[{"$f":"Data_Sheet!A103","v":"JEC18CS080"},{"$f":"Data_Sheet!B103","v":"SHELMY SHABU"},null,1.5,3,3,2,1.5,2.5,3,3,9,null,null,9,5,4,46.5]
[{"$f":"Data_Sheet!A104","v":"JEC18CS081"},{"$f":"Data_Sheet!B104","v":"SHIZA SHIHAB PUVAMPARAMBIL"},null,null,1.5,null,null,1,null,null,3,7,4,null,null,3,4,23.5]
[{"$f":"Data_Sheet!A105","v":"JEC18CS082"},{"$f":"Data_Sheet!B105","v":"SIJO GEORGE"},null,null,null,null,null,null,null,null,null,null,null,null,null,null,null,0]
[{"$f":"Data_Sheet!A106","v":"JEC18CS083"},{"$f":"Data_Sheet!B106","v":"SOURAV K"},null,null,1,null,null,null,1,1,null,5,null,null,3,0.5,0.5,12]
[{"$f":"Data_Sheet!A107","v":0},{"$f":"Data_Sheet!B107","v":0}]
[{"$f":"Data_Sheet!A108","v":"JEC18CS085"},{"$f":"Data_Sheet!B108","v":"SREEHARI"},null,1,1,null,null,0.5,null,null,null,1,null,null,null,2,2,{"$f":"SUM(D108:Q108)","v":7.5}]
[{"$f":"Data_Sheet!A109","v":"JEC18CS086"},{"$f":"Data_Sheet!B109","v":"SREEKANTH P"},null,null,null,null,null,1,null,null,0.5,null,null,null,null,null,null,1.5]
[{"$f":"Data_Sheet!A110","v":"JEC18CS087"},{"$f":"Data_Sheet!B110","v":"SREELEKSHMI H KUMAR"},null,1.5,3,0.5,3,1,2,3,0.5,9,null,null,3,5,2,33.5]
[{"$f":"Data_Sheet!A111","v":"JEC18CS088"},{"$f":"Data_Sheet!B111","v":"SUFAIL BADUSHA.T"},null,null,null,null,null,null,null,null,null,null,null,null,null,null,null,0]
[{"$f":"Data_Sheet!A112","v":"JEC18CS089"},{"$f":"Data_Sheet!B112","v":"TIYA THOMAS"},null,3,3,1,3,2,3,3,2,9,null,null,1,5,4,39]
[{"$f":"Data_Sheet!A113","v":"JEC18CS090"},{"$f":"Data_Sheet!B113","v":"TOMSUN PAVOO P"},null,3,0.5,1.5,3,1,null,null,0.5,4,null,4,null,1,3,21.5]
[{"$f":"Data_Sheet!A114","v":"JEC18CS091"},{"$f":"Data_Sheet!B114","v":"ULLAS. S"},null,null,1,null,null,1,1,null,1.5,5,null,null,1,2,3,15.5]
[{"$f":"Data_Sheet!A115","v":"JEC18CS092"},{"$f":"Data_Sheet!B115","v":"VAISHNAV M"},null,null,null,null,null,null,null,null,1,1,null,null,0.5,1,1.5,5]
[{"$f":"Data_Sheet!A116","v":"JEC18CS093"},{"$f":"Data_Sheet!B116","v":"VANI PRAKASHAN CHOYYAN"},null,2.5,3,2,3,2,2.5,3,3,9,null,null,9,5,4,48]
[]
["Total Marks scored for the Question",null,null,{"$f":"IF(D$22<>\"\",IF(SUM(D25:INDIRECT(D138))>=0,SUM(D25:INDIRECT(D138)),\"\"),\"\")","v":80.5},{"$f":"IF(E$22<>\"\",IF(SUM(E25:INDIRECT(E138))>=0,SUM(E25:INDIRECT(E138)),\"\"),\"\")","v":116.5},{"$f":"IF(F$22<>\"\",IF(SUM(F25:INDIRECT(F138))>=0,SUM(F25:INDIRECT(F138)),\"\"),\"\")","v":52.5},{"$f":"IF(G$22<>\"\",IF(SUM(G25:INDIRECT(G138))>=0,SUM(G25:INDIRECT(G138)),\"\"),\"\")","v":88.5},{"$f":"IF(H$22<>\"\",IF(SUM(H25:INDIRECT(H138))>=0,SUM(H25:INDIRECT(H138)),\"\"),\"\")","v":68},{"$f":"IF(I$22<>\"\",IF(SUM(I25:INDIRECT(I138))>=0,SUM(I25:INDIRECT(I138)),\"\"),\"\")","v":89.5},{"$f":"IF(J$22<>\"\",IF(SUM(J25:INDIRECT(J138))>=0,SUM(J25:INDIRECT(J138)),\"\"),\"\")","v":127.5},{"$f":"IF(K$22<>\"\",IF(SUM(K25:INDIRECT(K138))>=0,SUM(K25:INDIRECT(K138)),\"\"),\"\")","v":154},{"$f":"IF(L$22<>\"\",IF(SUM(L25:INDIRECT(L138))>=0,SUM(L25:INDIRECT(L138)),\"\"),\"\")","v":482},{"$f":"IF(M$22<>\"\",IF(SUM(M25:INDIRECT(M138))>=0,SUM(M25:INDIRECT(M138)),\"\"),\"\")","v":72},{"$f":"IF(N$22<>\"\",IF(SUM(N25:INDIRECT(N138))>=0,SUM(N25:INDIRECT(N138)),\"\"),\"\")","v":68.5},{"$f":"IF(O$22<>\"\",IF(SUM(O25:INDIRECT(O138))>=0,SUM(O25:INDIRECT(O138)),\"\"),\"\")","v":261},{"$f":"IF(P$22<>\"\",IF(SUM(P25:INDIRECT(P138))>=0,SUM(P25:INDIRECT(P138)),\"\"),\"\")","v":182.5},{"$f":"IF(Q$22<>\"\",IF(SUM(Q25:INDIRECT(Q138))>=0,SUM(Q25:INDIRECT(Q138)),\"\"),\"\")","v":179}]
["No. of Students who attended the Question",null,null,{"$f":"IF(D$22<>\"\",IF(COUNT(D25:INDIRECT(D138))>=0,COUNT(D25:INDIRECT(D138)),\"\"),\"\")","v":38},{"$f":"IF(E$22<>\"\",IF(COUNT(E25:INDIRECT(E138))>=0,COUNT(E25:INDIRECT(E138)),\"\"),\"\")","v":52},{"$f":"IF(F$22<>\"\",IF(COUNT(F25:INDIRECT(F138))>=0,COUNT(F25:INDIRECT(F138)),\"\"),\"\")","v":31},{"$f":"IF(G$22<>\"\",IF(COUNT(G25:INDIRECT(G138))>=0,COUNT(G25:INDIRECT(G138)),\"\"),\"\")","v":35},{"$f":"IF(H$22<>\"\",IF(COUNT(H25:INDIRECT(H138))>=0,COUNT(H25:INDIRECT(H138)),\"\"),\"\")","v":46},{"$f":"IF(I$22<>\"\",IF(COUNT(I25:INDIRECT(I138))>=0,COUNT(I25:INDIRECT(I138)),\"\"),\"\")","v":51},{"$f":"IF(J$22<>\"\",IF(COUNT(J25:INDIRECT(J138))>=0,COUNT(J25:INDIRECT(J138)),\"\"),\"\")","v":51},{"$f":"IF(K$22<>\"\",IF(COUNT(K25:INDIRECT(K138))>=0,COUNT(K25:INDIRECT(K138)),\"\"),\"\")","v":73},{"$f":"IF(L$22<>\"\",IF(COUNT(L25:INDIRECT(L138))>=0,COUNT(L25:INDIRECT(L138)),\"\"),\"\")","v":77},{"$f":"IF(M$22<>\"\",IF(COUNT(M25:INDIRECT(M138))>=0,COUNT(M25:INDIRECT(M138)),\"\"),\"\")","v":25},{"$f":"IF(N$22<>\"\",IF(COUNT(N25:INDIRECT(N138))>=0,COUNT(N25:INDIRECT(N138)),\"\"),\"\")","v":23},{"$f":"IF(O$22<>\"\",IF(COUNT(O25:INDIRECT(O138))>=0,COUNT(O25:INDIRECT(O138)),\"\"),\"\")","v":54},{"$f":"IF(P$22<>\"\",IF(COUNT(P25:INDIRECT(P138))>=0,COUNT(P25:INDIRECT(P138)),\"\"),\"\")","v":60},{"$f":"IF(Q$22<>\"\",IF(COUNT(Q25:INDIRECT(Q138))>=0,COUNT(Q25:INDIRECT(Q138)),\"\"),\"\")","v":61}]
["Difficulty Level marks of the Question",null,null,{"$f":"IF(D21*D22/100=0,\"\",D21*D22/100)","v":3},3,3,3,{"$f":"IF(H21*H22/100=0,\"\",H21*H22/100)","v":3},{"$f":"IF(I21*I22/100=0,\"\",I21*I22/100)","v":3},{"$f":"IF(J21*J22/100=0,\"\",J21*J22/100)","v":3},{"$f":"IF(K21*K22/100=0,\"\",K21*K22/100)","v":3},{"$f":"IF(L21*L22/100=0,\"\",L21*L22/100)","v":3},{"$f":"IF(M21*M22/100=0,\"\",M21*M22/100)","v":3},{"$f":"IF(N21*N22/100=0,\"\",N21*N22/100)","v":3},{"$f":"IF(O21*O22/100=0,\"\",O21*O22/100)","v":3},{"$f":"IF(P21*P22/100=0,\"\",P21*P22/100)","v":3},3]
["No. of Students who scored above the Difficulty Level",null,null,{"$f":"IF(COUNTIF(D25:INDIRECT(D138),\">=\"&D120)=0,\"\",COUNTIF(D25:INDIRECT(D138),\">=\"&D120))","v":16},{"$f":"IF(COUNTIF(E25:INDIRECT(E138),\">=\"&E120)=0,\"\",COUNTIF(E25:INDIRECT(E138),\">=\"&E120))","v":26},{"$f":"IF(COUNTIF(F25:INDIRECT(F138),\">=\"&F120)=0,\"\",COUNTIF(F25:INDIRECT(F138),\">=\"&F120))","v":4},{"$f":"IF(COUNTIF(G25:INDIRECT(G138),\">=\"&G120)=0,\"\",COUNTIF(G25:INDIRECT(G138),\">=\"&G120))","v":25},{"$f":"IF(COUNTIF(H25:INDIRECT(H138),\">=\"&H120)=0,\"\",COUNTIF(H25:INDIRECT(H138),\">=\"&H120))","v":""},{"$f":"IF(COUNTIF(I25:INDIRECT(I138),\">=\"&I120)=0,\"\",COUNTIF(I25:INDIRECT(I138),\">=\"&I120))","v":4},{"$f":"IF(COUNTIF(J25:INDIRECT(J138),\">=\"&J120)=0,\"\",COUNTIF(J25:INDIRECT(J138),\">=\"&J120))","v":36},{"$f":"IF(COUNTIF(K25:INDIRECT(K138),\">=\"&K120)=0,\"\",COUNTIF(K25:INDIRECT(K138),\">=\"&K120))","v":32},{"$f":"IF(COUNTIF(L25:INDIRECT(L138),\">=\"&L120)=0,\"\",COUNTIF(L25:INDIRECT(L138),\">=\"&L120))","v":73},{"$f":"IF(COUNTIF(M25:INDIRECT(M138),\">=\"&M120)=0,\"\",COUNTIF(M25:INDIRECT(M138),\">=\"&M120))","v":14},{"$f":"IF(COUNTIF(N25:INDIRECT(N138),\">=\"&N120)=0,\"\",COUNTIF(N25:INDIRECT(N138),\">=\"&N120))","v":18},{"$f":"IF(COUNTIF(O25:INDIRECT(O138),\">=\"&O120)=0,\"\",COUNTIF(O25:INDIRECT(O138),\">=\"&O120))","v":39},{"$f":"IF(COUNTIF(P25:INDIRECT(P138),\">=\"&P120)=0,\"\",COUNTIF(P25:INDIRECT(P138),\">=\"&P120))","v":34},{"$f":"IF(COUNTIF(Q25:INDIRECT(Q138),\">=\"&Q120)=0,\"\",COUNTIF(Q25:INDIRECT(Q138),\">=\"&Q120))","v":38}]
["% of Students who scored above the Difficulty Level",null,null,{"$f":"IFERROR(ROUND(D121/D119*100,2),\"\")","v":42.11},50,12.9,71.430000000000007,"",7.84,70.59,43.84,94.81,56,78.260000000000005,72.22,56.67,62.3]
[null,null,null,{"$f":"IF(D122=\"\",0,IF(D122>=80,3,IF(D122>=70,2,IF(D122>=60,1,0))))","v":0},0,0,2,0,0,2,0,3,0,2,2,0,1,"Marks",null,null,null,"T_Marks","S_Marks","Students","Level","Above","Above %","Attainment"]
[null,{"$f":"IF(Data_Sheet!A119<>\"\",\"Total Attainment level for \"&Data_Sheet!A119&\" :\",\"\")","v":"Total Attainment level for CO1 :"},{"$f":"IF(Data_Sheet!A119<>\"\",U124,\"\")","v":""},{"$f":"IFERROR((IF(ISNUMBER(SEARCH(\"1\", D$19)),D$21,\"0\")),\"0\")*D123","v":0},0,0,0,0,0,0,0,0,0,0,0,0,0,{"$f":"R141","v":0},null,null,{"$f":"IF(R124=0,\"\",ROUND(SUM(D124:Q124)/R124,2))","v":""},{"$f":"R141","v":0},{"$f":"R148","v":0},{"$f":"R155","v":0},{"$f":"R162","v":0},{"$f":"R169","v":0},{"$f":"IFERROR(ROUND(Z124/X124*100,2),\"\")","v":""},{"$f":"IF(AA124=\"\",\"\",IF(AA124>=80,3,IF(AA124>=70,2,IF(AA124>=60,1,0))))","v":""}]
[null,{"$f":"IF(Data_Sheet!A120<>\"\",\"Total Attainment level for \"&Data_Sheet!A120&\" :\",\"\")","v":"Total Attainment level for CO2 :"},{"$f":"IF(Data_Sheet!A120<>\"\",U125,\"\")","v":""},{"$f":"IFERROR((IF(ISNUMBER(SEARCH(\"2\", D$19)),D$21,\"0\")),\"0\")*D123","v":0},0,0,0,0,0,0,0,0,0,0,0,0,0,0,null,null,"",0,0,0,0,0,"",""]
[null,{"$f":"IF(Data_Sheet!A121<>\"\",\"Total Attainment level for \"&Data_Sheet!A121&\" :\",\"\")","v":"Total Attainment level for CO3 :"},{"$f":"IF(Data_Sheet!A121<>\"\",U126,\"\")","v":0.82},{"$f":"IFERROR((IF(ISNUMBER(SEARCH(\"3\", D$19)),D$21,\"0\")),\"0\")*D123","v":0},0,0,0,0,0,10,0,15,0,10,10,0,0,55,null,null,0.82,55,1702,550,33,292,53.09,0]
[null,{"$f":"IF(Data_Sheet!A122<>\"\",\"Total Attainment level for \"&Data_Sheet!A122&\" :\",\"\")","v":"Total Attainment level for CO4 :"},{"$f":"IF(Data_Sheet!A122<>\"\",U127,\"\")","v":1},{"$f":"IFERROR((IF(ISNUMBER(SEARCH(\"4\", D$19)),D$21,\"0\")),\"0\")*D123","v":0},0,0,10,0,0,0,0,0,0,0,0,0,0,10,null,null,1,10,141,66,6,29,43.94,0]
[null,{"$f":"IF(Data_Sheet!A123<>\"\",\"Total Attainment level for \"&Data_Sheet!A123&\" :\",\"\")","v":"Total Attainment level for CO5 :"},{"$f":"IF(Data_Sheet!A123<>\"\",U128,\"\")","v":1},{"$f":"IFERROR((IF(ISNUMBER(SEARCH(\"5\", D$19)),D$21,\"0\")),\"0\")*D123","v":0},0,0,0,0,0,0,0,0,0,0,0,0,5,5,null,null,1,5,179,61,3,38,62.3,1]
[null,{"$f":"IF(Data_Sheet!A124<>\"\",\"Total Attainment level for \"&Data_Sheet!A124&\" :\",\"\")","v":"Total Attainment level for CO6 :"},{"$f":"IF(Data_Sheet!A124<>\"\",U129,\"\")","v":""},{"$f":"IFERROR((IF(ISNUMBER(SEARCH(\"6\", D$19)),D$21,\"0\")),\"0\")*D123","v":0},0,0,0,0,0,0,0,0,0,0,0,0,0,0,null,null,"",0,0,0,0,0,"",""]
[]
[{"$f":"Data_Sheet!A127","v":"Attainment Level 1: 60% students scoring more than 60% of the Total Marks"}]
[{"$f":"Data_Sheet!A128","v":"Attainment Level 2: 70% students scoring more than 60% of the Total Marks"}]
[{"$f":"Data_Sheet!A129","v":"Attainment Level 3: 80% students scoring more than 60% of the Total Marks"}]
[]
[null,{"$f":"Data_Sheet!B10","v":"Name of Faculty : "},{"$f":"Data_Sheet!B11","v":"Namitha T N"}]
[null,{"$f":"Data_Sheet!B136","v":"Dated Signature :  "}]
[]
[null,"Last Row Count",{"$f":"ROW(A118)-2","v":116},{"$f":"SUBSTITUTE(ADDRESS(1,COLUMN(D1),2),\"1\",\"\")&$C$138","v":"D$116"},{"$f":"\"E\"&$C$138","v":"E116"},{"$f":"SUBSTITUTE(ADDRESS(1,COLUMN(F1),2),\"1\",\"\")&$C$138","v":"F$116"},"G$116","H$116","I$116","J$116","K$116","L$116","M$116","N$116","O$116","P$116","Q$116"]
[]
[]
[null,null,"CO1",{"$f":"IFERROR((IF(ISNUMBER(SEARCH(\"1\", D$19)),D$21,\"0\")),\"0\")","v":"0"},{"$f":"IFERROR((IF(ISNUMBER(SEARCH(\"1\", E$19)),E$21,\"0\")),\"0\")","v":"0"},{"$f":"IFERROR((IF(ISNUMBER(SEARCH(\"1\", F$19)),F$21,\"0\")),\"0\")","v":"0"},"0",{"$f":"IFERROR((IF(ISNUMBER(SEARCH(\"1\", H$19)),H$21,\"0\")),\"0\")","v":"0"},"0","0","0","0","0","0","0","0","0",{"$f":"IFERROR(SUM($D141:INDIRECT($U141)),\"0\")","v":0},null,null,{"$f":"SUBSTITUTE(ADDRESS(1,W141,4),1,\"\")&ROW($R141)","v":"Q141"},{"$f":"COUNTIF($D$19:INDIRECT($X141),\"*1*\")","v":0},{"$f":"COLUMN($R$18)-1","v":17},{"$f":"SUBSTITUTE(ADDRESS(1,W141,4),1,\"\")&ROW($R$18)+1","v":"Q19"},"Total Marks"]
[null,null,"CO2",{"$f":"IFERROR((IF(ISNUMBER(SEARCH(\"2\", D$19)),D$21,\"0\")),\"0\")","v":"0"},{"$f":"IFERROR((IF(ISNUMBER(SEARCH(\"2\", E$19)),E$21,\"0\")),\"0\")","v":"0"},{"$f":"IFERROR((IF(ISNUMBER(SEARCH(\"2\", F$19)),F$21,\"0\")),\"0\")","v":"0"},"0",{"$f":"IFERROR((IF(ISNUMBER(SEARCH(\"2\", H$19)),H$21,\"0\")),\"0\")","v":"0"},"0","0","0","0","0","0","0","0","0",{"$f":"IFERROR(SUM($D142:INDIRECT($U142)),\"0\")","v":0},null,null,"Q142",{"$f":"COUNTIF($D$19:INDIRECT($X142),\"*2*\")","v":0},{"$f":"COLUMN($R$18)-1","v":17},{"$f":"SUBSTITUTE(ADDRESS(1,W142,4),1,\"\")&ROW($R$18)+1","v":"Q19"}]
[null,null,"CO3",{"$f":"IFERROR((IF(ISNUMBER(SEARCH(\"3\", D$19)),D$21,\"0\")),\"0\")","v":5},{"$f":"IFERROR((IF(ISNUMBER(SEARCH(\"3\", E$19)),E$21,\"0\")),\"0\")","v":5},{"$f":"IFERROR((IF(ISNUMBER(SEARCH(\"3\", F$19)),F$21,\"0\")),\"0\")","v":"0"},"0",{"$f":"IFERROR((IF(ISNUMBER(SEARCH(\"3\", H$19)),H$21,\"0\")),\"0\")","v":5},5,5,5,5,5,5,5,5,"0",{"$f":"IFERROR(SUM($D143:INDIRECT($U143)),\"0\")","v":55},null,null,"Q143",{"$f":"COUNTIF($D$19:INDIRECT($X143),\"*3*\")","v":11},17,"Q19"]
[null,null,"CO4",{"$f":"IFERROR((IF(ISNUMBER(SEARCH(\"4\", D$19)),D$21,\"0\")),\"0\")","v":"0"},{"$f":"IFERROR((IF(ISNUMBER(SEARCH(\"4\", E$19)),E$21,\"0\")),\"0\")","v":"0"},{"$f":"IFERROR((IF(ISNUMBER(SEARCH(\"4\", F$19)),F$21,\"0\")),\"0\")","v":5},5,{"$f":"IFERROR((IF(ISNUMBER(SEARCH(\"4\", H$19)),H$21,\"0\")),\"0\")","v":"0"},"0","0","0","0","0","0","0","0","0",{"$f":"IFERROR(SUM($D144:INDIRECT($U144)),\"0\")","v":10},null,null,"Q144",{"$f":"COUNTIF($D$19:INDIRECT($X144),\"*4*\")","v":2},17,"Q19"]
[null,null,"CO5",{"$f":"IFERROR((IF(ISNUMBER(SEARCH(\"5\", D$19)),D$21,\"0\")),\"0\")","v":"0"},{"$f":"IFERROR((IF(ISNUMBER(SEARCH(\"5\", E$19)),E$21,\"0\")),\"0\")","v":"0"},{"$f":"IFERROR((IF(ISNUMBER(SEARCH(\"5\", F$19)),F$21,\"0\")),\"0\")","v":"0"},"0",{"$f":"IFERROR((IF(ISNUMBER(SEARCH(\"5\", H$19)),H$21,\"0\")),\"0\")","v":"0"},"0","0","0","0","0","0","0","0",5,{"$f":"IFERROR(SUM($D145:INDIRECT($U145)),\"0\")","v":5},null,null,"Q145",{"$f":"COUNTIF($D$19:INDIRECT($X145),\"*5*\")","v":1},17,"Q19"]
[null,null,"CO6",{"$f":"IFERROR((IF(ISNUMBER(SEARCH(\"6\", D$19)),D$21,\"0\")),\"0\")","v":"0"},{"$f":"IFERROR((IF(ISNUMBER(SEARCH(\"6\", E$19)),E$21,\"0\")),\"0\")","v":"0"},{"$f":"IFERROR((IF(ISNUMBER(SEARCH(\"6\", F$19)),F$21,\"0\")),\"0\")","v":"0"},"0",{"$f":"IFERROR((IF(ISNUMBER(SEARCH(\"6\", H$19)),H$21,\"0\")),\"0\")","v":"0"},"0","0","0","0","0","0","0","0","0",{"$f":"IFERROR(SUM($D146:INDIRECT($U146)),\"0\")","v":0},null,null,"Q146",{"$f":"COUNTIF($D$19:INDIRECT($X146),\"*6*\")","v":0},17,"Q19"]
[]
[null,null,"CO1",{"$f":"IFERROR((IF(ISNUMBER(SEARCH(\"1\", D$19)),D$118,\"0\")),\"0\")","v":"0"},{"$f":"IFERROR((IF(ISNUMBER(SEARCH(\"1\", E$19)),E$118,\"0\")),\"0\")","v":"0"},"0","0",{"$f":"IFERROR((IF(ISNUMBER(SEARCH(\"1\", H$19)),H$118,\"0\")),\"0\")","v":"0"},"0","0","0","0","0","0","0","0","0",{"$f":"IFERROR(SUM($D148:INDIRECT($U148)),\"0\")","v":0},null,null,{"$f":"SUBSTITUTE(ADDRESS(1,W148,4),1,\"\")&ROW($R148)","v":"Q148"},{"$f":"COUNTIF($D$19:INDIRECT($X148),\"*1*\")","v":0},{"$f":"COLUMN($R$18)-1","v":17},{"$f":"SUBSTITUTE(ADDRESS(1,W148,4),1,\"\")&ROW($R$18)+1","v":"Q19"},"Total Marks Scored"]
[null,null,"CO2",{"$f":"IFERROR((IF(ISNUMBER(SEARCH(\"2\", D$19)),D$118,\"0\")),\"0\")","v":"0"},{"$f":"IFERROR((IF(ISNUMBER(SEARCH(\"2\", E$19)),E$118,\"0\")),\"0\")","v":"0"},"0","0",{"$f":"IFERROR((IF(ISNUMBER(SEARCH(\"2\", H$19)),H$118,\"0\")),\"0\")","v":"0"},"0","0","0","0","0","0","0","0","0",{"$f":"IFERROR(SUM($D149:INDIRECT($U149)),\"0\")","v":0},null,null,"Q149",{"$f":"COUNTIF($D$19:INDIRECT($X149),\"*2*\")","v":0},{"$f":"COLUMN($R$18)-1","v":17},{"$f":"SUBSTITUTE(ADDRESS(1,W149,4),1,\"\")&ROW($R$18)+1","v":"Q19"}]
[null,null,"CO3",{"$f":"IFERROR((IF(ISNUMBER(SEARCH(\"3\", D$19)),D$118,\"0\")),\"0\")","v":80.5},{"$f":"IFERROR((IF(ISNUMBER(SEARCH(\"3\", E$19)),E$118,\"0\")),\"0\")","v":116.5},{"$f":"IFERROR((IF(ISNUMBER(SEARCH(\"3\", F$19)),F$118,\"0\")),\"0\")","v":"0"},"0",{"$f":"IFERROR((IF(ISNUMBER(SEARCH(\"3\", H$19)),H$118,\"0\")),\"0\")","v":68},89.5,127.5,154,482,72,68.5,261,182.5,"0",{"$f":"IFERROR(SUM($D150:INDIRECT($U150)),\"0\")","v":1702},null,null,"Q150",{"$f":"COUNTIF($D$19:INDIRECT($X150),\"*3*\")","v":11},17,"Q19"]
[null,null,"CO4",{"$f":"IFERROR((IF(ISNUMBER(SEARCH(\"4\", D$19)),D$118,\"0\")),\"0\")","v":"0"},{"$f":"IFERROR((IF(ISNUMBER(SEARCH(\"4\", E$19)),E$118,\"0\")),\"0\")","v":"0"},{"$f":"IFERROR((IF(ISNUMBER(SEARCH(\"4\", F$19)),F$118,\"0\")),\"0\")","v":52.5},88.5,"0","0","0","0","0","0","0","0","0","0",{"$f":"IFERROR(SUM($D151:INDIRECT($U151)),\"0\")","v":141},null,null,"Q151",{"$f":"COUNTIF($D$19:INDIRECT($X151),\"*4*\")","v":2},17,"Q19"]
[null,null,"CO5",{"$f":"IFERROR((IF(ISNUMBER(SEARCH(\"5\", D$19)),D$118,\"0\")),\"0\")","v":"0"},{"$f":"IFERROR((IF(ISNUMBER(SEARCH(\"5\", E$19)),E$118,\"0\")),\"0\")","v":"0"},"0","0",{"$f":"IFERROR((IF(ISNUMBER(SEARCH(\"5\", H$19)),H$118,\"0\")),\"0\")","v":"0"},"0","0","0","0","0","0","0","0",179,{"$f":"IFERROR(SUM($D152:INDIRECT($U152)),\"0\")","v":179},null,null,"Q152",{"$f":"COUNTIF($D$19:INDIRECT($X152),\"*5*\")","v":1},17,"Q19"]
[null,null,"CO6",{"$f":"IFERROR((IF(ISNUMBER(SEARCH(\"6\", D$19)),D$118,\"0\")),\"0\")","v":"0"},{"$f":"IFERROR((IF(ISNUMBER(SEARCH(\"6\", E$19)),E$118,\"0\")),\"0\")","v":"0"},"0","0",{"$f":"IFERROR((IF(ISNUMBER(SEARCH(\"6\", H$19)),H$118,\"0\")),\"0\")","v":"0"},"0","0","0","0","0","0","0","0","0",{"$f":"IFERROR(SUM($D153:INDIRECT($U153)),\"0\")","v":0},null,null,"Q153",{"$f":"COUNTIF($D$19:INDIRECT($X153),\"*6*\")","v":0},17,"Q19"]
[]
[null,null,"CO1",{"$f":"IFERROR((IF(ISNUMBER(SEARCH(\"1\", D$19)),D$119,\"0\")),\"0\")","v":"0"},{"$f":"IFERROR((IF(ISNUMBER(SEARCH(\"1\", E$19)),E$119,\"0\")),\"0\")","v":"0"},"0","0",{"$f":"IFERROR((IF(ISNUMBER(SEARCH(\"1\", H$19)),H$119,\"0\")),\"0\")","v":"0"},"0","0","0","0","0","0","0","0","0",{"$f":"IFERROR(SUM($D155:INDIRECT($U155)),\"0\")","v":0},null,null,{"$f":"SUBSTITUTE(ADDRESS(1,W155,4),1,\"\")&ROW($R155)","v":"Q155"},{"$f":"COUNTIF($D$19:INDIRECT($X155),\"*1*\")","v":0},{"$f":"COLUMN($R$18)-1","v":17},{"$f":"SUBSTITUTE(ADDRESS(1,W155,4),1,\"\")&ROW($R$18)+1","v":"Q19"},"No of Studdents Attended"]
[null,null,"CO2",{"$f":"IFERROR((IF(ISNUMBER(SEARCH(\"2\", D$19)),D$119,\"0\")),\"0\")","v":"0"},{"$f":"IFERROR((IF(ISNUMBER(SEARCH(\"2\", E$19)),E$119,\"0\")),\"0\")","v":"0"},"0","0",{"$f":"IFERROR((IF(ISNUMBER(SEARCH(\"2\", H$19)),H$119,\"0\")),\"0\")","v":"0"},"0","0","0","0","0","0","0","0","0",{"$f":"IFERROR(SUM($D156:INDIRECT($U156)),\"0\")","v":0},null,null,"Q156",{"$f":"COUNTIF($D$19:INDIRECT($X156),\"*2*\")","v":0},{"$f":"COLUMN($R$18)-1","v":17},{"$f":"SUBSTITUTE(ADDRESS(1,W156,4),1,\"\")&ROW($R$18)+1","v":"Q19"}]
[null,null,"CO3",{"$f":"IFERROR((IF(ISNUMBER(SEARCH(\"3\", D$19)),D$119,\"0\")),\"0\")","v":38},{"$f":"IFERROR((IF(ISNUMBER(SEARCH(\"3\", E$19)),E$119,\"0\")),\"0\")","v":52},{"$f":"IFERROR((IF(ISNUMBER(SEARCH(\"3\", F$19)),F$119,\"0\")),\"0\")","v":"0"},"0",{"$f":"IFERROR((IF(ISNUMBER(SEARCH(\"3\", H$19)),H$119,\"0\")),\"0\")","v":46},51,51,73,77,25,23,54,60,"0",{"$f":"IFERROR(SUM($D157:INDIRECT($U157)),\"0\")","v":550},null,null,"Q157",{"$f":"COUNTIF($D$19:INDIRECT($X157),\"*3*\")","v":11},17,"Q19"]
[null,null,"CO4",{"$f":"IFERROR((IF(ISNUMBER(SEARCH(\"4\", D$19)),D$119,\"0\")),\"0\")","v":"0"},{"$f":"IFERROR((IF(ISNUMBER(SEARCH(\"4\", E$19)),E$119,\"0\")),\"0\")","v":"0"},{"$f":"IFERROR((IF(ISNUMBER(SEARCH(\"4\", F$19)),F$119,\"0\")),\"0\")","v":31},35,"0","0","0","0","0","0","0","0","0","0",{"$f":"IFERROR(SUM($D158:INDIRECT($U158)),\"0\")","v":66},null,null,"Q158",{"$f":"COUNTIF($D$19:INDIRECT($X158),\"*4*\")","v":2},17,"Q19"]
[null,null,"CO5",{"$f":"IFERROR((IF(ISNUMBER(SEARCH(\"5\", D$19)),D$119,\"0\")),\"0\")","v":"0"},{"$f":"IFERROR((IF(ISNUMBER(SEARCH(\"5\", E$19)),E$119,\"0\")),\"0\")","v":"0"},"0","0",{"$f":"IFERROR((IF(ISNUMBER(SEARCH(\"5\", H$19)),H$119,\"0\")),\"0\")","v":"0"},"0","0","0","0","0","0","0","0",61,{"$f":"IFERROR(SUM($D159:INDIRECT($U159)),\"0\")","v":61},null,null,"Q159",{"$f":"COUNTIF($D$19:INDIRECT($X159),\"*5*\")","v":1},17,"Q19"]
[null,null,"CO6",{"$f":"IFERROR((IF(ISNUMBER(SEARCH(\"6\", D$19)),D$119,\"0\")),\"0\")","v":"0"},{"$f":"IFERROR((IF(ISNUMBER(SEARCH(\"6\", E$19)),E$119,\"0\")),\"0\")","v":"0"},"0","0",{"$f":"IFERROR((IF(ISNUMBER(SEARCH(\"6\", H$19)),H$119,\"0\")),\"0\")","v":"0"},"0","0","0","0","0","0","0","0","0",{"$f":"IFERROR(SUM($D160:INDIRECT($U160)),\"0\")","v":0},null,null,"Q160",{"$f":"COUNTIF($D$19:INDIRECT($X160),\"*6*\")","v":0},17,"Q19"]
[]
[null,null,"CO1",{"$f":"IFERROR((IF(ISNUMBER(SEARCH(\"1\", D$19)),D$120,\"0\")),\"0\")","v":"0"},{"$f":"IFERROR((IF(ISNUMBER(SEARCH(\"1\", E$19)),E$120,\"0\")),\"0\")","v":"0"},"0","0",{"$f":"IFERROR((IF(ISNUMBER(SEARCH(\"1\", H$19)),H$120,\"0\")),\"0\")","v":"0"},"0","0","0","0","0","0","0","0","0",{"$f":"IFERROR(SUM($D162:INDIRECT($U162)),\"0\")","v":0},null,null,{"$f":"SUBSTITUTE(ADDRESS(1,W162,4),1,\"\")&ROW($R162)","v":"Q162"},{"$f":"COUNTIF($D$19:INDIRECT($X162),\"*1*\")","v":0},{"$f":"COLUMN($R$18)-1","v":17},{"$f":"SUBSTITUTE(ADDRESS(1,W162,4),1,\"\")&ROW($R$18)+1","v":"Q19"},"Difficulty Level"]
[null,null,"CO2",{"$f":"IFERROR((IF(ISNUMBER(SEARCH(\"2\", D$19)),D$120,\"0\")),\"0\")","v":"0"},{"$f":"IFERROR((IF(ISNUMBER(SEARCH(\"2\", E$19)),E$120,\"0\")),\"0\")","v":"0"},"0","0",{"$f":"IFERROR((IF(ISNUMBER(SEARCH(\"2\", H$19)),H$120,\"0\")),\"0\")","v":"0"},"0","0","0","0","0","0","0","0","0",{"$f":"IFERROR(SUM($D163:INDIRECT($U163)),\"0\")","v":0},null,null,"Q163",{"$f":"COUNTIF($D$19:INDIRECT($X163),\"*2*\")","v":0},{"$f":"COLUMN($R$18)-1","v":17},{"$f":"SUBSTITUTE(ADDRESS(1,W163,4),1,\"\")&ROW($R$18)+1","v":"Q19"}]
[null,null,"CO3",{"$f":"IFERROR((IF(ISNUMBER(SEARCH(\"3\", D$19)),D$120,\"0\")),\"0\")","v":3},{"$f":"IFERROR((IF(ISNUMBER(SEARCH(\"3\", E$19)),E$120,\"0\")),\"0\")","v":3},"0","0",{"$f":"IFERROR((IF(ISNUMBER(SEARCH(\"3\", H$19)),H$120,\"0\")),\"0\")","v":3},3,3,3,3,3,3,3,3,"0",{"$f":"IFERROR(SUM($D164:INDIRECT($U164)),\"0\")","v":33},null,null,"Q164",{"$f":"COUNTIF($D$19:INDIRECT($X164),\"*3*\")","v":11},17,"Q19"]
[null,null,"CO4",{"$f":"IFERROR((IF(ISNUMBER(SEARCH(\"4\", D$19)),D$120,\"0\")),\"0\")","v":"0"},{"$f":"IFERROR((IF(ISNUMBER(SEARCH(\"4\", E$19)),E$120,\"0\")),\"0\")","v":"0"},3,3,{"$f":"IFERROR((IF(ISNUMBER(SEARCH(\"4\", H$19)),H$120,\"0\")),\"0\")","v":"0"},"0","0","0","0","0","0","0","0","0",{"$f":"IFERROR(SUM($D165:INDIRECT($U165)),\"0\")","v":6},null,null,"Q165",{"$f":"COUNTIF($D$19:INDIRECT($X165),\"*4*\")","v":2},17,"Q19"]
[null,null,"CO5",{"$f":"IFERROR((IF(ISNUMBER(SEARCH(\"5\", D$19)),D$120,\"0\")),\"0\")","v":"0"},{"$f":"IFERROR((IF(ISNUMBER(SEARCH(\"5\", E$19)),E$120,\"0\")),\"0\")","v":"0"},"0","0",{"$f":"IFERROR((IF(ISNUMBER(SEARCH(\"5\", H$19)),H$120,\"0\")),\"0\")","v":"0"},"0","0","0","0","0","0","0","0",3,{"$f":"IFERROR(SUM($D166:INDIRECT($U166)),\"0\")","v":3},null,null,"Q166",{"$f":"COUNTIF($D$19:INDIRECT($X166),\"*5*\")","v":1},17,"Q19"]
[null,null,"CO6",{"$f":"IFERROR((IF(ISNUMBER(SEARCH(\"6\", D$19)),D$120,\"0\")),\"0\")","v":"0"},{"$f":"IFERROR((IF(ISNUMBER(SEARCH(\"6\", E$19)),E$120,\"0\")),\"0\")","v":"0"},"0","0",{"$f":"IFERROR((IF(ISNUMBER(SEARCH(\"6\", H$19)),H$120,\"0\")),\"0\")","v":"0"},"0","0","0","0","0","0","0","0","0",{"$f":"IFERROR(SUM($D167:INDIRECT($U167)),\"0\")","v":0},null,null,"Q167",{"$f":"COUNTIF($D$19:INDIRECT($X167),\"*6*\")","v":0},17,"Q19"]
[]
[null,null,"CO1",{"$f":"IFERROR((IF(ISNUMBER(SEARCH(\"1\", D$19)),D$121,\"0\")),\"0\")","v":"0"},{"$f":"IFERROR((IF(ISNUMBER(SEARCH(\"1\", E$19)),E$121,\"0\")),\"0\")","v":"0"},"0","0",{"$f":"IFERROR((IF(ISNUMBER(SEARCH(\"1\", H$19)),H$121,\"0\")),\"0\")","v":"0"},"0","0","0","0","0","0","0","0","0",{"$f":"IFERROR(SUM($D169:INDIRECT($U169)),\"0\")","v":0},null,null,{"$f":"SUBSTITUTE(ADDRESS(1,W169,4),1,\"\")&ROW($R169)","v":"Q169"},{"$f":"COUNTIF($D$19:INDIRECT($X169),\"*1*\")","v":0},{"$f":"COLUMN($R$18)-1","v":17},{"$f":"SUBSTITUTE(ADDRESS(1,W169,4),1,\"\")&ROW($R$18)+1","v":"Q19"},"No of Studdents Above Difficulty Level"]
[null,null,"CO2",{"$f":"IFERROR((IF(ISNUMBER(SEARCH(\"2\", D$19)),D$121,\"0\")),\"0\")","v":"0"},{"$f":"IFERROR((IF(ISNUMBER(SEARCH(\"2\", E$19)),E$121,\"0\")),\"0\")","v":"0"},"0","0",{"$f":"IFERROR((IF(ISNUMBER(SEARCH(\"2\", H$19)),H$121,\"0\")),\"0\")","v":"0"},"0","0","0","0","0","0","0","0","0",{"$f":"IFERROR(SUM($D170:INDIRECT($U170)),\"0\")","v":0},null,null,"Q170",{"$f":"COUNTIF($D$19:INDIRECT($X170),\"*2*\")","v":0},{"$f":"COLUMN($R$18)-1","v":17},{"$f":"SUBSTITUTE(ADDRESS(1,W170,4),1,\"\")&ROW($R$18)+1","v":"Q19"}]
[null,null,"CO3",{"$f":"IFERROR((IF(ISNUMBER(SEARCH(\"3\", D$19)),D$121,\"0\")),\"0\")","v":16},{"$f":"IFERROR((IF(ISNUMBER(SEARCH(\"3\", E$19)),E$121,\"0\")),\"0\")","v":26},{"$f":"IFERROR((IF(ISNUMBER(SEARCH(\"3\", F$19)),F$121,\"0\")),\"0\")","v":"0"},"0",{"$f":"IFERROR((IF(ISNUMBER(SEARCH(\"3\", H$19)),H$121,\"0\")),\"0\")","v":""},4,36,32,73,14,18,39,34,"0",{"$f":"IFERROR(SUM($D171:INDIRECT($U171)),\"0\")","v":292},null,null,"Q171",{"$f":"COUNTIF($D$19:INDIRECT($X171),\"*3*\")","v":11},17,"Q19"]
[null,null,"CO4",{"$f":"IFERROR((IF(ISNUMBER(SEARCH(\"4\", D$19)),D$121,\"0\")),\"0\")","v":"0"},{"$f":"IFERROR((IF(ISNUMBER(SEARCH(\"4\", E$19)),E$121,\"0\")),\"0\")","v":"0"},{"$f":"IFERROR((IF(ISNUMBER(SEARCH(\"4\", F$19)),F$121,\"0\")),\"0\")","v":4},25,"0","0","0","0","0","0","0","0","0","0",{"$f":"IFERROR(SUM($D172:INDIRECT($U172)),\"0\")","v":29},null,null,"Q172",{"$f":"COUNTIF($D$19:INDIRECT($X172),\"*4*\")","v":2},17,"Q19"]
[null,null,"CO5",{"$f":"IFERROR((IF(ISNUMBER(SEARCH(\"5\", D$19)),D$121,\"0\")),\"0\")","v":"0"},{"$f":"IFERROR((IF(ISNUMBER(SEARCH(\"5\", E$19)),E$121,\"0\")),\"0\")","v":"0"},"0","0",{"$f":"IFERROR((IF(ISNUMBER(SEARCH(\"5\", H$19)),H$121,\"0\")),\"0\")","v":"0"},"0","0","0","0","0","0","0","0",38,{"$f":"IFERROR(SUM($D173:INDIRECT($U173)),\"0\")","v":38},null,null,"Q173",{"$f":"COUNTIF($D$19:INDIRECT($X173),\"*5*\")","v":1},17,"Q19"]
[null,null,"CO6",{"$f":"IFERROR((IF(ISNUMBER(SEARCH(\"6\", D$19)),D$121,\"0\")),\"0\")","v":"0"},{"$f":"IFERROR((IF(ISNUMBER(SEARCH(\"6\", E$19)),E$121,\"0\")),\"0\")","v":"0"},"0","0",{"$f":"IFERROR((IF(ISNUMBER(SEARCH(\"6\", H$19)),H$121,\"0\")),\"0\")","v":"0"},"0","0","0","0","0","0","0","0","0",{"$f":"IFERROR(SUM($D174:INDIRECT($U174)),\"0\")","v":0},null,null,"Q174",{"$f":"COUNTIF($D$19:INDIRECT($X174),\"*6*\")","v":0},17,"Q19"]
[]
[null,null,1,{"$f":"IFERROR((IF(ISNUMBER(SEARCH(\"1\", D$20)),D$21/IF(LEN(D20)=16,6,IF(LEN(D20)=13,5,IF(LEN(D20)=10,4,IF(LEN(D20)=7,3,IF(LEN(D20)=4,2,1))))),\"0\")),\"0\")","v":"0"},"0","0","0","0","0","0","0","0","0","0","0","0","0",{"$f":"IFERROR(SUM($D176:INDIRECT($U176)),\"0\")","v":0},null,null,{"$f":"SUBSTITUTE(ADDRESS(1,W176,4),1,\"\")&ROW($R176)","v":"Q176"},{"$f":"COUNTIF($D$20:INDIRECT($X176),\"1\")","v":0},{"$f":"COLUMN($R$18)-1","v":17},{"$f":"SUBSTITUTE(ADDRESS(1,W176,4),1,\"\")&ROW($R$19)+1","v":"Q20"}]
[null,null,2,{"$f":"IFERROR((IF(ISNUMBER(SEARCH(\"2\", D$20)),D$21/IF(LEN(D20)=16,6,IF(LEN(D20)=13,5,IF(LEN(D20)=10,4,IF(LEN(D20)=7,3,IF(LEN(D20)=4,2,1))))),\"0\")),\"0\")","v":"0"},"0","0","0","0","0","0","0","0","0","0","0","0","0",{"$f":"IFERROR(SUM($D177:INDIRECT($U177)),\"0\")","v":0},null,null,{"$f":"SUBSTITUTE(ADDRESS(1,W177,4),1,\"\")&ROW($R177)","v":"Q177"},{"$f":"COUNTIF($D$20:INDIRECT($X177),\"2\")","v":0},17,"Q20"]
[null,null,3,{"$f":"IFERROR((IF(ISNUMBER(SEARCH(\"3\", D$20)),D$21/IF(LEN(D20)=16,6,IF(LEN(D20)=13,5,IF(LEN(D20)=10,4,IF(LEN(D20)=7,3,IF(LEN(D20)=4,2,1))))),\"0\")),\"0\")","v":5},5,5,"0",5,5,5,5,5,5,5,5,5,"0",{"$f":"IFERROR(SUM($D178:INDIRECT($U178)),\"0\")","v":60},null,null,"Q178",{"$f":"COUNTIF($D$20:INDIRECT($X178),\"3\")","v":12},17,"Q20"]
[null,null,4,{"$f":"IFERROR((IF(ISNUMBER(SEARCH(\"4\", D$20)),D$21/IF(LEN(D20)=16,6,IF(LEN(D20)=13,5,IF(LEN(D20)=10,4,IF(LEN(D20)=7,3,IF(LEN(D20)=4,2,1))))),\"0\")),\"0\")","v":"0"},"0","0",5,"0","0","0","0","0","0","0","0","0",5,{"$f":"IFERROR(SUM($D179:INDIRECT($U179)),\"0\")","v":10},null,null,"Q179",{"$f":"COUNTIF($D$20:INDIRECT($X179),\"4\")","v":2},17,"Q20"]
[null,null,5,{"$f":"IFERROR((IF(ISNUMBER(SEARCH(\"5\", D$20)),D$21/IF(LEN(D20)=16,6,IF(LEN(D20)=13,5,IF(LEN(D20)=10,4,IF(LEN(D20)=7,3,IF(LEN(D20)=4,2,1))))),\"0\")),\"0\")","v":"0"},"0","0","0","0","0","0","0","0","0","0","0","0","0",{"$f":"IFERROR(SUM($D180:INDIRECT($U180)),\"0\")","v":0},null,null,"Q180",{"$f":"COUNTIF($D$20:INDIRECT($X180),\"5\")","v":0},17,"Q20"]
[null,null,6,{"$f":"IFERROR((IF(ISNUMBER(SEARCH(\"6\", D$20)),D$21/IF(LEN(D20)=16,6,IF(LEN(D20)=13,5,IF(LEN(D20)=10,4,IF(LEN(D20)=7,3,IF(LEN(D20)=4,2,1))))),\"0\")),\"0\")","v":"0"},"0","0","0","0","0","0","0","0","0","0","0","0","0",{"$f":"IFERROR(SUM($D181:INDIRECT($U181)),\"0\")","v":0},null,null,"Q181",{"$f":"COUNTIF($D$20:INDIRECT($X181),\"6\")","v":0},17,"Q20"]

{"sheet":"T2_Analysis","index":5,"n_rows":131,"n_cols":5,"rows_kept":131,"cut":false,"hidden":false,"merged":[[2,0,2,3],[4,0,4,3],[6,0,6,3],[8,0,8,3]]}
[]
[]
[{"$f":"Data_Sheet!A2","v":"Jyothi Engineering College, Cheruthuruthy"}]
[]
[{"$f":"Data_Sheet!A4","v":"Department of Computer Science Engineering"}]
[]
[{"$f":"'T2'!A11","v":"CO Analysis - Internal Marks : Second Internal Exam                       14-03-18"}]
[]
[{"$f":"Data_Sheet!A17","v":"S3 CS              CS203 Switching Theory and Logic Design               2019-20"}]
[]
[]
[]
[]
[]
[]
[]
[]
[]
[]
[]
[]
[{"$f":"'T1'!A18","v":"Register No."},{"$f":"'T1'!B18","v":"Name of Student"},{"$f":"'T2'!R18","v":"Total Marks (50)"},"Category"]
[]
["Column1","Column2","Column3","Column4"]
[{"$f":"Data_Sheet!A25","v":"JEC18CS001"},{"$f":"Data_Sheet!B25","v":"ABHISHEK KRISHNAN MENON E"},{"$f":"'T2'!R25","v":13},{"$f":"IF(C25=\"A\",\"ABSENT\",IF(C25>='T2'!$F$5*$E$124/100,\"EXCELLENT\",IF(C25>='T2'!$F$5*$E$123/100,\"GOOD\",IF(C25>='T2'!$F$5*$E$122/100,\"AVERAGE\",\"POOR\"))))","v":"POOR"}]
[{"$f":"Data_Sheet!A26","v":"JEC18CS002"},{"$f":"Data_Sheet!B26","v":"ABHISHEK SAJEEVAN"},{"$f":"'T2'!R26","v":0},{"$f":"IF(C26=\"A\",\"ABSENT\",IF(C26>='T2'!$F$5*$E$124/100,\"EXCELLENT\",IF(C26>='T2'!$F$5*$E$123/100,\"GOOD\",IF(C26>='T2'!$F$5*$E$122/100,\"AVERAGE\",\"POOR\"))))","v":"POOR"}]
[{"$f":"Data_Sheet!A27","v":"JEC18CS003"},{"$f":"Data_Sheet!B27","v":"ABHITH SHAJI"},{"$f":"'T2'!R27","v":16},{"$f":"IF(C27=\"A\",\"ABSENT\",IF(C27>='T2'!$F$5*$E$124/100,\"EXCELLENT\",IF(C27>='T2'!$F$5*$E$123/100,\"GOOD\",IF(C27>='T2'!$F$5*$E$122/100,\"AVERAGE\",\"POOR\"))))","v":"POOR"}]
[{"$f":"Data_Sheet!A28","v":"JEC18CS004"},{"$f":"Data_Sheet!B28","v":"ABIN SANTHOSH ALAPATT"},{"$f":"'T2'!R28","v":29},{"$f":"IF(C28=\"A\",\"ABSENT\",IF(C28>='T2'!$F$5*$E$124/100,\"EXCELLENT\",IF(C28>='T2'!$F$5*$E$123/100,\"GOOD\",IF(C28>='T2'!$F$5*$E$122/100,\"AVERAGE\",\"POOR\"))))","v":"AVERAGE"}]
[{"$f":"Data_Sheet!A29","v":"JEC18CS005"},{"$f":"Data_Sheet!B29","v":"ADARSH KUMAR M A"},{"$f":"'T2'!R29","v":26},{"$f":"IF(C29=\"A\",\"ABSENT\",IF(C29>='T2'!$F$5*$E$124/100,\"EXCELLENT\",IF(C29>='T2'!$F$5*$E$123/100,\"GOOD\",IF(C29>='T2'!$F$5*$E$122/100,\"AVERAGE\",\"POOR\"))))","v":"AVERAGE"}]
[{"$f":"Data_Sheet!A30","v":"JEC18CS006"},{"$f":"Data_Sheet!B30","v":"ADHITHYA KRISHNA S"},{"$f":"'T2'!R30","v":25},{"$f":"IF(C30=\"A\",\"ABSENT\",IF(C30>='T2'!$F$5*$E$124/100,\"EXCELLENT\",IF(C30>='T2'!$F$5*$E$123/100,\"GOOD\",IF(C30>='T2'!$F$5*$E$122/100,\"AVERAGE\",\"POOR\"))))","v":"AVERAGE"}]
[{"$f":"Data_Sheet!A31","v":"JEC18CS007"},{"$f":"Data_Sheet!B31","v":"ADITHYA HARIDAS"},{"$f":"'T2'!R31","v":23},{"$f":"IF(C31=\"A\",\"ABSENT\",IF(C31>='T2'!$F$5*$E$124/100,\"EXCELLENT\",IF(C31>='T2'!$F$5*$E$123/100,\"GOOD\",IF(C31>='T2'!$F$5*$E$122/100,\"AVERAGE\",\"POOR\"))))","v":"AVERAGE"}]
[{"$f":"Data_Sheet!A32","v":"JEC18CS008"},{"$f":"Data_Sheet!B32","v":"AJMAL BASHEER"},{"$f":"'T2'!R32","v":0},{"$f":"IF(C32=\"A\",\"ABSENT\",IF(C32>='T2'!$F$5*$E$124/100,\"EXCELLENT\",IF(C32>='T2'!$F$5*$E$123/100,\"GOOD\",IF(C32>='T2'!$F$5*$E$122/100,\"AVERAGE\",\"POOR\"))))","v":"POOR"}]
[{"$f":"Data_Sheet!A33","v":"JEC18CS009"},{"$f":"Data_Sheet!B33","v":"AKASH.V"},{"$f":"'T2'!R33","v":15},{"$f":"IF(C33=\"A\",\"ABSENT\",IF(C33>='T2'!$F$5*$E$124/100,\"EXCELLENT\",IF(C33>='T2'!$F$5*$E$123/100,\"GOOD\",IF(C33>='T2'!$F$5*$E$122/100,\"AVERAGE\",\"POOR\"))))","v":"POOR"}]
[{"$f":"Data_Sheet!A34","v":"JEC18CS010"},{"$f":"Data_Sheet!B34","v":"AKHIL AZEEZ UPPILAMKUNNATH"},{"$f":"'T2'!R34","v":35},{"$f":"IF(C34=\"A\",\"ABSENT\",IF(C34>='T2'!$F$5*$E$124/100,\"EXCELLENT\",IF(C34>='T2'!$F$5*$E$123/100,\"GOOD\",IF(C34>='T2'!$F$5*$E$122/100,\"AVERAGE\",\"POOR\"))))","v":"GOOD"}]
[{"$f":"Data_Sheet!A35","v":"JEC18CS011"},{"$f":"Data_Sheet!B35","v":"AKHIL KRISHNA UK"},{"$f":"'T2'!R35","v":12},{"$f":"IF(C35=\"A\",\"ABSENT\",IF(C35>='T2'!$F$5*$E$124/100,\"EXCELLENT\",IF(C35>='T2'!$F$5*$E$123/100,\"GOOD\",IF(C35>='T2'!$F$5*$E$122/100,\"AVERAGE\",\"POOR\"))))","v":"POOR"}]
[{"$f":"Data_Sheet!A36","v":"JEC18CS012"},{"$f":"Data_Sheet!B36","v":"ALAN GEORGE"},{"$f":"'T2'!R36","v":18},{"$f":"IF(C36=\"A\",\"ABSENT\",IF(C36>='T2'!$F$5*$E$124/100,\"EXCELLENT\",IF(C36>='T2'!$F$5*$E$123/100,\"GOOD\",IF(C36>='T2'!$F$5*$E$122/100,\"AVERAGE\",\"POOR\"))))","v":"POOR"}]
[{"$f":"Data_Sheet!A37","v":"JEC18CS013"},{"$f":"Data_Sheet!B37","v":"ALEN VARGHESE"},{"$f":"'T2'!R37","v":34},{"$f":"IF(C37=\"A\",\"ABSENT\",IF(C37>='T2'!$F$5*$E$124/100,\"EXCELLENT\",IF(C37>='T2'!$F$5*$E$123/100,\"GOOD\",IF(C37>='T2'!$F$5*$E$122/100,\"AVERAGE\",\"POOR\"))))","v":"GOOD"}]
[{"$f":"Data_Sheet!A38","v":"JEC18CS014"},{"$f":"Data_Sheet!B38","v":"AMAL SEBASTIAN"},{"$f":"'T2'!R38","v":45.5},{"$f":"IF(C38=\"A\",\"ABSENT\",IF(C38>='T2'!$F$5*$E$124/100,\"EXCELLENT\",IF(C38>='T2'!$F$5*$E$123/100,\"GOOD\",IF(C38>='T2'!$F$5*$E$122/100,\"AVERAGE\",\"POOR\"))))","v":"EXCELLENT"}]
[{"$f":"Data_Sheet!A39","v":"JEC18CS015"},{"$f":"Data_Sheet!B39","v":"AMAL SONY"},{"$f":"'T2'!R39","v":9},{"$f":"IF(C39=\"A\",\"ABSENT\",IF(C39>='T2'!$F$5*$E$124/100,\"EXCELLENT\",IF(C39>='T2'!$F$5*$E$123/100,\"GOOD\",IF(C39>='T2'!$F$5*$E$122/100,\"AVERAGE\",\"POOR\"))))","v":"POOR"}]
[{"$f":"Data_Sheet!A40","v":"JEC18CS016"},{"$f":"Data_Sheet!B40","v":"ANAGHA WILSON"},{"$f":"'T2'!R40","v":28},{"$f":"IF(C40=\"A\",\"ABSENT\",IF(C40>='T2'!$F$5*$E$124/100,\"EXCELLENT\",IF(C40>='T2'!$F$5*$E$123/100,\"GOOD\",IF(C40>='T2'!$F$5*$E$122/100,\"AVERAGE\",\"POOR\"))))","v":"AVERAGE"}]
[{"$f":"Data_Sheet!A41","v":"JEC18CS017"},{"$f":"Data_Sheet!B41","v":"ANETTE ANTO"},{"$f":"'T2'!R41","v":13},{"$f":"IF(C41=\"A\",\"ABSENT\",IF(C41>='T2'!$F$5*$E$124/100,\"EXCELLENT\",IF(C41>='T2'!$F$5*$E$123/100,\"GOOD\",IF(C41>='T2'!$F$5*$E$122/100,\"AVERAGE\",\"POOR\"))))","v":"POOR"}]
[{"$f":"Data_Sheet!A42","v":"JEC18CS018"},{"$f":"Data_Sheet!B42","v":"ANIT MARY THOMAS"},{"$f":"'T2'!R42","v":35},{"$f":"IF(C42=\"A\",\"ABSENT\",IF(C42>='T2'!$F$5*$E$124/100,\"EXCELLENT\",IF(C42>='T2'!$F$5*$E$123/100,\"GOOD\",IF(C42>='T2'!$F$5*$E$122/100,\"AVERAGE\",\"POOR\"))))","v":"GOOD"}]
[{"$f":"Data_Sheet!A43","v":"JEC18CS020"},{"$f":"Data_Sheet!B43","v":"ANN THERESA SHAJI"},{"$f":"'T2'!R43","v":49},{"$f":"IF(C43=\"A\",\"ABSENT\",IF(C43>='T2'!$F$5*$E$124/100,\"EXCELLENT\",IF(C43>='T2'!$F$5*$E$123/100,\"GOOD\",IF(C43>='T2'!$F$5*$E$122/100,\"AVERAGE\",\"POOR\"))))","v":"EXCELLENT"}]
[{"$f":"Data_Sheet!A44","v":"JEC18CS021"},{"$f":"Data_Sheet!B44","v":"ANTONY ROY"},{"$f":"'T2'!R44","v":6},{"$f":"IF(C44=\"A\",\"ABSENT\",IF(C44>='T2'!$F$5*$E$124/100,\"EXCELLENT\",IF(C44>='T2'!$F$5*$E$123/100,\"GOOD\",IF(C44>='T2'!$F$5*$E$122/100,\"AVERAGE\",\"POOR\"))))","v":"POOR"}]
[{"$f":"Data_Sheet!A45","v":"JEC18CS022"},{"$f":"Data_Sheet!B45","v":"ANUGRAHA C"},{"$f":"'T2'!R45","v":34},{"$f":"IF(C45=\"A\",\"ABSENT\",IF(C45>='T2'!$F$5*$E$124/100,\"EXCELLENT\",IF(C45>='T2'!$F$5*$E$123/100,\"GOOD\",IF(C45>='T2'!$F$5*$E$122/100,\"AVERAGE\",\"POOR\"))))","v":"GOOD"}]
[{"$f":"Data_Sheet!A46","v":"JEC18CS023"},{"$f":"Data_Sheet!B46","v":"APARNA.V"},{"$f":"'T2'!R46","v":34},{"$f":"IF(C46=\"A\",\"ABSENT\",IF(C46>='T2'!$F$5*$E$124/100,\"EXCELLENT\",IF(C46>='T2'!$F$5*$E$123/100,\"GOOD\",IF(C46>='T2'!$F$5*$E$122/100,\"AVERAGE\",\"POOR\"))))","v":"GOOD"}]
[{"$f":"Data_Sheet!A47","v":"JEC18CS024"},{"$f":"Data_Sheet!B47","v":"ARAVIND S KUMAR"},{"$f":"'T2'!R47","v":35},{"$f":"IF(C47=\"A\",\"ABSENT\",IF(C47>='T2'!$F$5*$E$124/100,\"EXCELLENT\",IF(C47>='T2'!$F$5*$E$123/100,\"GOOD\",IF(C47>='T2'!$F$5*$E$122/100,\"AVERAGE\",\"POOR\"))))","v":"GOOD"}]
[{"$f":"Data_Sheet!A48","v":"JEC18CS025"},{"$f":"Data_Sheet!B48","v":"ARJUN VINOD"},{"$f":"'T2'!R48","v":16},{"$f":"IF(C48=\"A\",\"ABSENT\",IF(C48>='T2'!$F$5*$E$124/100,\"EXCELLENT\",IF(C48>='T2'!$F$5*$E$123/100,\"GOOD\",IF(C48>='T2'!$F$5*$E$122/100,\"AVERAGE\",\"POOR\"))))","v":"POOR"}]
[{"$f":"Data_Sheet!A49","v":"JEC18CS026"},{"$f":"Data_Sheet!B49","v":"ARUN VG"},{"$f":"'T2'!R49","v":23},{"$f":"IF(C49=\"A\",\"ABSENT\",IF(C49>='T2'!$F$5*$E$124/100,\"EXCELLENT\",IF(C49>='T2'!$F$5*$E$123/100,\"GOOD\",IF(C49>='T2'!$F$5*$E$122/100,\"AVERAGE\",\"POOR\"))))","v":"AVERAGE"}]
[{"$f":"Data_Sheet!A50","v":"JEC18CS027"},{"$f":"Data_Sheet!B50","v":"ASHRUL K"},{"$f":"'T2'!R50","v":30},{"$f":"IF(C50=\"A\",\"ABSENT\",IF(C50>='T2'!$F$5*$E$124/100,\"EXCELLENT\",IF(C50>='T2'!$F$5*$E$123/100,\"GOOD\",IF(C50>='T2'!$F$5*$E$122/100,\"AVERAGE\",\"POOR\"))))","v":"GOOD"}]
[{"$f":"Data_Sheet!A51","v":"JEC18CS028"},{"$f":"Data_Sheet!B51","v":"ATHIL PAULY"},{"$f":"'T2'!R51","v":17},{"$f":"IF(C51=\"A\",\"ABSENT\",IF(C51>='T2'!$F$5*$E$124/100,\"EXCELLENT\",IF(C51>='T2'!$F$5*$E$123/100,\"GOOD\",IF(C51>='T2'!$F$5*$E$122/100,\"AVERAGE\",\"POOR\"))))","v":"POOR"}]
[{"$f":"Data_Sheet!A52","v":"JEC18CS029"},{"$f":"Data_Sheet!B52","v":"ATHIRA K P"},{"$f":"'T2'!R52","v":31},{"$f":"IF(C52=\"A\",\"ABSENT\",IF(C52>='T2'!$F$5*$E$124/100,\"EXCELLENT\",IF(C52>='T2'!$F$5*$E$123/100,\"GOOD\",IF(C52>='T2'!$F$5*$E$122/100,\"AVERAGE\",\"POOR\"))))","v":"GOOD"}]
[{"$f":"Data_Sheet!A53","v":"JEC18CS030"},{"$f":"Data_Sheet!B53","v":"AWIN ANTO"},{"$f":"'T2'!R53","v":17},{"$f":"IF(C53=\"A\",\"ABSENT\",IF(C53>='T2'!$F$5*$E$124/100,\"EXCELLENT\",IF(C53>='T2'!$F$5*$E$123/100,\"GOOD\",IF(C53>='T2'!$F$5*$E$122/100,\"AVERAGE\",\"POOR\"))))","v":"POOR"}]
[{"$f":"Data_Sheet!A54","v":"JEC18CS031"},{"$f":"Data_Sheet!B54","v":"CHARLES JOHNSON"},{"$f":"'T2'!R54","v":26},{"$f":"IF(C54=\"A\",\"ABSENT\",IF(C54>='T2'!$F$5*$E$124/100,\"EXCELLENT\",IF(C54>='T2'!$F$5*$E$123/100,\"GOOD\",IF(C54>='T2'!$F$5*$E$122/100,\"AVERAGE\",\"POOR\"))))","v":"AVERAGE"}]
[{"$f":"Data_Sheet!A55","v":"JEC18CS032"},{"$f":"Data_Sheet!B55","v":"CHITTILAPPILLY JOVIA JOHNSON"},{"$f":"'T2'!R55","v":31},{"$f":"IF(C55=\"A\",\"ABSENT\",IF(C55>='T2'!$F$5*$E$124/100,\"EXCELLENT\",IF(C55>='T2'!$F$5*$E$123/100,\"GOOD\",IF(C55>='T2'!$F$5*$E$122/100,\"AVERAGE\",\"POOR\"))))","v":"GOOD"}]
[{"$f":"Data_Sheet!A56","v":"JEC18CS033"},{"$f":"Data_Sheet!B56","v":"CIYA BABU"},{"$f":"'T2'!R56","v":19},{"$f":"IF(C56=\"A\",\"ABSENT\",IF(C56>='T2'!$F$5*$E$124/100,\"EXCELLENT\",IF(C56>='T2'!$F$5*$E$123/100,\"GOOD\",IF(C56>='T2'!$F$5*$E$122/100,\"AVERAGE\",\"POOR\"))))","v":"POOR"}]
[{"$f":"Data_Sheet!A57","v":"JEC18CS034"},{"$f":"Data_Sheet!B57","v":"DAVID SALUS"},{"$f":"'T2'!R57","v":17},{"$f":"IF(C57=\"A\",\"ABSENT\",IF(C57>='T2'!$F$5*$E$124/100,\"EXCELLENT\",IF(C57>='T2'!$F$5*$E$123/100,\"GOOD\",IF(C57>='T2'!$F$5*$E$122/100,\"AVERAGE\",\"POOR\"))))","v":"POOR"}]
[{"$f":"Data_Sheet!A58","v":"JEC18CS035"},{"$f":"Data_Sheet!B58","v":"DELICIA REJI"},{"$f":"'T2'!R58","v":44},{"$f":"IF(C58=\"A\",\"ABSENT\",IF(C58>='T2'!$F$5*$E$124/100,\"EXCELLENT\",IF(C58>='T2'!$F$5*$E$123/100,\"GOOD\",IF(C58>='T2'!$F$5*$E$122/100,\"AVERAGE\",\"POOR\"))))","v":"EXCELLENT"}]
[{"$f":"Data_Sheet!A59","v":"JEC18CS036"},{"$f":"Data_Sheet!B59","v":"DELMA SHAJAN"},{"$f":"'T2'!R59","v":34},{"$f":"IF(C59=\"A\",\"ABSENT\",IF(C59>='T2'!$F$5*$E$124/100,\"EXCELLENT\",IF(C59>='T2'!$F$5*$E$123/100,\"GOOD\",IF(C59>='T2'!$F$5*$E$122/100,\"AVERAGE\",\"POOR\"))))","v":"GOOD"}]
[{"$f":"Data_Sheet!A60","v":"JEC18CS037"},{"$f":"Data_Sheet!B60","v":"DILBER SHA AP"},{"$f":"'T2'!R60","v":0},{"$f":"IF(C60=\"A\",\"ABSENT\",IF(C60>='T2'!$F$5*$E$124/100,\"EXCELLENT\",IF(C60>='T2'!$F$5*$E$123/100,\"GOOD\",IF(C60>='T2'!$F$5*$E$122/100,\"AVERAGE\",\"POOR\"))))","v":"POOR"}]
[{"$f":"Data_Sheet!A61","v":"JEC18CS038"},{"$f":"Data_Sheet!B61","v":"EDWIN T JOY"},{"$f":"'T2'!R61","v":27},{"$f":"IF(C61=\"A\",\"ABSENT\",IF(C61>='T2'!$F$5*$E$124/100,\"EXCELLENT\",IF(C61>='T2'!$F$5*$E$123/100,\"GOOD\",IF(C61>='T2'!$F$5*$E$122/100,\"AVERAGE\",\"POOR\"))))","v":"AVERAGE"}]
[{"$f":"Data_Sheet!A62","v":"JEC18CS039"},{"$f":"Data_Sheet!B62","v":"EDWIN WILSON"},{"$f":"'T2'!R62","v":17},{"$f":"IF(C62=\"A\",\"ABSENT\",IF(C62>='T2'!$F$5*$E$124/100,\"EXCELLENT\",IF(C62>='T2'!$F$5*$E$123/100,\"GOOD\",IF(C62>='T2'!$F$5*$E$122/100,\"AVERAGE\",\"POOR\"))))","v":"POOR"}]
[{"$f":"Data_Sheet!A63","v":"JEC18CS040"},{"$f":"Data_Sheet!B63","v":"EMMANUEL SHIBU"},{"$f":"'T2'!R63","v":19},{"$f":"IF(C63=\"A\",\"ABSENT\",IF(C63>='T2'!$F$5*$E$124/100,\"EXCELLENT\",IF(C63>='T2'!$F$5*$E$123/100,\"GOOD\",IF(C63>='T2'!$F$5*$E$122/100,\"AVERAGE\",\"POOR\"))))","v":"POOR"}]
[{"$f":"Data_Sheet!A64","v":"JEC18CS041"},{"$f":"Data_Sheet!B64","v":"GAYATHRI DINESH"},{"$f":"'T2'!R64","v":24},{"$f":"IF(C64=\"A\",\"ABSENT\",IF(C64>='T2'!$F$5*$E$124/100,\"EXCELLENT\",IF(C64>='T2'!$F$5*$E$123/100,\"GOOD\",IF(C64>='T2'!$F$5*$E$122/100,\"AVERAGE\",\"POOR\"))))","v":"AVERAGE"}]
[{"$f":"Data_Sheet!A65","v":"JEC18CS042"},{"$f":"Data_Sheet!B65","v":"GOKUL DAS M"},{"$f":"'T2'!R65","v":35},{"$f":"IF(C65=\"A\",\"ABSENT\",IF(C65>='T2'!$F$5*$E$124/100,\"EXCELLENT\",IF(C65>='T2'!$F$5*$E$123/100,\"GOOD\",IF(C65>='T2'!$F$5*$E$122/100,\"AVERAGE\",\"POOR\"))))","v":"GOOD"}]
[{"$f":"Data_Sheet!A66","v":"JEC18CS043"},{"$f":"Data_Sheet!B66","v":"G RAMGOPAL"},{"$f":"'T2'!R66","v":45.5},{"$f":"IF(C66=\"A\",\"ABSENT\",IF(C66>='T2'!$F$5*$E$124/100,\"EXCELLENT\",IF(C66>='T2'!$F$5*$E$123/100,\"GOOD\",IF(C66>='T2'!$F$5*$E$122/100,\"AVERAGE\",\"POOR\"))))","v":"EXCELLENT"}]
[{"$f":"Data_Sheet!A67","v":"JEC18CS044"},{"$f":"Data_Sheet!B67","v":"HARIES DAVIS"},{"$f":"'T2'!R67","v":16},{"$f":"IF(C67=\"A\",\"ABSENT\",IF(C67>='T2'!$F$5*$E$124/100,\"EXCELLENT\",IF(C67>='T2'!$F$5*$E$123/100,\"GOOD\",IF(C67>='T2'!$F$5*$E$122/100,\"AVERAGE\",\"POOR\"))))","v":"POOR"}]
[{"$f":"Data_Sheet!A68","v":"JEC18CS045"},{"$f":"Data_Sheet!B68","v":"HARISANKER P"},{"$f":"'T2'!R68","v":32},{"$f":"IF(C68=\"A\",\"ABSENT\",IF(C68>='T2'!$F$5*$E$124/100,\"EXCELLENT\",IF(C68>='T2'!$F$5*$E$123/100,\"GOOD\",IF(C68>='T2'!$F$5*$E$122/100,\"AVERAGE\",\"POOR\"))))","v":"GOOD"}]
[{"$f":"Data_Sheet!A69","v":"JEC18CS046"},{"$f":"Data_Sheet!B69","v":"HARSHA.K.S."},{"$f":"'T2'!R69","v":33},{"$f":"IF(C69=\"A\",\"ABSENT\",IF(C69>='T2'!$F$5*$E$124/100,\"EXCELLENT\",IF(C69>='T2'!$F$5*$E$123/100,\"GOOD\",IF(C69>='T2'!$F$5*$E$122/100,\"AVERAGE\",\"POOR\"))))","v":"GOOD"}]
[{"$f":"Data_Sheet!A70","v":"JEC18CS047"},{"$f":"Data_Sheet!B70","v":"HELNA THOMAS"},{"$f":"'T2'!R70","v":36},{"$f":"IF(C70=\"A\",\"ABSENT\",IF(C70>='T2'!$F$5*$E$124/100,\"EXCELLENT\",IF(C70>='T2'!$F$5*$E$123/100,\"GOOD\",IF(C70>='T2'!$F$5*$E$122/100,\"AVERAGE\",\"POOR\"))))","v":"GOOD"}]
[{"$f":"Data_Sheet!A71","v":"JEC18CS048"},{"$f":"Data_Sheet!B71","v":"HRIDI KRISHNA.H"},{"$f":"'T2'!R71","v":16},{"$f":"IF(C71=\"A\",\"ABSENT\",IF(C71>='T2'!$F$5*$E$124/100,\"EXCELLENT\",IF(C71>='T2'!$F$5*$E$123/100,\"GOOD\",IF(C71>='T2'!$F$5*$E$122/100,\"AVERAGE\",\"POOR\"))))","v":"POOR"}]
[{"$f":"Data_Sheet!A72","v":"JEC18CS049"},{"$f":"Data_Sheet!B72","v":"INDRAJIT R"},{"$f":"'T2'!R72","v":9},{"$f":"IF(C72=\"A\",\"ABSENT\",IF(C72>='T2'!$F$5*$E$124/100,\"EXCELLENT\",IF(C72>='T2'!$F$5*$E$123/100,\"GOOD\",IF(C72>='T2'!$F$5*$E$122/100,\"AVERAGE\",\"POOR\"))))","v":"POOR"}]
[{"$f":"Data_Sheet!A73","v":"JEC18CS050"},{"$f":"Data_Sheet!B73","v":"JESWIN JOJY"},{"$f":"'T2'!R73","v":30.5},{"$f":"IF(C73=\"A\",\"ABSENT\",IF(C73>='T2'!$F$5*$E$124/100,\"EXCELLENT\",IF(C73>='T2'!$F$5*$E$123/100,\"GOOD\",IF(C73>='T2'!$F$5*$E$122/100,\"AVERAGE\",\"POOR\"))))","v":"GOOD"}]
[{"$f":"Data_Sheet!A74","v":"JEC18CS051"},{"$f":"Data_Sheet!B74","v":"JIBIN A BABU"},{"$f":"'T2'!R74","v":23},{"$f":"IF(C74=\"A\",\"ABSENT\",IF(C74>='T2'!$F$5*$E$124/100,\"EXCELLENT\",IF(C74>='T2'!$F$5*$E$123/100,\"GOOD\",IF(C74>='T2'!$F$5*$E$122/100,\"AVERAGE\",\"POOR\"))))","v":"AVERAGE"}]
[{"$f":"Data_Sheet!A75","v":"JEC18CS052"},{"$f":"Data_Sheet!B75","v":"JISSY JOY"},{"$f":"'T2'!R75","v":41},{"$f":"IF(C75=\"A\",\"ABSENT\",IF(C75>='T2'!$F$5*$E$124/100,\"EXCELLENT\",IF(C75>='T2'!$F$5*$E$123/100,\"GOOD\",IF(C75>='T2'!$F$5*$E$122/100,\"AVERAGE\",\"POOR\"))))","v":"EXCELLENT"}]
[{"$f":"Data_Sheet!A76","v":"JEC18CS053"},{"$f":"Data_Sheet!B76","v":"JOEL JAMES KARIKKANDATHIL"},{"$f":"'T2'!R76","v":13.5},{"$f":"IF(C76=\"A\",\"ABSENT\",IF(C76>='T2'!$F$5*$E$124/100,\"EXCELLENT\",IF(C76>='T2'!$F$5*$E$123/100,\"GOOD\",IF(C76>='T2'!$F$5*$E$122/100,\"AVERAGE\",\"POOR\"))))","v":"POOR"}]
[{"$f":"Data_Sheet!A77","v":"JEC18CS054"},{"$f":"Data_Sheet!B77","v":"JOSE REJI KARIMADATHI"},{"$f":"'T2'!R77","v":20.5},{"$f":"IF(C77=\"A\",\"ABSENT\",IF(C77>='T2'!$F$5*$E$124/100,\"EXCELLENT\",IF(C77>='T2'!$F$5*$E$123/100,\"GOOD\",IF(C77>='T2'!$F$5*$E$122/100,\"AVERAGE\",\"POOR\"))))","v":"POOR"}]
[{"$f":"Data_Sheet!A78","v":"JEC18CS055"},{"$f":"Data_Sheet!B78","v":"JUMANA HASIN"},{"$f":"'T2'!R78","v":28},{"$f":"IF(C78=\"A\",\"ABSENT\",IF(C78>='T2'!$F$5*$E$124/100,\"EXCELLENT\",IF(C78>='T2'!$F$5*$E$123/100,\"GOOD\",IF(C78>='T2'!$F$5*$E$122/100,\"AVERAGE\",\"POOR\"))))","v":"AVERAGE"}]
[{"$f":"Data_Sheet!A79","v":"JEC18CS056"},{"$f":"Data_Sheet!B79","v":"KAILASHNATH"},{"$f":"'T2'!R79","v":16},{"$f":"IF(C79=\"A\",\"ABSENT\",IF(C79>='T2'!$F$5*$E$124/100,\"EXCELLENT\",IF(C79>='T2'!$F$5*$E$123/100,\"GOOD\",IF(C79>='T2'!$F$5*$E$122/100,\"AVERAGE\",\"POOR\"))))","v":"POOR"}]
[{"$f":"Data_Sheet!A80","v":"JEC18CS057"},{"$f":"Data_Sheet!B80","v":"K AJISHKUMAR"},{"$f":"'T2'!R80","v":0},{"$f":"IF(C80=\"A\",\"ABSENT\",IF(C80>='T2'!$F$5*$E$124/100,\"EXCELLENT\",IF(C80>='T2'!$F$5*$E$123/100,\"GOOD\",IF(C80>='T2'!$F$5*$E$122/100,\"AVERAGE\",\"POOR\"))))","v":"POOR"}]
[{"$f":"Data_Sheet!A81","v":"JEC18CS058"},{"$f":"Data_Sheet!B81","v":"KEERTHANA K S"},{"$f":"'T2'!R81","v":15},{"$f":"IF(C81=\"A\",\"ABSENT\",IF(C81>='T2'!$F$5*$E$124/100,\"EXCELLENT\",IF(C81>='T2'!$F$5*$E$123/100,\"GOOD\",IF(C81>='T2'!$F$5*$E$122/100,\"AVERAGE\",\"POOR\"))))","v":"POOR"}]
[{"$f":"Data_Sheet!A82","v":"JEC18CS059"},{"$f":"Data_Sheet!B82","v":"KEVIN VARGHESE"},{"$f":"'T2'!R82","v":40},{"$f":"IF(C82=\"A\",\"ABSENT\",IF(C82>='T2'!$F$5*$E$124/100,\"EXCELLENT\",IF(C82>='T2'!$F$5*$E$123/100,\"GOOD\",IF(C82>='T2'!$F$5*$E$122/100,\"AVERAGE\",\"POOR\"))))","v":"EXCELLENT"}]
[{"$f":"Data_Sheet!A83","v":"JEC18CS060"},{"$f":"Data_Sheet!B83","v":"LAKSHMI SADANANDAN"},{"$f":"'T2'!R83","v":17},{"$f":"IF(C83=\"A\",\"ABSENT\",IF(C83>='T2'!$F$5*$E$124/100,\"EXCELLENT\",IF(C83>='T2'!$F$5*$E$123/100,\"GOOD\",IF(C83>='T2'!$F$5*$E$122/100,\"AVERAGE\",\"POOR\"))))","v":"POOR"}]
[{"$f":"Data_Sheet!A84","v":"JEC18CS061"},{"$f":"Data_Sheet!B84","v":"LEYA PALLAN"},{"$f":"'T2'!R84","v":17.5},{"$f":"IF(C84=\"A\",\"ABSENT\",IF(C84>='T2'!$F$5*$E$124/100,\"EXCELLENT\",IF(C84>='T2'!$F$5*$E$123/100,\"GOOD\",IF(C84>='T2'!$F$5*$E$122/100,\"AVERAGE\",\"POOR\"))))","v":"POOR"}]
[{"$f":"Data_Sheet!A85","v":"JEC18CS062"},{"$f":"Data_Sheet!B85","v":"MARVEL BABU"},{"$f":"'T2'!R85","v":13},{"$f":"IF(C85=\"A\",\"ABSENT\",IF(C85>='T2'!$F$5*$E$124/100,\"EXCELLENT\",IF(C85>='T2'!$F$5*$E$123/100,\"GOOD\",IF(C85>='T2'!$F$5*$E$122/100,\"AVERAGE\",\"POOR\"))))","v":"POOR"}]
[{"$f":"Data_Sheet!A86","v":"JEC18CS063"},{"$f":"Data_Sheet!B86","v":"MEDWIN PAUL"},{"$f":"'T2'!R86","v":5},{"$f":"IF(C86=\"A\",\"ABSENT\",IF(C86>='T2'!$F$5*$E$124/100,\"EXCELLENT\",IF(C86>='T2'!$F$5*$E$123/100,\"GOOD\",IF(C86>='T2'!$F$5*$E$122/100,\"AVERAGE\",\"POOR\"))))","v":"POOR"}]
[{"$f":"Data_Sheet!A87","v":0},{"$f":"Data_Sheet!B87","v":0},{"$f":"'T2'!R87","v":0},{"$f":"IF(C87=\"A\",\"ABSENT\",IF(C87>='T2'!$F$5*$E$124/100,\"EXCELLENT\",IF(C87>='T2'!$F$5*$E$123/100,\"GOOD\",IF(C87>='T2'!$F$5*$E$122/100,\"AVERAGE\",\"POOR\"))))","v":"POOR"}]
[{"$f":"Data_Sheet!A88","v":0},{"$f":"Data_Sheet!B88","v":0},{"$f":"'T2'!R88","v":0},{"$f":"IF(C88=\"A\",\"ABSENT\",IF(C88>='T2'!$F$5*$E$124/100,\"EXCELLENT\",IF(C88>='T2'!$F$5*$E$123/100,\"GOOD\",IF(C88>='T2'!$F$5*$E$122/100,\"AVERAGE\",\"POOR\"))))","v":"POOR"}]
[{"$f":"Data_Sheet!A89","v":"JEC18CS066"},{"$f":"Data_Sheet!B89","v":"MUHAMMED INSHADH"},{"$f":"'T2'!R89","v":9},{"$f":"IF(C89=\"A\",\"ABSENT\",IF(C89>='T2'!$F$5*$E$124/100,\"EXCELLENT\",IF(C89>='T2'!$F$5*$E$123/100,\"GOOD\",IF(C89>='T2'!$F$5*$E$122/100,\"AVERAGE\",\"POOR\"))))","v":"POOR"}]
[{"$f":"Data_Sheet!A90","v":"JEC18CS067"},{"$f":"Data_Sheet!B90","v":"NAIR MIDHUN RAMACHANDRAN"},{"$f":"'T2'!R90","v":22.5},{"$f":"IF(C90=\"A\",\"ABSENT\",IF(C90>='T2'!$F$5*$E$124/100,\"EXCELLENT\",IF(C90>='T2'!$F$5*$E$123/100,\"GOOD\",IF(C90>='T2'!$F$5*$E$122/100,\"AVERAGE\",\"POOR\"))))","v":"AVERAGE"}]
[{"$f":"Data_Sheet!A91","v":"JEC18CS068"},{"$f":"Data_Sheet!B91","v":"NAVEENA ANTONY"},{"$f":"'T2'!R91","v":22},{"$f":"IF(C91=\"A\",\"ABSENT\",IF(C91>='T2'!$F$5*$E$124/100,\"EXCELLENT\",IF(C91>='T2'!$F$5*$E$123/100,\"GOOD\",IF(C91>='T2'!$F$5*$E$122/100,\"AVERAGE\",\"POOR\"))))","v":"POOR"}]
[{"$f":"Data_Sheet!A92","v":"JEC18CS069"},{"$f":"Data_Sheet!B92","v":"NITIN MADHU"},{"$f":"'T2'!R92","v":24},{"$f":"IF(C92=\"A\",\"ABSENT\",IF(C92>='T2'!$F$5*$E$124/100,\"EXCELLENT\",IF(C92>='T2'!$F$5*$E$123/100,\"GOOD\",IF(C92>='T2'!$F$5*$E$122/100,\"AVERAGE\",\"POOR\"))))","v":"AVERAGE"}]
[{"$f":"Data_Sheet!A93","v":"JEC18CS070"},{"$f":"Data_Sheet!B93","v":"PRATHIUSH ARUN"},{"$f":"'T2'!R93","v":17},{"$f":"IF(C93=\"A\",\"ABSENT\",IF(C93>='T2'!$F$5*$E$124/100,\"EXCELLENT\",IF(C93>='T2'!$F$5*$E$123/100,\"GOOD\",IF(C93>='T2'!$F$5*$E$122/100,\"AVERAGE\",\"POOR\"))))","v":"POOR"}]
[{"$f":"Data_Sheet!A94","v":"JEC18CS071"},{"$f":"Data_Sheet!B94","v":"RACHEL CECER"},{"$f":"'T2'!R94","v":42.5},{"$f":"IF(C94=\"A\",\"ABSENT\",IF(C94>='T2'!$F$5*$E$124/100,\"EXCELLENT\",IF(C94>='T2'!$F$5*$E$123/100,\"GOOD\",IF(C94>='T2'!$F$5*$E$122/100,\"AVERAGE\",\"POOR\"))))","v":"EXCELLENT"}]
[{"$f":"Data_Sheet!A95","v":"JEC18CS072"},{"$f":"Data_Sheet!B95","v":"RAHUL RAJU"},{"$f":"'T2'!R95","v":11.5},{"$f":"IF(C95=\"A\",\"ABSENT\",IF(C95>='T2'!$F$5*$E$124/100,\"EXCELLENT\",IF(C95>='T2'!$F$5*$E$123/100,\"GOOD\",IF(C95>='T2'!$F$5*$E$122/100,\"AVERAGE\",\"POOR\"))))","v":"POOR"}]
[{"$f":"Data_Sheet!A96","v":"JEC18CS073"},{"$f":"Data_Sheet!B96","v":"RAHUL T RAVI"},{"$f":"'T2'!R96","v":13},{"$f":"IF(C96=\"A\",\"ABSENT\",IF(C96>='T2'!$F$5*$E$124/100,\"EXCELLENT\",IF(C96>='T2'!$F$5*$E$123/100,\"GOOD\",IF(C96>='T2'!$F$5*$E$122/100,\"AVERAGE\",\"POOR\"))))","v":"POOR"}]
[{"$f":"Data_Sheet!A97","v":"JEC18CS074"},{"$f":"Data_Sheet!B97","v":"RAPHEAL K MOYALAN"},{"$f":"'T2'!R97","v":10.5},{"$f":"IF(C97=\"A\",\"ABSENT\",IF(C97>='T2'!$F$5*$E$124/100,\"EXCELLENT\",IF(C97>='T2'!$F$5*$E$123/100,\"GOOD\",IF(C97>='T2'!$F$5*$E$122/100,\"AVERAGE\",\"POOR\"))))","v":"POOR"}]
[{"$f":"Data_Sheet!A98","v":"JEC18CS075"},{"$f":"Data_Sheet!B98","v":"RISHIKESH. V"},{"$f":"'T2'!R98","v":32},{"$f":"IF(C98=\"A\",\"ABSENT\",IF(C98>='T2'!$F$5*$E$124/100,\"EXCELLENT\",IF(C98>='T2'!$F$5*$E$123/100,\"GOOD\",IF(C98>='T2'!$F$5*$E$122/100,\"AVERAGE\",\"POOR\"))))","v":"GOOD"}]
[{"$f":"Data_Sheet!A99","v":"JEC18CS076"},{"$f":"Data_Sheet!B99","v":"ROCKSON T. AUGUSTINE"},{"$f":"'T2'!R99","v":24},{"$f":"IF(C99=\"A\",\"ABSENT\",IF(C99>='T2'!$F$5*$E$124/100,\"EXCELLENT\",IF(C99>='T2'!$F$5*$E$123/100,\"GOOD\",IF(C99>='T2'!$F$5*$E$122/100,\"AVERAGE\",\"POOR\"))))","v":"AVERAGE"}]
[{"$f":"Data_Sheet!A100","v":"JEC18CS077"},{"$f":"Data_Sheet!B100","v":"SARATH C P"},{"$f":"'T2'!R100","v":29.5},{"$f":"IF(C100=\"A\",\"ABSENT\",IF(C100>='T2'!$F$5*$E$124/100,\"EXCELLENT\",IF(C100>='T2'!$F$5*$E$123/100,\"GOOD\",IF(C100>='T2'!$F$5*$E$122/100,\"AVERAGE\",\"POOR\"))))","v":"AVERAGE"}]
[{"$f":"Data_Sheet!A101","v":"JEC18CS078"},{"$f":"Data_Sheet!B101","v":"SARATH SASI"},{"$f":"'T2'!R101","v":34},{"$f":"IF(C101=\"A\",\"ABSENT\",IF(C101>='T2'!$F$5*$E$124/100,\"EXCELLENT\",IF(C101>='T2'!$F$5*$E$123/100,\"GOOD\",IF(C101>='T2'!$F$5*$E$122/100,\"AVERAGE\",\"POOR\"))))","v":"GOOD"}]
[{"$f":"Data_Sheet!A102","v":"JEC18CS079"},{"$f":"Data_Sheet!B102","v":"SHAFNA"},{"$f":"'T2'!R102","v":48},{"$f":"IF(C102=\"A\",\"ABSENT\",IF(C102>='T2'!$F$5*$E$124/100,\"EXCELLENT\",IF(C102>='T2'!$F$5*$E$123/100,\"GOOD\",IF(C102>='T2'!$F$5*$E$122/100,\"AVERAGE\",\"POOR\"))))","v":"EXCELLENT"}]
[{"$f":"Data_Sheet!A103","v":"JEC18CS080"},{"$f":"Data_Sheet!B103","v":"SHELMY SHABU"},{"$f":"'T2'!R103","v":46.5},{"$f":"IF(C103=\"A\",\"ABSENT\",IF(C103>='T2'!$F$5*$E$124/100,\"EXCELLENT\",IF(C103>='T2'!$F$5*$E$123/100,\"GOOD\",IF(C103>='T2'!$F$5*$E$122/100,\"AVERAGE\",\"POOR\"))))","v":"EXCELLENT"}]
[{"$f":"Data_Sheet!A104","v":"JEC18CS081"},{"$f":"Data_Sheet!B104","v":"SHIZA SHIHAB PUVAMPARAMBIL"},{"$f":"'T2'!R104","v":23.5},{"$f":"IF(C104=\"A\",\"ABSENT\",IF(C104>='T2'!$F$5*$E$124/100,\"EXCELLENT\",IF(C104>='T2'!$F$5*$E$123/100,\"GOOD\",IF(C104>='T2'!$F$5*$E$122/100,\"AVERAGE\",\"POOR\"))))","v":"AVERAGE"}]
[{"$f":"Data_Sheet!A105","v":"JEC18CS082"},{"$f":"Data_Sheet!B105","v":"SIJO GEORGE"},{"$f":"'T2'!R105","v":0},{"$f":"IF(C105=\"A\",\"ABSENT\",IF(C105>='T2'!$F$5*$E$124/100,\"EXCELLENT\",IF(C105>='T2'!$F$5*$E$123/100,\"GOOD\",IF(C105>='T2'!$F$5*$E$122/100,\"AVERAGE\",\"POOR\"))))","v":"POOR"}]
[{"$f":"Data_Sheet!A106","v":"JEC18CS083"},{"$f":"Data_Sheet!B106","v":"SOURAV K"},{"$f":"'T2'!R106","v":12},{"$f":"IF(C106=\"A\",\"ABSENT\",IF(C106>='T2'!$F$5*$E$124/100,\"EXCELLENT\",IF(C106>='T2'!$F$5*$E$123/100,\"GOOD\",IF(C106>='T2'!$F$5*$E$122/100,\"AVERAGE\",\"POOR\"))))","v":"POOR"}]
[{"$f":"Data_Sheet!A107","v":0},{"$f":"Data_Sheet!B107","v":0},{"$f":"'T2'!R107","v":0},{"$f":"IF(C107=\"A\",\"ABSENT\",IF(C107>='T2'!$F$5*$E$124/100,\"EXCELLENT\",IF(C107>='T2'!$F$5*$E$123/100,\"GOOD\",IF(C107>='T2'!$F$5*$E$122/100,\"AVERAGE\",\"POOR\"))))","v":"POOR"}]
[{"$f":"Data_Sheet!A108","v":"JEC18CS085"},{"$f":"Data_Sheet!B108","v":"SREEHARI"},{"$f":"'T2'!R108","v":7.5},{"$f":"IF(C108=\"A\",\"ABSENT\",IF(C108>='T2'!$F$5*$E$124/100,\"EXCELLENT\",IF(C108>='T2'!$F$5*$E$123/100,\"GOOD\",IF(C108>='T2'!$F$5*$E$122/100,\"AVERAGE\",\"POOR\"))))","v":"POOR"}]
[{"$f":"Data_Sheet!A109","v":"JEC18CS086"},{"$f":"Data_Sheet!B109","v":"SREEKANTH P"},{"$f":"'T2'!R109","v":1.5},{"$f":"IF(C109=\"A\",\"ABSENT\",IF(C109>='T2'!$F$5*$E$124/100,\"EXCELLENT\",IF(C109>='T2'!$F$5*$E$123/100,\"GOOD\",IF(C109>='T2'!$F$5*$E$122/100,\"AVERAGE\",\"POOR\"))))","v":"POOR"}]
[{"$f":"Data_Sheet!A110","v":"JEC18CS087"},{"$f":"Data_Sheet!B110","v":"SREELEKSHMI H KUMAR"},{"$f":"'T2'!R110","v":33.5},{"$f":"IF(C110=\"A\",\"ABSENT\",IF(C110>='T2'!$F$5*$E$124/100,\"EXCELLENT\",IF(C110>='T2'!$F$5*$E$123/100,\"GOOD\",IF(C110>='T2'!$F$5*$E$122/100,\"AVERAGE\",\"POOR\"))))","v":"GOOD"}]
[{"$f":"Data_Sheet!A111","v":"JEC18CS088"},{"$f":"Data_Sheet!B111","v":"SUFAIL BADUSHA.T"},{"$f":"'T2'!R111","v":0},{"$f":"IF(C111=\"A\",\"ABSENT\",IF(C111>='T2'!$F$5*$E$124/100,\"EXCELLENT\",IF(C111>='T2'!$F$5*$E$123/100,\"GOOD\",IF(C111>='T2'!$F$5*$E$122/100,\"AVERAGE\",\"POOR\"))))","v":"POOR"}]
[{"$f":"Data_Sheet!A112","v":"JEC18CS089"},{"$f":"Data_Sheet!B112","v":"TIYA THOMAS"},{"$f":"'T2'!R112","v":39},{"$f":"IF(C112=\"A\",\"ABSENT\",IF(C112>='T2'!$F$5*$E$124/100,\"EXCELLENT\",IF(C112>='T2'!$F$5*$E$123/100,\"GOOD\",IF(C112>='T2'!$F$5*$E$122/100,\"AVERAGE\",\"POOR\"))))","v":"GOOD"}]
[{"$f":"Data_Sheet!A113","v":"JEC18CS090"},{"$f":"Data_Sheet!B113","v":"TOMSUN PAVOO P"},{"$f":"'T2'!R113","v":21.5},{"$f":"IF(C113=\"A\",\"ABSENT\",IF(C113>='T2'!$F$5*$E$124/100,\"EXCELLENT\",IF(C113>='T2'!$F$5*$E$123/100,\"GOOD\",IF(C113>='T2'!$F$5*$E$122/100,\"AVERAGE\",\"POOR\"))))","v":"POOR"}]
[{"$f":"Data_Sheet!A114","v":"JEC18CS091"},{"$f":"Data_Sheet!B114","v":"ULLAS. S"},{"$f":"'T2'!R114","v":15.5},{"$f":"IF(C114=\"A\",\"ABSENT\",IF(C114>='T2'!$F$5*$E$124/100,\"EXCELLENT\",IF(C114>='T2'!$F$5*$E$123/100,\"GOOD\",IF(C114>='T2'!$F$5*$E$122/100,\"AVERAGE\",\"POOR\"))))","v":"POOR"}]
[{"$f":"Data_Sheet!A115","v":"JEC18CS092"},{"$f":"Data_Sheet!B115","v":"VAISHNAV M"},{"$f":"'T2'!R115","v":5},{"$f":"IF(C115=\"A\",\"ABSENT\",IF(C115>='T2'!$F$5*$E$124/100,\"EXCELLENT\",IF(C115>='T2'!$F$5*$E$123/100,\"GOOD\",IF(C115>='T2'!$F$5*$E$122/100,\"AVERAGE\",\"POOR\"))))","v":"POOR"}]
[{"$f":"Data_Sheet!A116","v":"JEC18CS093"},{"$f":"Data_Sheet!B116","v":"VANI PRAKASHAN CHOYYAN"},{"$f":"'T2'!R116","v":48},{"$f":"IF(C116=\"A\",\"ABSENT\",IF(C116>='T2'!$F$5*$E$124/100,\"EXCELLENT\",IF(C116>='T2'!$F$5*$E$123/100,\"GOOD\",IF(C116>='T2'!$F$5*$E$122/100,\"AVERAGE\",\"POOR\"))))","v":"EXCELLENT"}]
[]
["Total Number of Students",null,{"$f":"Data_Sheet!$C$6","v":92}]
["Number of Students Absent",null,{"$f":"IF(COUNTIF(C25:INDIRECT(C131),\"=A\"),COUNTIF(C25:INDIRECT(C131),\"=A\"),0)","v":0}]
["Total Number of Students attended",null,{"$f":"C118-C119","v":92}]
[{"$f":"\"Number of Students with Marks less than \"&E122&\"%\"","v":"Number of Students with Marks less than 45%"},null,{"$f":"IF(COUNTIF(D25:INDIRECT(D131),\"=POOR\"),COUNTIF(D25:INDIRECT(D131),\"=POOR\"),0)","v":47},"POOR","Range"]
[{"$f":"\"Number of Students with Marks betweeen \"&E122&\"% to \"&E123&\"%\"","v":"Number of Students with Marks betweeen 45% to 60%"},null,{"$f":"IF(COUNTIF(D25:INDIRECT(D131),\"=AVERAGE\"),COUNTIF(D25:INDIRECT(D131),\"=AVERAGE\"),0)","v":16},"AVERAGE",45]
[{"$f":"\"Number of Students with Marks betweeen \"&E123&\"% to \"&E124&\"%\"","v":"Number of Students with Marks betweeen 60% to 80%"},null,{"$f":"IF(COUNTIF(D25:INDIRECT(D131),\"=GOOD\"),COUNTIF(D25:INDIRECT(D131),\"=GOOD\"),0)","v":19},"GOOD",60]
[{"$f":"\"Number of Students with Marks greater than \"&E124&\"%\"","v":"Number of Students with Marks greater than 80%"},null,{"$f":"IF(COUNTIF(D25:INDIRECT(D131),\"=EXCELLENT\"),COUNTIF(D25:INDIRECT(D131),\"=EXCELLENT\"),0)","v":10},"EXCELLENT",80]
["Class Average",null,{"$f":"ROUND(AVERAGE(C25:INDIRECT(C131)),2)","v":21.98}]
["Pass Percentage",null,{"$f":"ROUND(((C120-C121)/C120)*100,2)","v":48.91}]
[]
[null,{"$f":"Data_Sheet!B10","v":"Name of Faculty : "},{"$f":"Data_Sheet!B11","v":"Namitha T N"}]
[null,{"$f":"Data_Sheet!B136","v":"Dated Signature :  "}]
[]
[{"$f":"ROW(A118)-2","v":116},"Last Row Count",{"$f":"\"$C$\"&$A$131","v":"$C$116"},{"$f":"\"$D$\"&$A$131","v":"$D$116"}]

{"sheet":"T3","index":6,"n_rows":181,"n_cols":19,"rows_kept":181,"cut":false,"hidden":false,"merged":[[6,0,6,8],[8,0,8,8],[10,0,10,8],[12,0,12,8],[17,0,21,0],[17,1,21,1],[17,8,21,8],[2,0,4,1],[2,2,2,5],[2,6,2,7],[3,2,3,5],[3,6,3,7],[4,2,4,4],[119,0,119,2],[17,11,21,11],[120,0,120,2],[168,15,173,15],[140,15,145,15],[147,15,152,15],[154,15,159,15],[161,15,166,15],[121,0,121,2],[117,0,117,2],[118,0,118,2]]}
[]
[]
["Add questions one by one as needed..",null,"Assessment Category",null,null,null,"Date : ",null,null,"CO1","First Internal Exam"]
[null,null,"Retest",null,null,null,"14-03-18",null,null,"CO2","Second Internal Exam"]
[null,null,"Total Marks : ",null,null,50,null,null,null,"CO3","Assessment Exam - 1"]
[null,null,null,null,null,null,null,null,null,"CO4","Assessment Exam - 2"]
[{"$f":"Data_Sheet!A2","v":"Jyothi Engineering College, Cheruthuruthy"},null,null,null,null,null,null,null,null,"CO5","Assignment - 1"]
[null,null,null,null,null,null,null,null,null,"CO6","Assignment - 2"]
[{"$f":"Data_Sheet!A4","v":"Department of Computer Science Engineering"},null,null,null,null,null,null,null,null,null,"Retest"]
[null,null,null,null,null,null,null,null,null,1]
[{"$f":"\"CO Analysis - Internal Marks : \"&C4 &\"                       \" &TEXT(G4,\"dd-mm-yy\")","v":"CO Analysis - Internal Marks : Retest                       14-03-18"},null,null,null,null,null,null,null,null,2]
[null,null,null,null,null,null,null,null,null,3]
[{"$f":"Data_Sheet!A17","v":"S3 CS              CS203 Switching Theory and Logic Design               2019-20"},null,null,null,null,null,null,null,null,4]
[null,null,null,null,null,null,null,null,null,5]
[null,null,null,null,null,null,null,null,null,6]
[]
[]
["Register No.","Name of Student","Qn. No.",1,2,3,4,5,{"$f":" \"Total Marks (\" &F5 & \")\"","v":"Total Marks (50)"},null,null,"Calculated Total Marks (50)"]
[null,null,"CO's","CO3","CO3","CO4","CO4","CO5"]
[null,null,"Blooms Taxonomy Lavel",5,5,5,6,6]
[null,null,"Max. Marks",5,5,5,5,5]
[null,null,"Difficulty Level in %",60,60,60,60,60]
[]
["Column1","Column2","Column3","Column4","Column5","Column6","Column7","Column8","Column32"]
[{"$f":"Data_Sheet!A25","v":"JEC18CS001"},{"$f":"Data_Sheet!B25","v":"ABHISHEK KRISHNAN MENON E"}]
[{"$f":"Data_Sheet!A26","v":"JEC18CS002"},{"$f":"Data_Sheet!B26","v":"ABHISHEK SAJEEVAN"}]
[{"$f":"Data_Sheet!A27","v":"JEC18CS003"},{"$f":"Data_Sheet!B27","v":"ABHITH SHAJI"}]
[{"$f":"Data_Sheet!A28","v":"JEC18CS004"},{"$f":"Data_Sheet!B28","v":"ABIN SANTHOSH ALAPATT"}]
[{"$f":"Data_Sheet!A29","v":"JEC18CS005"},{"$f":"Data_Sheet!B29","v":"ADARSH KUMAR M A"}]
[{"$f":"Data_Sheet!A30","v":"JEC18CS006"},{"$f":"Data_Sheet!B30","v":"ADHITHYA KRISHNA S"}]
[{"$f":"Data_Sheet!A31","v":"JEC18CS007"},{"$f":"Data_Sheet!B31","v":"ADITHYA HARIDAS"}]
[{"$f":"Data_Sheet!A32","v":"JEC18CS008"},{"$f":"Data_Sheet!B32","v":"AJMAL BASHEER"}]
[{"$f":"Data_Sheet!A33","v":"JEC18CS009"},{"$f":"Data_Sheet!B33","v":"AKASH.V"}]
[{"$f":"Data_Sheet!A34","v":"JEC18CS010"},{"$f":"Data_Sheet!B34","v":"AKHIL AZEEZ UPPILAMKUNNATH"}]
[{"$f":"Data_Sheet!A35","v":"JEC18CS011"},{"$f":"Data_Sheet!B35","v":"AKHIL KRISHNA UK"}]
[{"$f":"Data_Sheet!A36","v":"JEC18CS012"},{"$f":"Data_Sheet!B36","v":"ALAN GEORGE"}]
[{"$f":"Data_Sheet!A37","v":"JEC18CS013"},{"$f":"Data_Sheet!B37","v":"ALEN VARGHESE"}]
[{"$f":"Data_Sheet!A38","v":"JEC18CS014"},{"$f":"Data_Sheet!B38","v":"AMAL SEBASTIAN"}]
[{"$f":"Data_Sheet!A39","v":"JEC18CS015"},{"$f":"Data_Sheet!B39","v":"AMAL SONY"}]
[{"$f":"Data_Sheet!A40","v":"JEC18CS016"},{"$f":"Data_Sheet!B40","v":"ANAGHA WILSON"}]
[{"$f":"Data_Sheet!A41","v":"JEC18CS017"},{"$f":"Data_Sheet!B41","v":"ANETTE ANTO"}]
[{"$f":"Data_Sheet!A42","v":"JEC18CS018"},{"$f":"Data_Sheet!B42","v":"ANIT MARY THOMAS"}]
[{"$f":"Data_Sheet!A43","v":"JEC18CS020"},{"$f":"Data_Sheet!B43","v":"ANN THERESA SHAJI"}]
[{"$f":"Data_Sheet!A44","v":"JEC18CS021"},{"$f":"Data_Sheet!B44","v":"ANTONY ROY"}]
[{"$f":"Data_Sheet!A45","v":"JEC18CS022"},{"$f":"Data_Sheet!B45","v":"ANUGRAHA C"}]
[{"$f":"Data_Sheet!A46","v":"JEC18CS023"},{"$f":"Data_Sheet!B46","v":"APARNA.V"}]
[{"$f":"Data_Sheet!A47","v":"JEC18CS024"},{"$f":"Data_Sheet!B47","v":"ARAVIND S KUMAR"}]
[{"$f":"Data_Sheet!A48","v":"JEC18CS025"},{"$f":"Data_Sheet!B48","v":"ARJUN VINOD"}]
[{"$f":"Data_Sheet!A49","v":"JEC18CS026"},{"$f":"Data_Sheet!B49","v":"ARUN VG"}]
[{"$f":"Data_Sheet!A50","v":"JEC18CS027"},{"$f":"Data_Sheet!B50","v":"ASHRUL K"}]
[{"$f":"Data_Sheet!A51","v":"JEC18CS028"},{"$f":"Data_Sheet!B51","v":"ATHIL PAULY"}]
[{"$f":"Data_Sheet!A52","v":"JEC18CS029"},{"$f":"Data_Sheet!B52","v":"ATHIRA K P"}]
[{"$f":"Data_Sheet!A53","v":"JEC18CS030"},{"$f":"Data_Sheet!B53","v":"AWIN ANTO"}]
[{"$f":"Data_Sheet!A54","v":"JEC18CS031"},{"$f":"Data_Sheet!B54","v":"CHARLES JOHNSON"}]
[{"$f":"Data_Sheet!A55","v":"JEC18CS032"},{"$f":"Data_Sheet!B55","v":"CHITTILAPPILLY JOVIA JOHNSON"}]
[{"$f":"Data_Sheet!A56","v":"JEC18CS033"},{"$f":"Data_Sheet!B56","v":"CIYA BABU"}]
[{"$f":"Data_Sheet!A57","v":"JEC18CS034"},{"$f":"Data_Sheet!B57","v":"DAVID SALUS"}]
[{"$f":"Data_Sheet!A58","v":"JEC18CS035"},{"$f":"Data_Sheet!B58","v":"DELICIA REJI"}]
[{"$f":"Data_Sheet!A59","v":"JEC18CS036"},{"$f":"Data_Sheet!B59","v":"DELMA SHAJAN"}]
[{"$f":"Data_Sheet!A60","v":"JEC18CS037"},{"$f":"Data_Sheet!B60","v":"DILBER SHA AP"}]
[{"$f":"Data_Sheet!A61","v":"JEC18CS038"},{"$f":"Data_Sheet!B61","v":"EDWIN T JOY"}]
[{"$f":"Data_Sheet!A62","v":"JEC18CS039"},{"$f":"Data_Sheet!B62","v":"EDWIN WILSON"}]
[{"$f":"Data_Sheet!A63","v":"JEC18CS040"},{"$f":"Data_Sheet!B63","v":"EMMANUEL SHIBU"}]
[{"$f":"Data_Sheet!A64","v":"JEC18CS041"},{"$f":"Data_Sheet!B64","v":"GAYATHRI DINESH"}]
[{"$f":"Data_Sheet!A65","v":"JEC18CS042"},{"$f":"Data_Sheet!B65","v":"GOKUL DAS M"}]
[{"$f":"Data_Sheet!A66","v":"JEC18CS043"},{"$f":"Data_Sheet!B66","v":"G RAMGOPAL"}]
[{"$f":"Data_Sheet!A67","v":"JEC18CS044"},{"$f":"Data_Sheet!B67","v":"HARIES DAVIS"}]
[{"$f":"Data_Sheet!A68","v":"JEC18CS045"},{"$f":"Data_Sheet!B68","v":"HARISANKER P"}]
[{"$f":"Data_Sheet!A69","v":"JEC18CS046"},{"$f":"Data_Sheet!B69","v":"HARSHA.K.S."}]
[{"$f":"Data_Sheet!A70","v":"JEC18CS047"},{"$f":"Data_Sheet!B70","v":"HELNA THOMAS"}]
[{"$f":"Data_Sheet!A71","v":"JEC18CS048"},{"$f":"Data_Sheet!B71","v":"HRIDI KRISHNA.H"}]
[{"$f":"Data_Sheet!A72","v":"JEC18CS049"},{"$f":"Data_Sheet!B72","v":"INDRAJIT R"}]
[{"$f":"Data_Sheet!A73","v":"JEC18CS050"},{"$f":"Data_Sheet!B73","v":"JESWIN JOJY"}]
[{"$f":"Data_Sheet!A74","v":"JEC18CS051"},{"$f":"Data_Sheet!B74","v":"JIBIN A BABU"}]
[{"$f":"Data_Sheet!A75","v":"JEC18CS052"},{"$f":"Data_Sheet!B75","v":"JISSY JOY"}]
[{"$f":"Data_Sheet!A76","v":"JEC18CS053"},{"$f":"Data_Sheet!B76","v":"JOEL JAMES KARIKKANDATHIL"}]
[{"$f":"Data_Sheet!A77","v":"JEC18CS054"},{"$f":"Data_Sheet!B77","v":"JOSE REJI KARIMADATHI"}]
[{"$f":"Data_Sheet!A78","v":"JEC18CS055"},{"$f":"Data_Sheet!B78","v":"JUMANA HASIN"}]
[{"$f":"Data_Sheet!A79","v":"JEC18CS056"},{"$f":"Data_Sheet!B79","v":"KAILASHNATH"}]
[{"$f":"Data_Sheet!A80","v":"JEC18CS057"},{"$f":"Data_Sheet!B80","v":"K AJISHKUMAR"}]
[{"$f":"Data_Sheet!A81","v":"JEC18CS058"},{"$f":"Data_Sheet!B81","v":"KEERTHANA K S"}]
[{"$f":"Data_Sheet!A82","v":"JEC18CS059"},{"$f":"Data_Sheet!B82","v":"KEVIN VARGHESE"}]
[{"$f":"Data_Sheet!A83","v":"JEC18CS060"},{"$f":"Data_Sheet!B83","v":"LAKSHMI SADANANDAN"}]
[{"$f":"Data_Sheet!A84","v":"JEC18CS061"},{"$f":"Data_Sheet!B84","v":"LEYA PALLAN"}]
[{"$f":"Data_Sheet!A85","v":"JEC18CS062"},{"$f":"Data_Sheet!B85","v":"MARVEL BABU"}]
[{"$f":"Data_Sheet!A86","v":"JEC18CS063"},{"$f":"Data_Sheet!B86","v":"MEDWIN PAUL"}]
[{"$f":"Data_Sheet!A87","v":0},{"$f":"Data_Sheet!B87","v":0}]
[{"$f":"Data_Sheet!A88","v":0},{"$f":"Data_Sheet!B88","v":0}]
[{"$f":"Data_Sheet!A89","v":"JEC18CS066"},{"$f":"Data_Sheet!B89","v":"MUHAMMED INSHADH"}]
[{"$f":"Data_Sheet!A90","v":"JEC18CS067"},{"$f":"Data_Sheet!B90","v":"NAIR MIDHUN RAMACHANDRAN"}]
[{"$f":"Data_Sheet!A91","v":"JEC18CS068"},{"$f":"Data_Sheet!B91","v":"NAVEENA ANTONY"}]
[{"$f":"Data_Sheet!A92","v":"JEC18CS069"},{"$f":"Data_Sheet!B92","v":"NITIN MADHU"}]
[{"$f":"Data_Sheet!A93","v":"JEC18CS070"},{"$f":"Data_Sheet!B93","v":"PRATHIUSH ARUN"}]
[{"$f":"Data_Sheet!A94","v":"JEC18CS071"},{"$f":"Data_Sheet!B94","v":"RACHEL CECER"}]
[{"$f":"Data_Sheet!A95","v":"JEC18CS072"},{"$f":"Data_Sheet!B95","v":"RAHUL RAJU"}]
[{"$f":"Data_Sheet!A96","v":"JEC18CS073"},{"$f":"Data_Sheet!B96","v":"RAHUL T RAVI"}]
[{"$f":"Data_Sheet!A97","v":"JEC18CS074"},{"$f":"Data_Sheet!B97","v":"RAPHEAL K MOYALAN"}]
[{"$f":"Data_Sheet!A98","v":"JEC18CS075"},{"$f":"Data_Sheet!B98","v":"RISHIKESH. V"}]
[{"$f":"Data_Sheet!A99","v":"JEC18CS076"},{"$f":"Data_Sheet!B99","v":"ROCKSON T. AUGUSTINE"}]
[{"$f":"Data_Sheet!A100","v":"JEC18CS077"},{"$f":"Data_Sheet!B100","v":"SARATH C P"}]
[{"$f":"Data_Sheet!A101","v":"JEC18CS078"},{"$f":"Data_Sheet!B101","v":"SARATH SASI"}]
[{"$f":"Data_Sheet!A102","v":"JEC18CS079"},{"$f":"Data_Sheet!B102","v":"SHAFNA"}]
[{"$f":"Data_Sheet!A103","v":"JEC18CS080"},{"$f":"Data_Sheet!B103","v":"SHELMY SHABU"}]
[{"$f":"Data_Sheet!A104","v":"JEC18CS081"},{"$f":"Data_Sheet!B104","v":"SHIZA SHIHAB PUVAMPARAMBIL"}]
[{"$f":"Data_Sheet!A105","v":"JEC18CS082"},{"$f":"Data_Sheet!B105","v":"SIJO GEORGE"}]
[{"$f":"Data_Sheet!A106","v":"JEC18CS083"},{"$f":"Data_Sheet!B106","v":"SOURAV K"}]
[{"$f":"Data_Sheet!A107","v":0},{"$f":"Data_Sheet!B107","v":0}]
[{"$f":"Data_Sheet!A108","v":"JEC18CS085"},{"$f":"Data_Sheet!B108","v":"SREEHARI"}]
[{"$f":"Data_Sheet!A109","v":"JEC18CS086"},{"$f":"Data_Sheet!B109","v":"SREEKANTH P"}]
[{"$f":"Data_Sheet!A110","v":"JEC18CS087"},{"$f":"Data_Sheet!B110","v":"SREELEKSHMI H KUMAR"}]
[{"$f":"Data_Sheet!A111","v":"JEC18CS088"},{"$f":"Data_Sheet!B111","v":"SUFAIL BADUSHA.T"}]
[{"$f":"Data_Sheet!A112","v":"JEC18CS089"},{"$f":"Data_Sheet!B112","v":"TIYA THOMAS"}]
[{"$f":"Data_Sheet!A113","v":"JEC18CS090"},{"$f":"Data_Sheet!B113","v":"TOMSUN PAVOO P"}]
[{"$f":"Data_Sheet!A114","v":"JEC18CS091"},{"$f":"Data_Sheet!B114","v":"ULLAS. S"}]
[{"$f":"Data_Sheet!A115","v":"JEC18CS092"},{"$f":"Data_Sheet!B115","v":"VAISHNAV M"}]
[{"$f":"Data_Sheet!A116","v":"JEC18CS093"},{"$f":"Data_Sheet!B116","v":"VANI PRAKASHAN CHOYYAN"}]
[]
["Total Marks scored for the Question",null,null,{"$f":"IF(D$22<>\"\",IF(SUM(D25:INDIRECT(D138))>=0,SUM(D25:INDIRECT(D138)),\"\"),\"\")","v":0},{"$f":"IF(E$22<>\"\",IF(SUM(E25:INDIRECT(E138))>=0,SUM(E25:INDIRECT(E138)),\"\"),\"\")","v":0},{"$f":"IF(F$22<>\"\",IF(SUM(F25:INDIRECT(F138))>=0,SUM(F25:INDIRECT(F138)),\"\"),\"\")","v":0},{"$f":"IF(G$22<>\"\",IF(SUM(G25:INDIRECT(G138))>=0,SUM(G25:INDIRECT(G138)),\"\"),\"\")","v":0},{"$f":"IF(H$22<>\"\",IF(SUM(H25:INDIRECT(H138))>=0,SUM(H25:INDIRECT(H138)),\"\"),\"\")","v":0}]
["No. of Students who attended the Question",null,null,{"$f":"IF(D$22<>\"\",IF(COUNT(D25:INDIRECT(D138))>=0,COUNT(D25:INDIRECT(D138)),\"\"),\"\")","v":0},{"$f":"IF(E$22<>\"\",IF(COUNT(E25:INDIRECT(E138))>=0,COUNT(E25:INDIRECT(E138)),\"\"),\"\")","v":0},{"$f":"IF(F$22<>\"\",IF(COUNT(F25:INDIRECT(F138))>=0,COUNT(F25:INDIRECT(F138)),\"\"),\"\")","v":0},{"$f":"IF(G$22<>\"\",IF(COUNT(G25:INDIRECT(G138))>=0,COUNT(G25:INDIRECT(G138)),\"\"),\"\")","v":0},{"$f":"IF(H$22<>\"\",IF(COUNT(H25:INDIRECT(H138))>=0,COUNT(H25:INDIRECT(H138)),\"\"),\"\")","v":0}]
["Difficulty Level marks of the Question",null,null,{"$f":"IF(D21*D22/100=0,\"\",D21*D22/100)","v":3},3,3,3,3]
["No. of Students who scored above the Difficulty Level",null,null,{"$f":"IF(COUNTIF(D25:INDIRECT(D138),\">=\"&D120)=0,\"\",COUNTIF(D25:INDIRECT(D138),\">=\"&D120))","v":""},{"$f":"IF(COUNTIF(E25:INDIRECT(E138),\">=\"&E120)=0,\"\",COUNTIF(E25:INDIRECT(E138),\">=\"&E120))","v":""},{"$f":"IF(COUNTIF(F25:INDIRECT(F138),\">=\"&F120)=0,\"\",COUNTIF(F25:INDIRECT(F138),\">=\"&F120))","v":""},{"$f":"IF(COUNTIF(G25:INDIRECT(G138),\">=\"&G120)=0,\"\",COUNTIF(G25:INDIRECT(G138),\">=\"&G120))","v":""},{"$f":"IF(COUNTIF(H25:INDIRECT(H138),\">=\"&H120)=0,\"\",COUNTIF(H25:INDIRECT(H138),\">=\"&H120))","v":""}]
["% of Students who scored above the Difficulty Level",null,null,{"$f":"IFERROR(ROUND(D121/D119*100,2),\"\")","v":""},{"$f":"IFERROR(ROUND(E121/E119*100,2),\"\")","v":""},{"$f":"IFERROR(ROUND(F121/F119*100,2),\"\")","v":""},{"$f":"IFERROR(ROUND(G121/G119*100,2),\"\")","v":""},{"$f":"IFERROR(ROUND(H121/H119*100,2),\"\")","v":""}]
[null,null,null,{"$f":"IF(D122=\"\",0,IF(D122>=80,3,IF(D122>=70,2,IF(D122>=60,1,0))))","v":0},{"$f":"IF(E122=\"\",0,IF(E122>=80,3,IF(E122>=70,2,IF(E122>=60,1,0))))","v":0},{"$f":"IF(F122=\"\",0,IF(F122>=80,3,IF(F122>=70,2,IF(F122>=60,1,0))))","v":0},{"$f":"IF(G122=\"\",0,IF(G122>=80,3,IF(G122>=70,2,IF(G122>=60,1,0))))","v":0},{"$f":"IF(H122=\"\",0,IF(H122>=80,3,IF(H122>=70,2,IF(H122>=60,1,0))))","v":0},"Marks",null,null,null,"T_Marks","S_Marks","Students","Level","Above","Above %","Attainment"]
[null,{"$f":"IF(Data_Sheet!A119<>\"\",\"Total Attainment level for \"&Data_Sheet!A119&\" :\",\"\")","v":"Total Attainment level for CO1 :"},{"$f":"IF(Data_Sheet!A119<>\"\",L124,\"\")","v":""},{"$f":"IFERROR((IF(ISNUMBER(SEARCH(\"1\", D$19)),D$21,\"0\")),\"0\")*D123","v":0},{"$f":"IFERROR((IF(ISNUMBER(SEARCH(\"1\", E$19)),E$21,\"0\")),\"0\")*E123","v":0},{"$f":"IFERROR((IF(ISNUMBER(SEARCH(\"1\", F$19)),F$21,\"0\")),\"0\")*F123","v":0},{"$f":"IFERROR((IF(ISNUMBER(SEARCH(\"1\", G$19)),G$21,\"0\")),\"0\")*G123","v":0},{"$f":"IFERROR((IF(ISNUMBER(SEARCH(\"1\", H$19)),H$21,\"0\")),\"0\")*H123","v":0},{"$f":"I141","v":0},null,null,{"$f":"IF(I124=0,\"\",ROUND(SUM(D124:H124)/I124,2))","v":""},{"$f":"I141","v":0},{"$f":"I148","v":0},{"$f":"I155","v":0},{"$f":"I162","v":0},{"$f":"I169","v":0},{"$f":"IFERROR(ROUND(Q124/O124*100,2),\"\")","v":""},{"$f":"IF(R124=\"\",\"\",IF(R124>=80,3,IF(R124>=70,2,IF(R124>=60,1,0))))","v":""}]
[null,{"$f":"IF(Data_Sheet!A120<>\"\",\"Total Attainment level for \"&Data_Sheet!A120&\" :\",\"\")","v":"Total Attainment level for CO2 :"},{"$f":"IF(Data_Sheet!A120<>\"\",L125,\"\")","v":""},{"$f":"IFERROR((IF(ISNUMBER(SEARCH(\"2\", D$19)),D$21,\"0\")),\"0\")*D123","v":0},{"$f":"IFERROR((IF(ISNUMBER(SEARCH(\"2\", E$19)),E$21,\"0\")),\"0\")*E123","v":0},{"$f":"IFERROR((IF(ISNUMBER(SEARCH(\"2\", F$19)),F$21,\"0\")),\"0\")*F123","v":0},{"$f":"IFERROR((IF(ISNUMBER(SEARCH(\"2\", G$19)),G$21,\"0\")),\"0\")*G123","v":0},{"$f":"IFERROR((IF(ISNUMBER(SEARCH(\"2\", H$19)),H$21,\"0\")),\"0\")*H123","v":0},0,null,null,"",0,0,0,0,0,"",""]
[null,{"$f":"IF(Data_Sheet!A121<>\"\",\"Total Attainment level for \"&Data_Sheet!A121&\" :\",\"\")","v":"Total Attainment level for CO3 :"},{"$f":"IF(Data_Sheet!A121<>\"\",L126,\"\")","v":0},{"$f":"IFERROR((IF(ISNUMBER(SEARCH(\"3\", D$19)),D$21,\"0\")),\"0\")*D123","v":0},{"$f":"IFERROR((IF(ISNUMBER(SEARCH(\"3\", E$19)),E$21,\"0\")),\"0\")*E123","v":0},{"$f":"IFERROR((IF(ISNUMBER(SEARCH(\"3\", F$19)),F$21,\"0\")),\"0\")*F123","v":0},{"$f":"IFERROR((IF(ISNUMBER(SEARCH(\"3\", G$19)),G$21,\"0\")),\"0\")*G123","v":0},{"$f":"IFERROR((IF(ISNUMBER(SEARCH(\"3\", H$19)),H$21,\"0\")),\"0\")*H123","v":0},10,null,null,0,10,0,0,6,0,"",""]
[null,{"$f":"IF(Data_Sheet!A122<>\"\",\"Total Attainment level for \"&Data_Sheet!A122&\" :\",\"\")","v":"Total Attainment level for CO4 :"},{"$f":"IF(Data_Sheet!A122<>\"\",L127,\"\")","v":0},{"$f":"IFERROR((IF(ISNUMBER(SEARCH(\"4\", D$19)),D$21,\"0\")),\"0\")*D123","v":0},{"$f":"IFERROR((IF(ISNUMBER(SEARCH(\"4\", E$19)),E$21,\"0\")),\"0\")*E123","v":0},{"$f":"IFERROR((IF(ISNUMBER(SEARCH(\"4\", F$19)),F$21,\"0\")),\"0\")*F123","v":0},{"$f":"IFERROR((IF(ISNUMBER(SEARCH(\"4\", G$19)),G$21,\"0\")),\"0\")*G123","v":0},{"$f":"IFERROR((IF(ISNUMBER(SEARCH(\"4\", H$19)),H$21,\"0\")),\"0\")*H123","v":0},10,null,null,0,10,0,0,6,0,"",""]
[null,{"$f":"IF(Data_Sheet!A123<>\"\",\"Total Attainment level for \"&Data_Sheet!A123&\" :\",\"\")","v":"Total Attainment level for CO5 :"},{"$f":"IF(Data_Sheet!A123<>\"\",L128,\"\")","v":0},{"$f":"IFERROR((IF(ISNUMBER(SEARCH(\"5\", D$19)),D$21,\"0\")),\"0\")*D123","v":0},{"$f":"IFERROR((IF(ISNUMBER(SEARCH(\"5\", E$19)),E$21,\"0\")),\"0\")*E123","v":0},{"$f":"IFERROR((IF(ISNUMBER(SEARCH(\"5\", F$19)),F$21,\"0\")),\"0\")*F123","v":0},{"$f":"IFERROR((IF(ISNUMBER(SEARCH(\"5\", G$19)),G$21,\"0\")),\"0\")*G123","v":0},{"$f":"IFERROR((IF(ISNUMBER(SEARCH(\"5\", H$19)),H$21,\"0\")),\"0\")*H123","v":0},5,null,null,0,5,0,0,3,0,"",""]
[null,{"$f":"IF(Data_Sheet!A124<>\"\",\"Total Attainment level for \"&Data_Sheet!A124&\" :\",\"\")","v":"Total Attainment level for CO6 :"},{"$f":"IF(Data_Sheet!A124<>\"\",L129,\"\")","v":""},{"$f":"IFERROR((IF(ISNUMBER(SEARCH(\"6\", D$19)),D$21,\"0\")),\"0\")*D123","v":0},{"$f":"IFERROR((IF(ISNUMBER(SEARCH(\"6\", E$19)),E$21,\"0\")),\"0\")*E123","v":0},{"$f":"IFERROR((IF(ISNUMBER(SEARCH(\"6\", F$19)),F$21,\"0\")),\"0\")*F123","v":0},{"$f":"IFERROR((IF(ISNUMBER(SEARCH(\"6\", G$19)),G$21,\"0\")),\"0\")*G123","v":0},{"$f":"IFERROR((IF(ISNUMBER(SEARCH(\"6\", H$19)),H$21,\"0\")),\"0\")*H123","v":0},0,null,null,"",0,0,0,0,0,"",""]
[]
[{"$f":"Data_Sheet!A127","v":"Attainment Level 1: 60% students scoring more than 60% of the Total Marks"}]
[{"$f":"Data_Sheet!A128","v":"Attainment Level 2: 70% students scoring more than 60% of the Total Marks"}]
[{"$f":"Data_Sheet!A129","v":"Attainment Level 3: 80% students scoring more than 60% of the Total Marks"}]
[]
[null,{"$f":"Data_Sheet!B10","v":"Name of Faculty : "},{"$f":"Data_Sheet!B11","v":"Namitha T N"}]
[null,{"$f":"Data_Sheet!B136","v":"Dated Signature :  "}]
[]
[null,"Last Row Count",{"$f":"ROW(A118)-2","v":116},{"$f":"SUBSTITUTE(ADDRESS(1,COLUMN(D1),2),\"1\",\"\")&$C$138","v":"D$116"},{"$f":"\"E\"&$C$138","v":"E116"},{"$f":"SUBSTITUTE(ADDRESS(1,COLUMN(F1),2),\"1\",\"\")&$C$138","v":"F$116"},{"$f":"SUBSTITUTE(ADDRESS(1,COLUMN(G1),2),\"1\",\"\")&$C$138","v":"G$116"},{"$f":"SUBSTITUTE(ADDRESS(1,COLUMN(H1),2),\"1\",\"\")&$C$138","v":"H$116"}]
[]
[]
[null,null,"CO1",{"$f":"IFERROR((IF(ISNUMBER(SEARCH(\"1\", D$19)),D$21,\"0\")),\"0\")","v":"0"},{"$f":"IFERROR((IF(ISNUMBER(SEARCH(\"1\", E$19)),E$21,\"0\")),\"0\")","v":"0"},"0","0","0",{"$f":"IFERROR(SUM($D141:INDIRECT($L141)),\"0\")","v":0},null,null,{"$f":"SUBSTITUTE(ADDRESS(1,N141,4),1,\"\")&ROW($I141)","v":"H141"},{"$f":"COUNTIF($D$20:INDIRECT($O141),\"*1*\")","v":0},{"$f":"COLUMN($I$19)-1","v":8},{"$f":"SUBSTITUTE(ADDRESS(1,N141,4),1,\"\")&ROW($I$19)+1","v":"H20"},"Total Marks"]
[null,null,"CO2",{"$f":"IFERROR((IF(ISNUMBER(SEARCH(\"2\", D$19)),D$21,\"0\")),\"0\")","v":"0"},{"$f":"IFERROR((IF(ISNUMBER(SEARCH(\"2\", E$19)),E$21,\"0\")),\"0\")","v":"0"},"0","0","0",{"$f":"IFERROR(SUM($D142:INDIRECT($L142)),\"0\")","v":0},null,null,"H142",{"$f":"COUNTIF($D$20:INDIRECT($O142),\"*2*\")","v":0},8,"H20"]
[null,null,"CO3",{"$f":"IFERROR((IF(ISNUMBER(SEARCH(\"3\", D$19)),D$21,\"0\")),\"0\")","v":5},{"$f":"IFERROR((IF(ISNUMBER(SEARCH(\"3\", E$19)),E$21,\"0\")),\"0\")","v":5},"0","0","0",{"$f":"IFERROR(SUM($D143:INDIRECT($L143)),\"0\")","v":10},null,null,"H143",{"$f":"COUNTIF($D$20:INDIRECT($O143),\"*3*\")","v":0},8,"H20"]
[null,null,"CO4",{"$f":"IFERROR((IF(ISNUMBER(SEARCH(\"4\", D$19)),D$21,\"0\")),\"0\")","v":"0"},{"$f":"IFERROR((IF(ISNUMBER(SEARCH(\"4\", E$19)),E$21,\"0\")),\"0\")","v":"0"},5,5,"0",{"$f":"IFERROR(SUM($D144:INDIRECT($L144)),\"0\")","v":10},null,null,"H144",{"$f":"COUNTIF($D$20:INDIRECT($O144),\"*4*\")","v":0},8,"H20"]
[null,null,"CO5",{"$f":"IFERROR((IF(ISNUMBER(SEARCH(\"5\", D$19)),D$21,\"0\")),\"0\")","v":"0"},{"$f":"IFERROR((IF(ISNUMBER(SEARCH(\"5\", E$19)),E$21,\"0\")),\"0\")","v":"0"},"0","0",5,{"$f":"IFERROR(SUM($D145:INDIRECT($L145)),\"0\")","v":5},null,null,"H145",{"$f":"COUNTIF($D$20:INDIRECT($O145),\"*5*\")","v":0},8,"H20"]
[null,null,"CO6",{"$f":"IFERROR((IF(ISNUMBER(SEARCH(\"6\", D$19)),D$21,\"0\")),\"0\")","v":"0"},{"$f":"IFERROR((IF(ISNUMBER(SEARCH(\"6\", E$19)),E$21,\"0\")),\"0\")","v":"0"},"0","0","0",{"$f":"IFERROR(SUM($D146:INDIRECT($L146)),\"0\")","v":0},null,null,"H146",{"$f":"COUNTIF($D$20:INDIRECT($O146),\"*6*\")","v":0},8,"H20"]
[]
[null,null,"CO1",{"$f":"IFERROR((IF(ISNUMBER(SEARCH(\"1\", D$19)),D$118,\"0\")),\"0\")","v":"0"},{"$f":"IFERROR((IF(ISNUMBER(SEARCH(\"1\", E$19)),E$118,\"0\")),\"0\")","v":"0"},"0","0","0",{"$f":"IFERROR(SUM($D148:INDIRECT($L148)),\"0\")","v":0},null,null,{"$f":"SUBSTITUTE(ADDRESS(1,N148,4),1,\"\")&ROW($I148)","v":"H148"},{"$f":"COUNTIF($D$20:INDIRECT($O148),\"*1*\")","v":0},{"$f":"COLUMN($I$19)-1","v":8},{"$f":"SUBSTITUTE(ADDRESS(1,N148,4),1,\"\")&ROW($I$19)+1","v":"H20"},"Total Marks Scored"]
[null,null,"CO2",{"$f":"IFERROR((IF(ISNUMBER(SEARCH(\"2\", D$19)),D$118,\"0\")),\"0\")","v":"0"},{"$f":"IFERROR((IF(ISNUMBER(SEARCH(\"2\", E$19)),E$118,\"0\")),\"0\")","v":"0"},"0","0","0",{"$f":"IFERROR(SUM($D149:INDIRECT($L149)),\"0\")","v":0},null,null,"H149",{"$f":"COUNTIF($D$20:INDIRECT($O149),\"*2*\")","v":0},8,"H20"]
[null,null,"CO3",{"$f":"IFERROR((IF(ISNUMBER(SEARCH(\"3\", D$19)),D$118,\"0\")),\"0\")","v":0},{"$f":"IFERROR((IF(ISNUMBER(SEARCH(\"3\", E$19)),E$118,\"0\")),\"0\")","v":0},"0","0","0",{"$f":"IFERROR(SUM($D150:INDIRECT($L150)),\"0\")","v":0},null,null,"H150",{"$f":"COUNTIF($D$20:INDIRECT($O150),\"*3*\")","v":0},8,"H20"]
[null,null,"CO4",{"$f":"IFERROR((IF(ISNUMBER(SEARCH(\"4\", D$19)),D$118,\"0\")),\"0\")","v":"0"},{"$f":"IFERROR((IF(ISNUMBER(SEARCH(\"4\", E$19)),E$118,\"0\")),\"0\")","v":"0"},0,0,"0",{"$f":"IFERROR(SUM($D151:INDIRECT($L151)),\"0\")","v":0},null,null,"H151",{"$f":"COUNTIF($D$20:INDIRECT($O151),\"*4*\")","v":0},8,"H20"]
[null,null,"CO5",{"$f":"IFERROR((IF(ISNUMBER(SEARCH(\"5\", D$19)),D$118,\"0\")),\"0\")","v":"0"},{"$f":"IFERROR((IF(ISNUMBER(SEARCH(\"5\", E$19)),E$118,\"0\")),\"0\")","v":"0"},"0","0",0,{"$f":"IFERROR(SUM($D152:INDIRECT($L152)),\"0\")","v":0},null,null,"H152",{"$f":"COUNTIF($D$20:INDIRECT($O152),\"*5*\")","v":0},8,"H20"]
[null,null,"CO6",{"$f":"IFERROR((IF(ISNUMBER(SEARCH(\"6\", D$19)),D$118,\"0\")),\"0\")","v":"0"},{"$f":"IFERROR((IF(ISNUMBER(SEARCH(\"6\", E$19)),E$118,\"0\")),\"0\")","v":"0"},"0","0","0",{"$f":"IFERROR(SUM($D153:INDIRECT($L153)),\"0\")","v":0},null,null,"H153",{"$f":"COUNTIF($D$20:INDIRECT($O153),\"*6*\")","v":0},8,"H20"]
[]
[null,null,"CO1",{"$f":"IFERROR((IF(ISNUMBER(SEARCH(\"1\", D$19)),D$119,\"0\")),\"0\")","v":"0"},{"$f":"IFERROR((IF(ISNUMBER(SEARCH(\"1\", E$19)),E$119,\"0\")),\"0\")","v":"0"},"0","0","0",{"$f":"IFERROR(SUM($D155:INDIRECT($L155)),\"0\")","v":0},null,null,{"$f":"SUBSTITUTE(ADDRESS(1,N155,4),1,\"\")&ROW($I155)","v":"H155"},{"$f":"COUNTIF($D$20:INDIRECT($O155),\"*1*\")","v":0},{"$f":"COLUMN($I$19)-1","v":8},{"$f":"SUBSTITUTE(ADDRESS(1,N155,4),1,\"\")&ROW($I$19)+1","v":"H20"},"No of Studdents Attended"]
[null,null,"CO2",{"$f":"IFERROR((IF(ISNUMBER(SEARCH(\"2\", D$19)),D$119,\"0\")),\"0\")","v":"0"},{"$f":"IFERROR((IF(ISNUMBER(SEARCH(\"2\", E$19)),E$119,\"0\")),\"0\")","v":"0"},"0","0","0",{"$f":"IFERROR(SUM($D156:INDIRECT($L156)),\"0\")","v":0},null,null,"H156",{"$f":"COUNTIF($D$20:INDIRECT($O156),\"*2*\")","v":0},8,"H20"]
[null,null,"CO3",{"$f":"IFERROR((IF(ISNUMBER(SEARCH(\"3\", D$19)),D$119,\"0\")),\"0\")","v":0},{"$f":"IFERROR((IF(ISNUMBER(SEARCH(\"3\", E$19)),E$119,\"0\")),\"0\")","v":0},"0","0","0",{"$f":"IFERROR(SUM($D157:INDIRECT($L157)),\"0\")","v":0},null,null,"H157",{"$f":"COUNTIF($D$20:INDIRECT($O157),\"*3*\")","v":0},8,"H20"]
[null,null,"CO4",{"$f":"IFERROR((IF(ISNUMBER(SEARCH(\"4\", D$19)),D$119,\"0\")),\"0\")","v":"0"},{"$f":"IFERROR((IF(ISNUMBER(SEARCH(\"4\", E$19)),E$119,\"0\")),\"0\")","v":"0"},0,0,"0",{"$f":"IFERROR(SUM($D158:INDIRECT($L158)),\"0\")","v":0},null,null,"H158",{"$f":"COUNTIF($D$20:INDIRECT($O158),\"*4*\")","v":0},8,"H20"]
[null,null,"CO5",{"$f":"IFERROR((IF(ISNUMBER(SEARCH(\"5\", D$19)),D$119,\"0\")),\"0\")","v":"0"},{"$f":"IFERROR((IF(ISNUMBER(SEARCH(\"5\", E$19)),E$119,\"0\")),\"0\")","v":"0"},"0","0",0,{"$f":"IFERROR(SUM($D159:INDIRECT($L159)),\"0\")","v":0},null,null,"H159",{"$f":"COUNTIF($D$20:INDIRECT($O159),\"*5*\")","v":0},8,"H20"]
[null,null,"CO6",{"$f":"IFERROR((IF(ISNUMBER(SEARCH(\"6\", D$19)),D$119,\"0\")),\"0\")","v":"0"},{"$f":"IFERROR((IF(ISNUMBER(SEARCH(\"6\", E$19)),E$119,\"0\")),\"0\")","v":"0"},"0","0","0",{"$f":"IFERROR(SUM($D160:INDIRECT($L160)),\"0\")","v":0},null,null,"H160",{"$f":"COUNTIF($D$20:INDIRECT($O160),\"*6*\")","v":0},8,"H20"]
[]
[null,null,"CO1",{"$f":"IFERROR((IF(ISNUMBER(SEARCH(\"1\", D$19)),D$120,\"0\")),\"0\")","v":"0"},{"$f":"IFERROR((IF(ISNUMBER(SEARCH(\"1\", E$19)),E$120,\"0\")),\"0\")","v":"0"},"0","0","0",{"$f":"IFERROR(SUM($D162:INDIRECT($L162)),\"0\")","v":0},null,null,{"$f":"SUBSTITUTE(ADDRESS(1,N162,4),1,\"\")&ROW($I162)","v":"H162"},{"$f":"COUNTIF($D$20:INDIRECT($O162),\"*1*\")","v":0},{"$f":"COLUMN($I$19)-1","v":8},{"$f":"SUBSTITUTE(ADDRESS(1,N162,4),1,\"\")&ROW($I$19)+1","v":"H20"},"Difficulty Level"]
[null,null,"CO2",{"$f":"IFERROR((IF(ISNUMBER(SEARCH(\"2\", D$19)),D$120,\"0\")),\"0\")","v":"0"},{"$f":"IFERROR((IF(ISNUMBER(SEARCH(\"2\", E$19)),E$120,\"0\")),\"0\")","v":"0"},"0","0","0",{"$f":"IFERROR(SUM($D163:INDIRECT($L163)),\"0\")","v":0},null,null,"H163",{"$f":"COUNTIF($D$20:INDIRECT($O163),\"*2*\")","v":0},8,"H20"]
[null,null,"CO3",{"$f":"IFERROR((IF(ISNUMBER(SEARCH(\"3\", D$19)),D$120,\"0\")),\"0\")","v":3},{"$f":"IFERROR((IF(ISNUMBER(SEARCH(\"3\", E$19)),E$120,\"0\")),\"0\")","v":3},"0","0","0",{"$f":"IFERROR(SUM($D164:INDIRECT($L164)),\"0\")","v":6},null,null,"H164",{"$f":"COUNTIF($D$20:INDIRECT($O164),\"*3*\")","v":0},8,"H20"]
[null,null,"CO4",{"$f":"IFERROR((IF(ISNUMBER(SEARCH(\"4\", D$19)),D$120,\"0\")),\"0\")","v":"0"},{"$f":"IFERROR((IF(ISNUMBER(SEARCH(\"4\", E$19)),E$120,\"0\")),\"0\")","v":"0"},3,3,"0",{"$f":"IFERROR(SUM($D165:INDIRECT($L165)),\"0\")","v":6},null,null,"H165",{"$f":"COUNTIF($D$20:INDIRECT($O165),\"*4*\")","v":0},8,"H20"]
[null,null,"CO5",{"$f":"IFERROR((IF(ISNUMBER(SEARCH(\"5\", D$19)),D$120,\"0\")),\"0\")","v":"0"},{"$f":"IFERROR((IF(ISNUMBER(SEARCH(\"5\", E$19)),E$120,\"0\")),\"0\")","v":"0"},"0","0",3,{"$f":"IFERROR(SUM($D166:INDIRECT($L166)),\"0\")","v":3},null,null,"H166",{"$f":"COUNTIF($D$20:INDIRECT($O166),\"*5*\")","v":0},8,"H20"]
[null,null,"CO6",{"$f":"IFERROR((IF(ISNUMBER(SEARCH(\"6\", D$19)),D$120,\"0\")),\"0\")","v":"0"},{"$f":"IFERROR((IF(ISNUMBER(SEARCH(\"6\", E$19)),E$120,\"0\")),\"0\")","v":"0"},"0","0","0",{"$f":"IFERROR(SUM($D167:INDIRECT($L167)),\"0\")","v":0},null,null,"H167",{"$f":"COUNTIF($D$20:INDIRECT($O167),\"*6*\")","v":0},8,"H20"]
[]
[null,null,"CO1",{"$f":"IFERROR((IF(ISNUMBER(SEARCH(\"1\", D$19)),D$121,\"0\")),\"0\")","v":"0"},{"$f":"IFERROR((IF(ISNUMBER(SEARCH(\"1\", E$19)),E$121,\"0\")),\"0\")","v":"0"},"0","0","0",{"$f":"IFERROR(SUM($D169:INDIRECT($L169)),\"0\")","v":0},null,null,{"$f":"SUBSTITUTE(ADDRESS(1,N169,4),1,\"\")&ROW($I169)","v":"H169"},{"$f":"COUNTIF($D$20:INDIRECT($O169),\"*1*\")","v":0},{"$f":"COLUMN($I$19)-1","v":8},{"$f":"SUBSTITUTE(ADDRESS(1,N169,4),1,\"\")&ROW($I$19)+1","v":"H20"},"No of Studdents Above Difficulty Level"]
[null,null,"CO2",{"$f":"IFERROR((IF(ISNUMBER(SEARCH(\"2\", D$19)),D$121,\"0\")),\"0\")","v":"0"},{"$f":"IFERROR((IF(ISNUMBER(SEARCH(\"2\", E$19)),E$121,\"0\")),\"0\")","v":"0"},"0","0","0",{"$f":"IFERROR(SUM($D170:INDIRECT($L170)),\"0\")","v":0},null,null,"H170",{"$f":"COUNTIF($D$20:INDIRECT($O170),\"*2*\")","v":0},8,"H20"]
[null,null,"CO3",{"$f":"IFERROR((IF(ISNUMBER(SEARCH(\"3\", D$19)),D$121,\"0\")),\"0\")","v":""},{"$f":"IFERROR((IF(ISNUMBER(SEARCH(\"3\", E$19)),E$121,\"0\")),\"0\")","v":""},"0","0","0",{"$f":"IFERROR(SUM($D171:INDIRECT($L171)),\"0\")","v":0},null,null,"H171",{"$f":"COUNTIF($D$20:INDIRECT($O171),\"*3*\")","v":0},8,"H20"]
[null,null,"CO4",{"$f":"IFERROR((IF(ISNUMBER(SEARCH(\"4\", D$19)),D$121,\"0\")),\"0\")","v":"0"},{"$f":"IFERROR((IF(ISNUMBER(SEARCH(\"4\", E$19)),E$121,\"0\")),\"0\")","v":"0"},"","","0",{"$f":"IFERROR(SUM($D172:INDIRECT($L172)),\"0\")","v":0},null,null,"H172",{"$f":"COUNTIF($D$20:INDIRECT($O172),\"*4*\")","v":0},8,"H20"]
[null,null,"CO5",{"$f":"IFERROR((IF(ISNUMBER(SEARCH(\"5\", D$19)),D$121,\"0\")),\"0\")","v":"0"},{"$f":"IFERROR((IF(ISNUMBER(SEARCH(\"5\", E$19)),E$121,\"0\")),\"0\")","v":"0"},"0","0","",{"$f":"IFERROR(SUM($D173:INDIRECT($L173)),\"0\")","v":0},null,null,"H173",{"$f":"COUNTIF($D$20:INDIRECT($O173),\"*5*\")","v":0},8,"H20"]
[null,null,"CO6",{"$f":"IFERROR((IF(ISNUMBER(SEARCH(\"6\", D$19)),D$121,\"0\")),\"0\")","v":"0"},{"$f":"IFERROR((IF(ISNUMBER(SEARCH(\"6\", E$19)),E$121,\"0\")),\"0\")","v":"0"},"0","0","0",{"$f":"IFERROR(SUM($D174:INDIRECT($L174)),\"0\")","v":0},null,null,"H174",{"$f":"COUNTIF($D$20:INDIRECT($O174),\"*6*\")","v":0},8,"H20"]
[]
[null,null,1,{"$f":"IFERROR((IF(ISNUMBER(SEARCH(\"1\", D$20)),D$21/IF(LEN(D20)=16,6,IF(LEN(D20)=13,5,IF(LEN(D20)=10,4,IF(LEN(D20)=7,3,IF(LEN(D20)=4,2,1))))),\"0\")),\"0\")","v":"0"},{"$f":"IFERROR((IF(ISNUMBER(SEARCH(\"1\", E$20)),E$21/IF(LEN(E20)=16,6,IF(LEN(E20)=13,5,IF(LEN(E20)=10,4,IF(LEN(E20)=7,3,IF(LEN(E20)=4,2,1))))),\"0\")),\"0\")","v":"0"},{"$f":"IFERROR((IF(ISNUMBER(SEARCH(\"1\", F$20)),F$21/IF(LEN(F20)=16,6,IF(LEN(F20)=13,5,IF(LEN(F20)=10,4,IF(LEN(F20)=7,3,IF(LEN(F20)=4,2,1))))),\"0\")),\"0\")","v":"0"},{"$f":"IFERROR((IF(ISNUMBER(SEARCH(\"1\", G$20)),G$21/IF(LEN(G20)=16,6,IF(LEN(G20)=13,5,IF(LEN(G20)=10,4,IF(LEN(G20)=7,3,IF(LEN(G20)=4,2,1))))),\"0\")),\"0\")","v":"0"},{"$f":"IFERROR((IF(ISNUMBER(SEARCH(\"1\", H$20)),H$21/IF(LEN(H20)=16,6,IF(LEN(H20)=13,5,IF(LEN(H20)=10,4,IF(LEN(H20)=7,3,IF(LEN(H20)=4,2,1))))),\"0\")),\"0\")","v":"0"},{"$f":"IFERROR(SUM($D176:INDIRECT($L176)),\"0\")","v":0},null,null,{"$f":"SUBSTITUTE(ADDRESS(1,N176,4),1,\"\")&ROW($I176)","v":"H176"},{"$f":"COUNTIF($D$20:INDIRECT($O176),\"1\")","v":0},{"$f":"COLUMN($I$18)-1","v":8},{"$f":"SUBSTITUTE(ADDRESS(1,N176,4),1,\"\")&ROW($I$19)+1","v":"H20"}]
[null,null,2,{"$f":"IFERROR((IF(ISNUMBER(SEARCH(\"2\", D$20)),D$21/IF(LEN(D20)=16,6,IF(LEN(D20)=13,5,IF(LEN(D20)=10,4,IF(LEN(D20)=7,3,IF(LEN(D20)=4,2,1))))),\"0\")),\"0\")","v":"0"},{"$f":"IFERROR((IF(ISNUMBER(SEARCH(\"2\", E$20)),E$21/IF(LEN(E20)=16,6,IF(LEN(E20)=13,5,IF(LEN(E20)=10,4,IF(LEN(E20)=7,3,IF(LEN(E20)=4,2,1))))),\"0\")),\"0\")","v":"0"},{"$f":"IFERROR((IF(ISNUMBER(SEARCH(\"2\", F$20)),F$21/IF(LEN(F20)=16,6,IF(LEN(F20)=13,5,IF(LEN(F20)=10,4,IF(LEN(F20)=7,3,IF(LEN(F20)=4,2,1))))),\"0\")),\"0\")","v":"0"},{"$f":"IFERROR((IF(ISNUMBER(SEARCH(\"2\", G$20)),G$21/IF(LEN(G20)=16,6,IF(LEN(G20)=13,5,IF(LEN(G20)=10,4,IF(LEN(G20)=7,3,IF(LEN(G20)=4,2,1))))),\"0\")),\"0\")","v":"0"},{"$f":"IFERROR((IF(ISNUMBER(SEARCH(\"2\", H$20)),H$21/IF(LEN(H20)=16,6,IF(LEN(H20)=13,5,IF(LEN(H20)=10,4,IF(LEN(H20)=7,3,IF(LEN(H20)=4,2,1))))),\"0\")),\"0\")","v":"0"},{"$f":"IFERROR(SUM($D177:INDIRECT($L177)),\"0\")","v":0},null,null,{"$f":"SUBSTITUTE(ADDRESS(1,N177,4),1,\"\")&ROW($I177)","v":"H177"},{"$f":"COUNTIF($D$20:INDIRECT($O177),\"2\")","v":0},8,"H20"]
[null,null,3,{"$f":"IFERROR((IF(ISNUMBER(SEARCH(\"3\", D$20)),D$21/IF(LEN(D20)=16,6,IF(LEN(D20)=13,5,IF(LEN(D20)=10,4,IF(LEN(D20)=7,3,IF(LEN(D20)=4,2,1))))),\"0\")),\"0\")","v":"0"},{"$f":"IFERROR((IF(ISNUMBER(SEARCH(\"3\", E$20)),E$21/IF(LEN(E20)=16,6,IF(LEN(E20)=13,5,IF(LEN(E20)=10,4,IF(LEN(E20)=7,3,IF(LEN(E20)=4,2,1))))),\"0\")),\"0\")","v":"0"},{"$f":"IFERROR((IF(ISNUMBER(SEARCH(\"3\", F$20)),F$21/IF(LEN(F20)=16,6,IF(LEN(F20)=13,5,IF(LEN(F20)=10,4,IF(LEN(F20)=7,3,IF(LEN(F20)=4,2,1))))),\"0\")),\"0\")","v":"0"},{"$f":"IFERROR((IF(ISNUMBER(SEARCH(\"3\", G$20)),G$21/IF(LEN(G20)=16,6,IF(LEN(G20)=13,5,IF(LEN(G20)=10,4,IF(LEN(G20)=7,3,IF(LEN(G20)=4,2,1))))),\"0\")),\"0\")","v":"0"},{"$f":"IFERROR((IF(ISNUMBER(SEARCH(\"3\", H$20)),H$21/IF(LEN(H20)=16,6,IF(LEN(H20)=13,5,IF(LEN(H20)=10,4,IF(LEN(H20)=7,3,IF(LEN(H20)=4,2,1))))),\"0\")),\"0\")","v":"0"},{"$f":"IFERROR(SUM($D178:INDIRECT($L178)),\"0\")","v":0},null,null,"H178",{"$f":"COUNTIF($D$20:INDIRECT($O178),\"3\")","v":0},8,"H20"]
[null,null,4,{"$f":"IFERROR((IF(ISNUMBER(SEARCH(\"4\", D$20)),D$21/IF(LEN(D20)=16,6,IF(LEN(D20)=13,5,IF(LEN(D20)=10,4,IF(LEN(D20)=7,3,IF(LEN(D20)=4,2,1))))),\"0\")),\"0\")","v":"0"},{"$f":"IFERROR((IF(ISNUMBER(SEARCH(\"4\", E$20)),E$21/IF(LEN(E20)=16,6,IF(LEN(E20)=13,5,IF(LEN(E20)=10,4,IF(LEN(E20)=7,3,IF(LEN(E20)=4,2,1))))),\"0\")),\"0\")","v":"0"},{"$f":"IFERROR((IF(ISNUMBER(SEARCH(\"4\", F$20)),F$21/IF(LEN(F20)=16,6,IF(LEN(F20)=13,5,IF(LEN(F20)=10,4,IF(LEN(F20)=7,3,IF(LEN(F20)=4,2,1))))),\"0\")),\"0\")","v":"0"},{"$f":"IFERROR((IF(ISNUMBER(SEARCH(\"4\", G$20)),G$21/IF(LEN(G20)=16,6,IF(LEN(G20)=13,5,IF(LEN(G20)=10,4,IF(LEN(G20)=7,3,IF(LEN(G20)=4,2,1))))),\"0\")),\"0\")","v":"0"},{"$f":"IFERROR((IF(ISNUMBER(SEARCH(\"4\", H$20)),H$21/IF(LEN(H20)=16,6,IF(LEN(H20)=13,5,IF(LEN(H20)=10,4,IF(LEN(H20)=7,3,IF(LEN(H20)=4,2,1))))),\"0\")),\"0\")","v":"0"},{"$f":"IFERROR(SUM($D179:INDIRECT($L179)),\"0\")","v":0},null,null,"H179",{"$f":"COUNTIF($D$20:INDIRECT($O179),\"4\")","v":0},8,"H20"]
[null,null,5,{"$f":"IFERROR((IF(ISNUMBER(SEARCH(\"5\", D$20)),D$21/IF(LEN(D20)=16,6,IF(LEN(D20)=13,5,IF(LEN(D20)=10,4,IF(LEN(D20)=7,3,IF(LEN(D20)=4,2,1))))),\"0\")),\"0\")","v":5},{"$f":"IFERROR((IF(ISNUMBER(SEARCH(\"5\", E$20)),E$21/IF(LEN(E20)=16,6,IF(LEN(E20)=13,5,IF(LEN(E20)=10,4,IF(LEN(E20)=7,3,IF(LEN(E20)=4,2,1))))),\"0\")),\"0\")","v":5},{"$f":"IFERROR((IF(ISNUMBER(SEARCH(\"5\", F$20)),F$21/IF(LEN(F20)=16,6,IF(LEN(F20)=13,5,IF(LEN(F20)=10,4,IF(LEN(F20)=7,3,IF(LEN(F20)=4,2,1))))),\"0\")),\"0\")","v":5},{"$f":"IFERROR((IF(ISNUMBER(SEARCH(\"5\", G$20)),G$21/IF(LEN(G20)=16,6,IF(LEN(G20)=13,5,IF(LEN(G20)=10,4,IF(LEN(G20)=7,3,IF(LEN(G20)=4,2,1))))),\"0\")),\"0\")","v":"0"},{"$f":"IFERROR((IF(ISNUMBER(SEARCH(\"5\", H$20)),H$21/IF(LEN(H20)=16,6,IF(LEN(H20)=13,5,IF(LEN(H20)=10,4,IF(LEN(H20)=7,3,IF(LEN(H20)=4,2,1))))),\"0\")),\"0\")","v":"0"},{"$f":"IFERROR(SUM($D180:INDIRECT($L180)),\"0\")","v":15},null,null,"H180",{"$f":"COUNTIF($D$20:INDIRECT($O180),\"5\")","v":3},8,"H20"]
[null,null,6,{"$f":"IFERROR((IF(ISNUMBER(SEARCH(\"6\", D$20)),D$21/IF(LEN(D20)=16,6,IF(LEN(D20)=13,5,IF(LEN(D20)=10,4,IF(LEN(D20)=7,3,IF(LEN(D20)=4,2,1))))),\"0\")),\"0\")","v":"0"},{"$f":"IFERROR((IF(ISNUMBER(SEARCH(\"6\", E$20)),E$21/IF(LEN(E20)=16,6,IF(LEN(E20)=13,5,IF(LEN(E20)=10,4,IF(LEN(E20)=7,3,IF(LEN(E20)=4,2,1))))),\"0\")),\"0\")","v":"0"},{"$f":"IFERROR((IF(ISNUMBER(SEARCH(\"6\", F$20)),F$21/IF(LEN(F20)=16,6,IF(LEN(F20)=13,5,IF(LEN(F20)=10,4,IF(LEN(F20)=7,3,IF(LEN(F20)=4,2,1))))),\"0\")),\"0\")","v":"0"},{"$f":"IFERROR((IF(ISNUMBER(SEARCH(\"6\", G$20)),G$21/IF(LEN(G20)=16,6,IF(LEN(G20)=13,5,IF(LEN(G20)=10,4,IF(LEN(G20)=7,3,IF(LEN(G20)=4,2,1))))),\"0\")),\"0\")","v":5},{"$f":"IFERROR((IF(ISNUMBER(SEARCH(\"6\", H$20)),H$21/IF(LEN(H20)=16,6,IF(LEN(H20)=13,5,IF(LEN(H20)=10,4,IF(LEN(H20)=7,3,IF(LEN(H20)=4,2,1))))),\"0\")),\"0\")","v":5},{"$f":"IFERROR(SUM($D181:INDIRECT($L181)),\"0\")","v":10},null,null,"H181",{"$f":"COUNTIF($D$20:INDIRECT($O181),\"6\")","v":2},8,"H20"]

{"sheet":"T3_Analysis","index":7,"n_rows":131,"n_cols":5,"rows_kept":131,"cut":false,"hidden":false,"merged":[[2,0,2,3],[4,0,4,3],[6,0,6,3],[8,0,8,3]]}
[]
[]
[{"$f":"Data_Sheet!A2","v":"Jyothi Engineering College, Cheruthuruthy"}]
[]
[{"$f":"Data_Sheet!A4","v":"Department of Computer Science Engineering"}]
[]
[{"$f":"'T3'!A11","v":"CO Analysis - Internal Marks : Retest                       14-03-18"}]
[]
[{"$f":"Data_Sheet!A17","v":"S3 CS              CS203 Switching Theory and Logic Design               2019-20"}]
[]
[]
[]
[]
[]
[]
[]
[]
[]
[]
[]
[]
[{"$f":"'T1'!A18","v":"Register No."},{"$f":"'T1'!B18","v":"Name of Student"},{"$f":"'T3'!I18","v":"Total Marks (50)"},"Category"]
[]
["Column1","Column2","Column3","Column4"]
[{"$f":"Data_Sheet!A25","v":"JEC18CS001"},{"$f":"Data_Sheet!B25","v":"ABHISHEK KRISHNAN MENON E"},{"$f":"'T3'!I25","v":0},{"$f":"IF(C25=\"A\",\"ABSENT\",IF(C25>='T3'!$F$5*$E$124/100,\"EXCELLENT\",IF(C25>='T3'!$F$5*$E$123/100,\"GOOD\",IF(C25>='T3'!$F$5*$E$122/100,\"AVERAGE\",\"POOR\"))))","v":"POOR"}]
[{"$f":"Data_Sheet!A26","v":"JEC18CS002"},{"$f":"Data_Sheet!B26","v":"ABHISHEK SAJEEVAN"},{"$f":"'T3'!I26","v":0},{"$f":"IF(C26=\"A\",\"ABSENT\",IF(C26>='T3'!$F$5*$E$124/100,\"EXCELLENT\",IF(C26>='T3'!$F$5*$E$123/100,\"GOOD\",IF(C26>='T3'!$F$5*$E$122/100,\"AVERAGE\",\"POOR\"))))","v":"POOR"}]
[{"$f":"Data_Sheet!A27","v":"JEC18CS003"},{"$f":"Data_Sheet!B27","v":"ABHITH SHAJI"},{"$f":"'T3'!I27","v":0},{"$f":"IF(C27=\"A\",\"ABSENT\",IF(C27>='T3'!$F$5*$E$124/100,\"EXCELLENT\",IF(C27>='T3'!$F$5*$E$123/100,\"GOOD\",IF(C27>='T3'!$F$5*$E$122/100,\"AVERAGE\",\"POOR\"))))","v":"POOR"}]
[{"$f":"Data_Sheet!A28","v":"JEC18CS004"},{"$f":"Data_Sheet!B28","v":"ABIN SANTHOSH ALAPATT"},{"$f":"'T3'!I28","v":0},{"$f":"IF(C28=\"A\",\"ABSENT\",IF(C28>='T3'!$F$5*$E$124/100,\"EXCELLENT\",IF(C28>='T3'!$F$5*$E$123/100,\"GOOD\",IF(C28>='T3'!$F$5*$E$122/100,\"AVERAGE\",\"POOR\"))))","v":"POOR"}]
[{"$f":"Data_Sheet!A29","v":"JEC18CS005"},{"$f":"Data_Sheet!B29","v":"ADARSH KUMAR M A"},{"$f":"'T3'!I29","v":0},{"$f":"IF(C29=\"A\",\"ABSENT\",IF(C29>='T3'!$F$5*$E$124/100,\"EXCELLENT\",IF(C29>='T3'!$F$5*$E$123/100,\"GOOD\",IF(C29>='T3'!$F$5*$E$122/100,\"AVERAGE\",\"POOR\"))))","v":"POOR"}]
[{"$f":"Data_Sheet!A30","v":"JEC18CS006"},{"$f":"Data_Sheet!B30","v":"ADHITHYA KRISHNA S"},{"$f":"'T3'!I30","v":0},{"$f":"IF(C30=\"A\",\"ABSENT\",IF(C30>='T3'!$F$5*$E$124/100,\"EXCELLENT\",IF(C30>='T3'!$F$5*$E$123/100,\"GOOD\",IF(C30>='T3'!$F$5*$E$122/100,\"AVERAGE\",\"POOR\"))))","v":"POOR"}]
[{"$f":"Data_Sheet!A31","v":"JEC18CS007"},{"$f":"Data_Sheet!B31","v":"ADITHYA HARIDAS"},{"$f":"'T3'!I31","v":0},{"$f":"IF(C31=\"A\",\"ABSENT\",IF(C31>='T3'!$F$5*$E$124/100,\"EXCELLENT\",IF(C31>='T3'!$F$5*$E$123/100,\"GOOD\",IF(C31>='T3'!$F$5*$E$122/100,\"AVERAGE\",\"POOR\"))))","v":"POOR"}]
[{"$f":"Data_Sheet!A32","v":"JEC18CS008"},{"$f":"Data_Sheet!B32","v":"AJMAL BASHEER"},{"$f":"'T3'!I32","v":0},{"$f":"IF(C32=\"A\",\"ABSENT\",IF(C32>='T3'!$F$5*$E$124/100,\"EXCELLENT\",IF(C32>='T3'!$F$5*$E$123/100,\"GOOD\",IF(C32>='T3'!$F$5*$E$122/100,\"AVERAGE\",\"POOR\"))))","v":"POOR"}]
[{"$f":"Data_Sheet!A33","v":"JEC18CS009"},{"$f":"Data_Sheet!B33","v":"AKASH.V"},{"$f":"'T3'!I33","v":0},{"$f":"IF(C33=\"A\",\"ABSENT\",IF(C33>='T3'!$F$5*$E$124/100,\"EXCELLENT\",IF(C33>='T3'!$F$5*$E$123/100,\"GOOD\",IF(C33>='T3'!$F$5*$E$122/100,\"AVERAGE\",\"POOR\"))))","v":"POOR"}]
[{"$f":"Data_Sheet!A34","v":"JEC18CS010"},{"$f":"Data_Sheet!B34","v":"AKHIL AZEEZ UPPILAMKUNNATH"},{"$f":"'T3'!I34","v":0},{"$f":"IF(C34=\"A\",\"ABSENT\",IF(C34>='T3'!$F$5*$E$124/100,\"EXCELLENT\",IF(C34>='T3'!$F$5*$E$123/100,\"GOOD\",IF(C34>='T3'!$F$5*$E$122/100,\"AVERAGE\",\"POOR\"))))","v":"POOR"}]
[{"$f":"Data_Sheet!A35","v":"JEC18CS011"},{"$f":"Data_Sheet!B35","v":"AKHIL KRISHNA UK"},{"$f":"'T3'!I35","v":0},{"$f":"IF(C35=\"A\",\"ABSENT\",IF(C35>='T3'!$F$5*$E$124/100,\"EXCELLENT\",IF(C35>='T3'!$F$5*$E$123/100,\"GOOD\",IF(C35>='T3'!$F$5*$E$122/100,\"AVERAGE\",\"POOR\"))))","v":"POOR"}]
[{"$f":"Data_Sheet!A36","v":"JEC18CS012"},{"$f":"Data_Sheet!B36","v":"ALAN GEORGE"},{"$f":"'T3'!I36","v":0},{"$f":"IF(C36=\"A\",\"ABSENT\",IF(C36>='T3'!$F$5*$E$124/100,\"EXCELLENT\",IF(C36>='T3'!$F$5*$E$123/100,\"GOOD\",IF(C36>='T3'!$F$5*$E$122/100,\"AVERAGE\",\"POOR\"))))","v":"POOR"}]
[{"$f":"Data_Sheet!A37","v":"JEC18CS013"},{"$f":"Data_Sheet!B37","v":"ALEN VARGHESE"},{"$f":"'T3'!I37","v":0},{"$f":"IF(C37=\"A\",\"ABSENT\",IF(C37>='T3'!$F$5*$E$124/100,\"EXCELLENT\",IF(C37>='T3'!$F$5*$E$123/100,\"GOOD\",IF(C37>='T3'!$F$5*$E$122/100,\"AVERAGE\",\"POOR\"))))","v":"POOR"}]
[{"$f":"Data_Sheet!A38","v":"JEC18CS014"},{"$f":"Data_Sheet!B38","v":"AMAL SEBASTIAN"},{"$f":"'T3'!I38","v":0},{"$f":"IF(C38=\"A\",\"ABSENT\",IF(C38>='T3'!$F$5*$E$124/100,\"EXCELLENT\",IF(C38>='T3'!$F$5*$E$123/100,\"GOOD\",IF(C38>='T3'!$F$5*$E$122/100,\"AVERAGE\",\"POOR\"))))","v":"POOR"}]
[{"$f":"Data_Sheet!A39","v":"JEC18CS015"},{"$f":"Data_Sheet!B39","v":"AMAL SONY"},{"$f":"'T3'!I39","v":0},{"$f":"IF(C39=\"A\",\"ABSENT\",IF(C39>='T3'!$F$5*$E$124/100,\"EXCELLENT\",IF(C39>='T3'!$F$5*$E$123/100,\"GOOD\",IF(C39>='T3'!$F$5*$E$122/100,\"AVERAGE\",\"POOR\"))))","v":"POOR"}]
[{"$f":"Data_Sheet!A40","v":"JEC18CS016"},{"$f":"Data_Sheet!B40","v":"ANAGHA WILSON"},{"$f":"'T3'!I40","v":0},{"$f":"IF(C40=\"A\",\"ABSENT\",IF(C40>='T3'!$F$5*$E$124/100,\"EXCELLENT\",IF(C40>='T3'!$F$5*$E$123/100,\"GOOD\",IF(C40>='T3'!$F$5*$E$122/100,\"AVERAGE\",\"POOR\"))))","v":"POOR"}]
[{"$f":"Data_Sheet!A41","v":"JEC18CS017"},{"$f":"Data_Sheet!B41","v":"ANETTE ANTO"},{"$f":"'T3'!I41","v":0},{"$f":"IF(C41=\"A\",\"ABSENT\",IF(C41>='T3'!$F$5*$E$124/100,\"EXCELLENT\",IF(C41>='T3'!$F$5*$E$123/100,\"GOOD\",IF(C41>='T3'!$F$5*$E$122/100,\"AVERAGE\",\"POOR\"))))","v":"POOR"}]
[{"$f":"Data_Sheet!A42","v":"JEC18CS018"},{"$f":"Data_Sheet!B42","v":"ANIT MARY THOMAS"},{"$f":"'T3'!I42","v":0},{"$f":"IF(C42=\"A\",\"ABSENT\",IF(C42>='T3'!$F$5*$E$124/100,\"EXCELLENT\",IF(C42>='T3'!$F$5*$E$123/100,\"GOOD\",IF(C42>='T3'!$F$5*$E$122/100,\"AVERAGE\",\"POOR\"))))","v":"POOR"}]
[{"$f":"Data_Sheet!A43","v":"JEC18CS020"},{"$f":"Data_Sheet!B43","v":"ANN THERESA SHAJI"},{"$f":"'T3'!I43","v":0},{"$f":"IF(C43=\"A\",\"ABSENT\",IF(C43>='T3'!$F$5*$E$124/100,\"EXCELLENT\",IF(C43>='T3'!$F$5*$E$123/100,\"GOOD\",IF(C43>='T3'!$F$5*$E$122/100,\"AVERAGE\",\"POOR\"))))","v":"POOR"}]
[{"$f":"Data_Sheet!A44","v":"JEC18CS021"},{"$f":"Data_Sheet!B44","v":"ANTONY ROY"},{"$f":"'T3'!I44","v":0},{"$f":"IF(C44=\"A\",\"ABSENT\",IF(C44>='T3'!$F$5*$E$124/100,\"EXCELLENT\",IF(C44>='T3'!$F$5*$E$123/100,\"GOOD\",IF(C44>='T3'!$F$5*$E$122/100,\"AVERAGE\",\"POOR\"))))","v":"POOR"}]
[{"$f":"Data_Sheet!A45","v":"JEC18CS022"},{"$f":"Data_Sheet!B45","v":"ANUGRAHA C"},{"$f":"'T3'!I45","v":0},{"$f":"IF(C45=\"A\",\"ABSENT\",IF(C45>='T3'!$F$5*$E$124/100,\"EXCELLENT\",IF(C45>='T3'!$F$5*$E$123/100,\"GOOD\",IF(C45>='T3'!$F$5*$E$122/100,\"AVERAGE\",\"POOR\"))))","v":"POOR"}]
[{"$f":"Data_Sheet!A46","v":"JEC18CS023"},{"$f":"Data_Sheet!B46","v":"APARNA.V"},{"$f":"'T3'!I46","v":0},{"$f":"IF(C46=\"A\",\"ABSENT\",IF(C46>='T3'!$F$5*$E$124/100,\"EXCELLENT\",IF(C46>='T3'!$F$5*$E$123/100,\"GOOD\",IF(C46>='T3'!$F$5*$E$122/100,\"AVERAGE\",\"POOR\"))))","v":"POOR"}]
[{"$f":"Data_Sheet!A47","v":"JEC18CS024"},{"$f":"Data_Sheet!B47","v":"ARAVIND S KUMAR"},{"$f":"'T3'!I47","v":0},{"$f":"IF(C47=\"A\",\"ABSENT\",IF(C47>='T3'!$F$5*$E$124/100,\"EXCELLENT\",IF(C47>='T3'!$F$5*$E$123/100,\"GOOD\",IF(C47>='T3'!$F$5*$E$122/100,\"AVERAGE\",\"POOR\"))))","v":"POOR"}]
[{"$f":"Data_Sheet!A48","v":"JEC18CS025"},{"$f":"Data_Sheet!B48","v":"ARJUN VINOD"},{"$f":"'T3'!I48","v":0},{"$f":"IF(C48=\"A\",\"ABSENT\",IF(C48>='T3'!$F$5*$E$124/100,\"EXCELLENT\",IF(C48>='T3'!$F$5*$E$123/100,\"GOOD\",IF(C48>='T3'!$F$5*$E$122/100,\"AVERAGE\",\"POOR\"))))","v":"POOR"}]
[{"$f":"Data_Sheet!A49","v":"JEC18CS026"},{"$f":"Data_Sheet!B49","v":"ARUN VG"},{"$f":"'T3'!I49","v":0},{"$f":"IF(C49=\"A\",\"ABSENT\",IF(C49>='T3'!$F$5*$E$124/100,\"EXCELLENT\",IF(C49>='T3'!$F$5*$E$123/100,\"GOOD\",IF(C49>='T3'!$F$5*$E$122/100,\"AVERAGE\",\"POOR\"))))","v":"POOR"}]
[{"$f":"Data_Sheet!A50","v":"JEC18CS027"},{"$f":"Data_Sheet!B50","v":"ASHRUL K"},{"$f":"'T3'!I50","v":0},{"$f":"IF(C50=\"A\",\"ABSENT\",IF(C50>='T3'!$F$5*$E$124/100,\"EXCELLENT\",IF(C50>='T3'!$F$5*$E$123/100,\"GOOD\",IF(C50>='T3'!$F$5*$E$122/100,\"AVERAGE\",\"POOR\"))))","v":"POOR"}]
[{"$f":"Data_Sheet!A51","v":"JEC18CS028"},{"$f":"Data_Sheet!B51","v":"ATHIL PAULY"},{"$f":"'T3'!I51","v":0},{"$f":"IF(C51=\"A\",\"ABSENT\",IF(C51>='T3'!$F$5*$E$124/100,\"EXCELLENT\",IF(C51>='T3'!$F$5*$E$123/100,\"GOOD\",IF(C51>='T3'!$F$5*$E$122/100,\"AVERAGE\",\"POOR\"))))","v":"POOR"}]
[{"$f":"Data_Sheet!A52","v":"JEC18CS029"},{"$f":"Data_Sheet!B52","v":"ATHIRA K P"},{"$f":"'T3'!I52","v":0},{"$f":"IF(C52=\"A\",\"ABSENT\",IF(C52>='T3'!$F$5*$E$124/100,\"EXCELLENT\",IF(C52>='T3'!$F$5*$E$123/100,\"GOOD\",IF(C52>='T3'!$F$5*$E$122/100,\"AVERAGE\",\"POOR\"))))","v":"POOR"}]
[{"$f":"Data_Sheet!A53","v":"JEC18CS030"},{"$f":"Data_Sheet!B53","v":"AWIN ANTO"},{"$f":"'T3'!I53","v":0},{"$f":"IF(C53=\"A\",\"ABSENT\",IF(C53>='T3'!$F$5*$E$124/100,\"EXCELLENT\",IF(C53>='T3'!$F$5*$E$123/100,\"GOOD\",IF(C53>='T3'!$F$5*$E$122/100,\"AVERAGE\",\"POOR\"))))","v":"POOR"}]
[{"$f":"Data_Sheet!A54","v":"JEC18CS031"},{"$f":"Data_Sheet!B54","v":"CHARLES JOHNSON"},{"$f":"'T3'!I54","v":0},{"$f":"IF(C54=\"A\",\"ABSENT\",IF(C54>='T3'!$F$5*$E$124/100,\"EXCELLENT\",IF(C54>='T3'!$F$5*$E$123/100,\"GOOD\",IF(C54>='T3'!$F$5*$E$122/100,\"AVERAGE\",\"POOR\"))))","v":"POOR"}]
[{"$f":"Data_Sheet!A55","v":"JEC18CS032"},{"$f":"Data_Sheet!B55","v":"CHITTILAPPILLY JOVIA JOHNSON"},{"$f":"'T3'!I55","v":0},{"$f":"IF(C55=\"A\",\"ABSENT\",IF(C55>='T3'!$F$5*$E$124/100,\"EXCELLENT\",IF(C55>='T3'!$F$5*$E$123/100,\"GOOD\",IF(C55>='T3'!$F$5*$E$122/100,\"AVERAGE\",\"POOR\"))))","v":"POOR"}]
[{"$f":"Data_Sheet!A56","v":"JEC18CS033"},{"$f":"Data_Sheet!B56","v":"CIYA BABU"},{"$f":"'T3'!I56","v":0},{"$f":"IF(C56=\"A\",\"ABSENT\",IF(C56>='T3'!$F$5*$E$124/100,\"EXCELLENT\",IF(C56>='T3'!$F$5*$E$123/100,\"GOOD\",IF(C56>='T3'!$F$5*$E$122/100,\"AVERAGE\",\"POOR\"))))","v":"POOR"}]
[{"$f":"Data_Sheet!A57","v":"JEC18CS034"},{"$f":"Data_Sheet!B57","v":"DAVID SALUS"},{"$f":"'T3'!I57","v":0},{"$f":"IF(C57=\"A\",\"ABSENT\",IF(C57>='T3'!$F$5*$E$124/100,\"EXCELLENT\",IF(C57>='T3'!$F$5*$E$123/100,\"GOOD\",IF(C57>='T3'!$F$5*$E$122/100,\"AVERAGE\",\"POOR\"))))","v":"POOR"}]
[{"$f":"Data_Sheet!A58","v":"JEC18CS035"},{"$f":"Data_Sheet!B58","v":"DELICIA REJI"},{"$f":"'T3'!I58","v":0},{"$f":"IF(C58=\"A\",\"ABSENT\",IF(C58>='T3'!$F$5*$E$124/100,\"EXCELLENT\",IF(C58>='T3'!$F$5*$E$123/100,\"GOOD\",IF(C58>='T3'!$F$5*$E$122/100,\"AVERAGE\",\"POOR\"))))","v":"POOR"}]
[{"$f":"Data_Sheet!A59","v":"JEC18CS036"},{"$f":"Data_Sheet!B59","v":"DELMA SHAJAN"},{"$f":"'T3'!I59","v":0},{"$f":"IF(C59=\"A\",\"ABSENT\",IF(C59>='T3'!$F$5*$E$124/100,\"EXCELLENT\",IF(C59>='T3'!$F$5*$E$123/100,\"GOOD\",IF(C59>='T3'!$F$5*$E$122/100,\"AVERAGE\",\"POOR\"))))","v":"POOR"}]
[{"$f":"Data_Sheet!A60","v":"JEC18CS037"},{"$f":"Data_Sheet!B60","v":"DILBER SHA AP"},{"$f":"'T3'!I60","v":0},{"$f":"IF(C60=\"A\",\"ABSENT\",IF(C60>='T3'!$F$5*$E$124/100,\"EXCELLENT\",IF(C60>='T3'!$F$5*$E$123/100,\"GOOD\",IF(C60>='T3'!$F$5*$E$122/100,\"AVERAGE\",\"POOR\"))))","v":"POOR"}]
[{"$f":"Data_Sheet!A61","v":"JEC18CS038"},{"$f":"Data_Sheet!B61","v":"EDWIN T JOY"},{"$f":"'T3'!I61","v":0},{"$f":"IF(C61=\"A\",\"ABSENT\",IF(C61>='T3'!$F$5*$E$124/100,\"EXCELLENT\",IF(C61>='T3'!$F$5*$E$123/100,\"GOOD\",IF(C61>='T3'!$F$5*$E$122/100,\"AVERAGE\",\"POOR\"))))","v":"POOR"}]
[{"$f":"Data_Sheet!A62","v":"JEC18CS039"},{"$f":"Data_Sheet!B62","v":"EDWIN WILSON"},{"$f":"'T3'!I62","v":0},{"$f":"IF(C62=\"A\",\"ABSENT\",IF(C62>='T3'!$F$5*$E$124/100,\"EXCELLENT\",IF(C62>='T3'!$F$5*$E$123/100,\"GOOD\",IF(C62>='T3'!$F$5*$E$122/100,\"AVERAGE\",\"POOR\"))))","v":"POOR"}]
[{"$f":"Data_Sheet!A63","v":"JEC18CS040"},{"$f":"Data_Sheet!B63","v":"EMMANUEL SHIBU"},{"$f":"'T3'!I63","v":0},{"$f":"IF(C63=\"A\",\"ABSENT\",IF(C63>='T3'!$F$5*$E$124/100,\"EXCELLENT\",IF(C63>='T3'!$F$5*$E$123/100,\"GOOD\",IF(C63>='T3'!$F$5*$E$122/100,\"AVERAGE\",\"POOR\"))))","v":"POOR"}]
[{"$f":"Data_Sheet!A64","v":"JEC18CS041"},{"$f":"Data_Sheet!B64","v":"GAYATHRI DINESH"},{"$f":"'T3'!I64","v":0},{"$f":"IF(C64=\"A\",\"ABSENT\",IF(C64>='T3'!$F$5*$E$124/100,\"EXCELLENT\",IF(C64>='T3'!$F$5*$E$123/100,\"GOOD\",IF(C64>='T3'!$F$5*$E$122/100,\"AVERAGE\",\"POOR\"))))","v":"POOR"}]
[{"$f":"Data_Sheet!A65","v":"JEC18CS042"},{"$f":"Data_Sheet!B65","v":"GOKUL DAS M"},{"$f":"'T3'!I65","v":0},{"$f":"IF(C65=\"A\",\"ABSENT\",IF(C65>='T3'!$F$5*$E$124/100,\"EXCELLENT\",IF(C65>='T3'!$F$5*$E$123/100,\"GOOD\",IF(C65>='T3'!$F$5*$E$122/100,\"AVERAGE\",\"POOR\"))))","v":"POOR"}]
[{"$f":"Data_Sheet!A66","v":"JEC18CS043"},{"$f":"Data_Sheet!B66","v":"G RAMGOPAL"},{"$f":"'T3'!I66","v":0},{"$f":"IF(C66=\"A\",\"ABSENT\",IF(C66>='T3'!$F$5*$E$124/100,\"EXCELLENT\",IF(C66>='T3'!$F$5*$E$123/100,\"GOOD\",IF(C66>='T3'!$F$5*$E$122/100,\"AVERAGE\",\"POOR\"))))","v":"POOR"}]
[{"$f":"Data_Sheet!A67","v":"JEC18CS044"},{"$f":"Data_Sheet!B67","v":"HARIES DAVIS"},{"$f":"'T3'!I67","v":0},{"$f":"IF(C67=\"A\",\"ABSENT\",IF(C67>='T3'!$F$5*$E$124/100,\"EXCELLENT\",IF(C67>='T3'!$F$5*$E$123/100,\"GOOD\",IF(C67>='T3'!$F$5*$E$122/100,\"AVERAGE\",\"POOR\"))))","v":"POOR"}]
[{"$f":"Data_Sheet!A68","v":"JEC18CS045"},{"$f":"Data_Sheet!B68","v":"HARISANKER P"},{"$f":"'T3'!I68","v":0},{"$f":"IF(C68=\"A\",\"ABSENT\",IF(C68>='T3'!$F$5*$E$124/100,\"EXCELLENT\",IF(C68>='T3'!$F$5*$E$123/100,\"GOOD\",IF(C68>='T3'!$F$5*$E$122/100,\"AVERAGE\",\"POOR\"))))","v":"POOR"}]
[{"$f":"Data_Sheet!A69","v":"JEC18CS046"},{"$f":"Data_Sheet!B69","v":"HARSHA.K.S."},{"$f":"'T3'!I69","v":0},{"$f":"IF(C69=\"A\",\"ABSENT\",IF(C69>='T3'!$F$5*$E$124/100,\"EXCELLENT\",IF(C69>='T3'!$F$5*$E$123/100,\"GOOD\",IF(C69>='T3'!$F$5*$E$122/100,\"AVERAGE\",\"POOR\"))))","v":"POOR"}]
[{"$f":"Data_Sheet!A70","v":"JEC18CS047"},{"$f":"Data_Sheet!B70","v":"HELNA THOMAS"},{"$f":"'T3'!I70","v":0},{"$f":"IF(C70=\"A\",\"ABSENT\",IF(C70>='T3'!$F$5*$E$124/100,\"EXCELLENT\",IF(C70>='T3'!$F$5*$E$123/100,\"GOOD\",IF(C70>='T3'!$F$5*$E$122/100,\"AVERAGE\",\"POOR\"))))","v":"POOR"}]
[{"$f":"Data_Sheet!A71","v":"JEC18CS048"},{"$f":"Data_Sheet!B71","v":"HRIDI KRISHNA.H"},{"$f":"'T3'!I71","v":0},{"$f":"IF(C71=\"A\",\"ABSENT\",IF(C71>='T3'!$F$5*$E$124/100,\"EXCELLENT\",IF(C71>='T3'!$F$5*$E$123/100,\"GOOD\",IF(C71>='T3'!$F$5*$E$122/100,\"AVERAGE\",\"POOR\"))))","v":"POOR"}]
[{"$f":"Data_Sheet!A72","v":"JEC18CS049"},{"$f":"Data_Sheet!B72","v":"INDRAJIT R"},{"$f":"'T3'!I72","v":0},{"$f":"IF(C72=\"A\",\"ABSENT\",IF(C72>='T3'!$F$5*$E$124/100,\"EXCELLENT\",IF(C72>='T3'!$F$5*$E$123/100,\"GOOD\",IF(C72>='T3'!$F$5*$E$122/100,\"AVERAGE\",\"POOR\"))))","v":"POOR"}]
[{"$f":"Data_Sheet!A73","v":"JEC18CS050"},{"$f":"Data_Sheet!B73","v":"JESWIN JOJY"},{"$f":"'T3'!I73","v":0},{"$f":"IF(C73=\"A\",\"ABSENT\",IF(C73>='T3'!$F$5*$E$124/100,\"EXCELLENT\",IF(C73>='T3'!$F$5*$E$123/100,\"GOOD\",IF(C73>='T3'!$F$5*$E$122/100,\"AVERAGE\",\"POOR\"))))","v":"POOR"}]
[{"$f":"Data_Sheet!A74","v":"JEC18CS051"},{"$f":"Data_Sheet!B74","v":"JIBIN A BABU"},{"$f":"'T3'!I74","v":0},{"$f":"IF(C74=\"A\",\"ABSENT\",IF(C74>='T3'!$F$5*$E$124/100,\"EXCELLENT\",IF(C74>='T3'!$F$5*$E$123/100,\"GOOD\",IF(C74>='T3'!$F$5*$E$122/100,\"AVERAGE\",\"POOR\"))))","v":"POOR"}]
[{"$f":"Data_Sheet!A75","v":"JEC18CS052"},{"$f":"Data_Sheet!B75","v":"JISSY JOY"},{"$f":"'T3'!I75","v":0},{"$f":"IF(C75=\"A\",\"ABSENT\",IF(C75>='T3'!$F$5*$E$124/100,\"EXCELLENT\",IF(C75>='T3'!$F$5*$E$123/100,\"GOOD\",IF(C75>='T3'!$F$5*$E$122/100,\"AVERAGE\",\"POOR\"))))","v":"POOR"}]
[{"$f":"Data_Sheet!A76","v":"JEC18CS053"},{"$f":"Data_Sheet!B76","v":"JOEL JAMES KARIKKANDATHIL"},{"$f":"'T3'!I76","v":0},{"$f":"IF(C76=\"A\",\"ABSENT\",IF(C76>='T3'!$F$5*$E$124/100,\"EXCELLENT\",IF(C76>='T3'!$F$5*$E$123/100,\"GOOD\",IF(C76>='T3'!$F$5*$E$122/100,\"AVERAGE\",\"POOR\"))))","v":"POOR"}]
[{"$f":"Data_Sheet!A77","v":"JEC18CS054"},{"$f":"Data_Sheet!B77","v":"JOSE REJI KARIMADATHI"},{"$f":"'T3'!I77","v":0},{"$f":"IF(C77=\"A\",\"ABSENT\",IF(C77>='T3'!$F$5*$E$124/100,\"EXCELLENT\",IF(C77>='T3'!$F$5*$E$123/100,\"GOOD\",IF(C77>='T3'!$F$5*$E$122/100,\"AVERAGE\",\"POOR\"))))","v":"POOR"}]
[{"$f":"Data_Sheet!A78","v":"JEC18CS055"},{"$f":"Data_Sheet!B78","v":"JUMANA HASIN"},{"$f":"'T3'!I78","v":0},{"$f":"IF(C78=\"A\",\"ABSENT\",IF(C78>='T3'!$F$5*$E$124/100,\"EXCELLENT\",IF(C78>='T3'!$F$5*$E$123/100,\"GOOD\",IF(C78>='T3'!$F$5*$E$122/100,\"AVERAGE\",\"POOR\"))))","v":"POOR"}]
[{"$f":"Data_Sheet!A79","v":"JEC18CS056"},{"$f":"Data_Sheet!B79","v":"KAILASHNATH"},{"$f":"'T3'!I79","v":0},{"$f":"IF(C79=\"A\",\"ABSENT\",IF(C79>='T3'!$F$5*$E$124/100,\"EXCELLENT\",IF(C79>='T3'!$F$5*$E$123/100,\"GOOD\",IF(C79>='T3'!$F$5*$E$122/100,\"AVERAGE\",\"POOR\"))))","v":"POOR"}]
[{"$f":"Data_Sheet!A80","v":"JEC18CS057"},{"$f":"Data_Sheet!B80","v":"K AJISHKUMAR"},{"$f":"'T3'!I80","v":0},{"$f":"IF(C80=\"A\",\"ABSENT\",IF(C80>='T3'!$F$5*$E$124/100,\"EXCELLENT\",IF(C80>='T3'!$F$5*$E$123/100,\"GOOD\",IF(C80>='T3'!$F$5*$E$122/100,\"AVERAGE\",\"POOR\"))))","v":"POOR"}]
[{"$f":"Data_Sheet!A81","v":"JEC18CS058"},{"$f":"Data_Sheet!B81","v":"KEERTHANA K S"},{"$f":"'T3'!I81","v":0},{"$f":"IF(C81=\"A\",\"ABSENT\",IF(C81>='T3'!$F$5*$E$124/100,\"EXCELLENT\",IF(C81>='T3'!$F$5*$E$123/100,\"GOOD\",IF(C81>='T3'!$F$5*$E$122/100,\"AVERAGE\",\"POOR\"))))","v":"POOR"}]
[{"$f":"Data_Sheet!A82","v":"JEC18CS059"},{"$f":"Data_Sheet!B82","v":"KEVIN VARGHESE"},{"$f":"'T3'!I82","v":0},{"$f":"IF(C82=\"A\",\"ABSENT\",IF(C82>='T3'!$F$5*$E$124/100,\"EXCELLENT\",IF(C82>='T3'!$F$5*$E$123/100,\"GOOD\",IF(C82>='T3'!$F$5*$E$122/100,\"AVERAGE\",\"POOR\"))))","v":"POOR"}]
[{"$f":"Data_Sheet!A83","v":"JEC18CS060"},{"$f":"Data_Sheet!B83","v":"LAKSHMI SADANANDAN"},{"$f":"'T3'!I83","v":0},{"$f":"IF(C83=\"A\",\"ABSENT\",IF(C83>='T3'!$F$5*$E$124/100,\"EXCELLENT\",IF(C83>='T3'!$F$5*$E$123/100,\"GOOD\",IF(C83>='T3'!$F$5*$E$122/100,\"AVERAGE\",\"POOR\"))))","v":"POOR"}]
[{"$f":"Data_Sheet!A84","v":"JEC18CS061"},{"$f":"Data_Sheet!B84","v":"LEYA PALLAN"},{"$f":"'T3'!I84","v":0},{"$f":"IF(C84=\"A\",\"ABSENT\",IF(C84>='T3'!$F$5*$E$124/100,\"EXCELLENT\",IF(C84>='T3'!$F$5*$E$123/100,\"GOOD\",IF(C84>='T3'!$F$5*$E$122/100,\"AVERAGE\",\"POOR\"))))","v":"POOR"}]
[{"$f":"Data_Sheet!A85","v":"JEC18CS062"},{"$f":"Data_Sheet!B85","v":"MARVEL BABU"},{"$f":"'T3'!I85","v":0},{"$f":"IF(C85=\"A\",\"ABSENT\",IF(C85>='T3'!$F$5*$E$124/100,\"EXCELLENT\",IF(C85>='T3'!$F$5*$E$123/100,\"GOOD\",IF(C85>='T3'!$F$5*$E$122/100,\"AVERAGE\",\"POOR\"))))","v":"POOR"}]
[{"$f":"Data_Sheet!A86","v":"JEC18CS063"},{"$f":"Data_Sheet!B86","v":"MEDWIN PAUL"},{"$f":"'T3'!I86","v":0},{"$f":"IF(C86=\"A\",\"ABSENT\",IF(C86>='T3'!$F$5*$E$124/100,\"EXCELLENT\",IF(C86>='T3'!$F$5*$E$123/100,\"GOOD\",IF(C86>='T3'!$F$5*$E$122/100,\"AVERAGE\",\"POOR\"))))","v":"POOR"}]
[{"$f":"Data_Sheet!A87","v":0},{"$f":"Data_Sheet!B87","v":0},{"$f":"'T3'!I87","v":0},{"$f":"IF(C87=\"A\",\"ABSENT\",IF(C87>='T3'!$F$5*$E$124/100,\"EXCELLENT\",IF(C87>='T3'!$F$5*$E$123/100,\"GOOD\",IF(C87>='T3'!$F$5*$E$122/100,\"AVERAGE\",\"POOR\"))))","v":"POOR"}]
[{"$f":"Data_Sheet!A88","v":0},{"$f":"Data_Sheet!B88","v":0},{"$f":"'T3'!I88","v":0},{"$f":"IF(C88=\"A\",\"ABSENT\",IF(C88>='T3'!$F$5*$E$124/100,\"EXCELLENT\",IF(C88>='T3'!$F$5*$E$123/100,\"GOOD\",IF(C88>='T3'!$F$5*$E$122/100,\"AVERAGE\",\"POOR\"))))","v":"POOR"}]
[{"$f":"Data_Sheet!A89","v":"JEC18CS066"},{"$f":"Data_Sheet!B89","v":"MUHAMMED INSHADH"},{"$f":"'T3'!I89","v":0},{"$f":"IF(C89=\"A\",\"ABSENT\",IF(C89>='T3'!$F$5*$E$124/100,\"EXCELLENT\",IF(C89>='T3'!$F$5*$E$123/100,\"GOOD\",IF(C89>='T3'!$F$5*$E$122/100,\"AVERAGE\",\"POOR\"))))","v":"POOR"}]
[{"$f":"Data_Sheet!A90","v":"JEC18CS067"},{"$f":"Data_Sheet!B90","v":"NAIR MIDHUN RAMACHANDRAN"},{"$f":"'T3'!I90","v":0},{"$f":"IF(C90=\"A\",\"ABSENT\",IF(C90>='T3'!$F$5*$E$124/100,\"EXCELLENT\",IF(C90>='T3'!$F$5*$E$123/100,\"GOOD\",IF(C90>='T3'!$F$5*$E$122/100,\"AVERAGE\",\"POOR\"))))","v":"POOR"}]
[{"$f":"Data_Sheet!A91","v":"JEC18CS068"},{"$f":"Data_Sheet!B91","v":"NAVEENA ANTONY"},{"$f":"'T3'!I91","v":0},{"$f":"IF(C91=\"A\",\"ABSENT\",IF(C91>='T3'!$F$5*$E$124/100,\"EXCELLENT\",IF(C91>='T3'!$F$5*$E$123/100,\"GOOD\",IF(C91>='T3'!$F$5*$E$122/100,\"AVERAGE\",\"POOR\"))))","v":"POOR"}]
[{"$f":"Data_Sheet!A92","v":"JEC18CS069"},{"$f":"Data_Sheet!B92","v":"NITIN MADHU"},{"$f":"'T3'!I92","v":0},{"$f":"IF(C92=\"A\",\"ABSENT\",IF(C92>='T3'!$F$5*$E$124/100,\"EXCELLENT\",IF(C92>='T3'!$F$5*$E$123/100,\"GOOD\",IF(C92>='T3'!$F$5*$E$122/100,\"AVERAGE\",\"POOR\"))))","v":"POOR"}]
[{"$f":"Data_Sheet!A93","v":"JEC18CS070"},{"$f":"Data_Sheet!B93","v":"PRATHIUSH ARUN"},{"$f":"'T3'!I93","v":0},{"$f":"IF(C93=\"A\",\"ABSENT\",IF(C93>='T3'!$F$5*$E$124/100,\"EXCELLENT\",IF(C93>='T3'!$F$5*$E$123/100,\"GOOD\",IF(C93>='T3'!$F$5*$E$122/100,\"AVERAGE\",\"POOR\"))))","v":"POOR"}]
[{"$f":"Data_Sheet!A94","v":"JEC18CS071"},{"$f":"Data_Sheet!B94","v":"RACHEL CECER"},{"$f":"'T3'!I94","v":0},{"$f":"IF(C94=\"A\",\"ABSENT\",IF(C94>='T3'!$F$5*$E$124/100,\"EXCELLENT\",IF(C94>='T3'!$F$5*$E$123/100,\"GOOD\",IF(C94>='T3'!$F$5*$E$122/100,\"AVERAGE\",\"POOR\"))))","v":"POOR"}]
[{"$f":"Data_Sheet!A95","v":"JEC18CS072"},{"$f":"Data_Sheet!B95","v":"RAHUL RAJU"},{"$f":"'T3'!I95","v":0},{"$f":"IF(C95=\"A\",\"ABSENT\",IF(C95>='T3'!$F$5*$E$124/100,\"EXCELLENT\",IF(C95>='T3'!$F$5*$E$123/100,\"GOOD\",IF(C95>='T3'!$F$5*$E$122/100,\"AVERAGE\",\"POOR\"))))","v":"POOR"}]
[{"$f":"Data_Sheet!A96","v":"JEC18CS073"},{"$f":"Data_Sheet!B96","v":"RAHUL T RAVI"},{"$f":"'T3'!I96","v":0},{"$f":"IF(C96=\"A\",\"ABSENT\",IF(C96>='T3'!$F$5*$E$124/100,\"EXCELLENT\",IF(C96>='T3'!$F$5*$E$123/100,\"GOOD\",IF(C96>='T3'!$F$5*$E$122/100,\"AVERAGE\",\"POOR\"))))","v":"POOR"}]
[{"$f":"Data_Sheet!A97","v":"JEC18CS074"},{"$f":"Data_Sheet!B97","v":"RAPHEAL K MOYALAN"},{"$f":"'T3'!I97","v":0},{"$f":"IF(C97=\"A\",\"ABSENT\",IF(C97>='T3'!$F$5*$E$124/100,\"EXCELLENT\",IF(C97>='T3'!$F$5*$E$123/100,\"GOOD\",IF(C97>='T3'!$F$5*$E$122/100,\"AVERAGE\",\"POOR\"))))","v":"POOR"}]
[{"$f":"Data_Sheet!A98","v":"JEC18CS075"},{"$f":"Data_Sheet!B98","v":"RISHIKESH. V"},{"$f":"'T3'!I98","v":0},{"$f":"IF(C98=\"A\",\"ABSENT\",IF(C98>='T3'!$F$5*$E$124/100,\"EXCELLENT\",IF(C98>='T3'!$F$5*$E$123/100,\"GOOD\",IF(C98>='T3'!$F$5*$E$122/100,\"AVERAGE\",\"POOR\"))))","v":"POOR"}]
[{"$f":"Data_Sheet!A99","v":"JEC18CS076"},{"$f":"Data_Sheet!B99","v":"ROCKSON T. AUGUSTINE"},{"$f":"'T3'!I99","v":0},{"$f":"IF(C99=\"A\",\"ABSENT\",IF(C99>='T3'!$F$5*$E$124/100,\"EXCELLENT\",IF(C99>='T3'!$F$5*$E$123/100,\"GOOD\",IF(C99>='T3'!$F$5*$E$122/100,\"AVERAGE\",\"POOR\"))))","v":"POOR"}]
[{"$f":"Data_Sheet!A100","v":"JEC18CS077"},{"$f":"Data_Sheet!B100","v":"SARATH C P"},{"$f":"'T3'!I100","v":0},{"$f":"IF(C100=\"A\",\"ABSENT\",IF(C100>='T3'!$F$5*$E$124/100,\"EXCELLENT\",IF(C100>='T3'!$F$5*$E$123/100,\"GOOD\",IF(C100>='T3'!$F$5*$E$122/100,\"AVERAGE\",\"POOR\"))))","v":"POOR"}]
[{"$f":"Data_Sheet!A101","v":"JEC18CS078"},{"$f":"Data_Sheet!B101","v":"SARATH SASI"},{"$f":"'T3'!I101","v":0},{"$f":"IF(C101=\"A\",\"ABSENT\",IF(C101>='T3'!$F$5*$E$124/100,\"EXCELLENT\",IF(C101>='T3'!$F$5*$E$123/100,\"GOOD\",IF(C101>='T3'!$F$5*$E$122/100,\"AVERAGE\",\"POOR\"))))","v":"POOR"}]
[{"$f":"Data_Sheet!A102","v":"JEC18CS079"},{"$f":"Data_Sheet!B102","v":"SHAFNA"},{"$f":"'T3'!I102","v":0},{"$f":"IF(C102=\"A\",\"ABSENT\",IF(C102>='T3'!$F$5*$E$124/100,\"EXCELLENT\",IF(C102>='T3'!$F$5*$E$123/100,\"GOOD\",IF(C102>='T3'!$F$5*$E$122/100,\"AVERAGE\",\"POOR\"))))","v":"POOR"}]
[{"$f":"Data_Sheet!A103","v":"JEC18CS080"},{"$f":"Data_Sheet!B103","v":"SHELMY SHABU"},{"$f":"'T3'!I103","v":0},{"$f":"IF(C103=\"A\",\"ABSENT\",IF(C103>='T3'!$F$5*$E$124/100,\"EXCELLENT\",IF(C103>='T3'!$F$5*$E$123/100,\"GOOD\",IF(C103>='T3'!$F$5*$E$122/100,\"AVERAGE\",\"POOR\"))))","v":"POOR"}]
[{"$f":"Data_Sheet!A104","v":"JEC18CS081"},{"$f":"Data_Sheet!B104","v":"SHIZA SHIHAB PUVAMPARAMBIL"},{"$f":"'T3'!I104","v":0},{"$f":"IF(C104=\"A\",\"ABSENT\",IF(C104>='T3'!$F$5*$E$124/100,\"EXCELLENT\",IF(C104>='T3'!$F$5*$E$123/100,\"GOOD\",IF(C104>='T3'!$F$5*$E$122/100,\"AVERAGE\",\"POOR\"))))","v":"POOR"}]
[{"$f":"Data_Sheet!A105","v":"JEC18CS082"},{"$f":"Data_Sheet!B105","v":"SIJO GEORGE"},{"$f":"'T3'!I105","v":0},{"$f":"IF(C105=\"A\",\"ABSENT\",IF(C105>='T3'!$F$5*$E$124/100,\"EXCELLENT\",IF(C105>='T3'!$F$5*$E$123/100,\"GOOD\",IF(C105>='T3'!$F$5*$E$122/100,\"AVERAGE\",\"POOR\"))))","v":"POOR"}]
[{"$f":"Data_Sheet!A106","v":"JEC18CS083"},{"$f":"Data_Sheet!B106","v":"SOURAV K"},{"$f":"'T3'!I106","v":0},{"$f":"IF(C106=\"A\",\"ABSENT\",IF(C106>='T3'!$F$5*$E$124/100,\"EXCELLENT\",IF(C106>='T3'!$F$5*$E$123/100,\"GOOD\",IF(C106>='T3'!$F$5*$E$122/100,\"AVERAGE\",\"POOR\"))))","v":"POOR"}]
[{"$f":"Data_Sheet!A107","v":0},{"$f":"Data_Sheet!B107","v":0},{"$f":"'T3'!I107","v":0},{"$f":"IF(C107=\"A\",\"ABSENT\",IF(C107>='T3'!$F$5*$E$124/100,\"EXCELLENT\",IF(C107>='T3'!$F$5*$E$123/100,\"GOOD\",IF(C107>='T3'!$F$5*$E$122/100,\"AVERAGE\",\"POOR\"))))","v":"POOR"}]
[{"$f":"Data_Sheet!A108","v":"JEC18CS085"},{"$f":"Data_Sheet!B108","v":"SREEHARI"},{"$f":"'T3'!I108","v":0},{"$f":"IF(C108=\"A\",\"ABSENT\",IF(C108>='T3'!$F$5*$E$124/100,\"EXCELLENT\",IF(C108>='T3'!$F$5*$E$123/100,\"GOOD\",IF(C108>='T3'!$F$5*$E$122/100,\"AVERAGE\",\"POOR\"))))","v":"POOR"}]
[{"$f":"Data_Sheet!A109","v":"JEC18CS086"},{"$f":"Data_Sheet!B109","v":"SREEKANTH P"},{"$f":"'T3'!I109","v":0},{"$f":"IF(C109=\"A\",\"ABSENT\",IF(C109>='T3'!$F$5*$E$124/100,\"EXCELLENT\",IF(C109>='T3'!$F$5*$E$123/100,\"GOOD\",IF(C109>='T3'!$F$5*$E$122/100,\"AVERAGE\",\"POOR\"))))","v":"POOR"}]
[{"$f":"Data_Sheet!A110","v":"JEC18CS087"},{"$f":"Data_Sheet!B110","v":"SREELEKSHMI H KUMAR"},{"$f":"'T3'!I110","v":0},{"$f":"IF(C110=\"A\",\"ABSENT\",IF(C110>='T3'!$F$5*$E$124/100,\"EXCELLENT\",IF(C110>='T3'!$F$5*$E$123/100,\"GOOD\",IF(C110>='T3'!$F$5*$E$122/100,\"AVERAGE\",\"POOR\"))))","v":"POOR"}]
[{"$f":"Data_Sheet!A111","v":"JEC18CS088"},{"$f":"Data_Sheet!B111","v":"SUFAIL BADUSHA.T"},{"$f":"'T3'!I111","v":0},{"$f":"IF(C111=\"A\",\"ABSENT\",IF(C111>='T3'!$F$5*$E$124/100,\"EXCELLENT\",IF(C111>='T3'!$F$5*$E$123/100,\"GOOD\",IF(C111>='T3'!$F$5*$E$122/100,\"AVERAGE\",\"POOR\"))))","v":"POOR"}]
[{"$f":"Data_Sheet!A112","v":"JEC18CS089"},{"$f":"Data_Sheet!B112","v":"TIYA THOMAS"},{"$f":"'T3'!I112","v":0},{"$f":"IF(C112=\"A\",\"ABSENT\",IF(C112>='T3'!$F$5*$E$124/100,\"EXCELLENT\",IF(C112>='T3'!$F$5*$E$123/100,\"GOOD\",IF(C112>='T3'!$F$5*$E$122/100,\"AVERAGE\",\"POOR\"))))","v":"POOR"}]
[{"$f":"Data_Sheet!A113","v":"JEC18CS090"},{"$f":"Data_Sheet!B113","v":"TOMSUN PAVOO P"},{"$f":"'T3'!I113","v":0},{"$f":"IF(C113=\"A\",\"ABSENT\",IF(C113>='T3'!$F$5*$E$124/100,\"EXCELLENT\",IF(C113>='T3'!$F$5*$E$123/100,\"GOOD\",IF(C113>='T3'!$F$5*$E$122/100,\"AVERAGE\",\"POOR\"))))","v":"POOR"}]
[{"$f":"Data_Sheet!A114","v":"JEC18CS091"},{"$f":"Data_Sheet!B114","v":"ULLAS. S"},{"$f":"'T3'!I114","v":0},{"$f":"IF(C114=\"A\",\"ABSENT\",IF(C114>='T3'!$F$5*$E$124/100,\"EXCELLENT\",IF(C114>='T3'!$F$5*$E$123/100,\"GOOD\",IF(C114>='T3'!$F$5*$E$122/100,\"AVERAGE\",\"POOR\"))))","v":"POOR"}]
[{"$f":"Data_Sheet!A115","v":"JEC18CS092"},{"$f":"Data_Sheet!B115","v":"VAISHNAV M"},{"$f":"'T3'!I115","v":0},{"$f":"IF(C115=\"A\",\"ABSENT\",IF(C115>='T3'!$F$5*$E$124/100,\"EXCELLENT\",IF(C115>='T3'!$F$5*$E$123/100,\"GOOD\",IF(C115>='T3'!$F$5*$E$122/100,\"AVERAGE\",\"POOR\"))))","v":"POOR"}]
[{"$f":"Data_Sheet!A116","v":"JEC18CS093"},{"$f":"Data_Sheet!B116","v":"VANI PRAKASHAN CHOYYAN"},{"$f":"'T3'!I116","v":0},{"$f":"IF(C116=\"A\",\"ABSENT\",IF(C116>='T3'!$F$5*$E$124/100,\"EXCELLENT\",IF(C116>='T3'!$F$5*$E$123/100,\"GOOD\",IF(C116>='T3'!$F$5*$E$122/100,\"AVERAGE\",\"POOR\"))))","v":"POOR"}]
[]
["Total Number of Students",null,{"$f":"Data_Sheet!$C$6","v":92}]
["Number of Students Absent",null,{"$f":"IF(COUNTIF(C25:INDIRECT(C131),\"=A\"),COUNTIF(C25:INDIRECT(C131),\"=A\"),0)","v":0}]
["Total Number of Students attended",null,{"$f":"C118-C119","v":92}]
[{"$f":"\"Number of Students with Marks less than \"&E122&\"%\"","v":"Number of Students with Marks less than 45%"},null,{"$f":"IF(COUNTIF(D25:INDIRECT(D131),\"=POOR\"),COUNTIF(D25:INDIRECT(D131),\"=POOR\"),0)","v":92},"POOR","Range"]
[{"$f":"\"Number of Students with Marks betweeen \"&E122&\"% to \"&E123&\"%\"","v":"Number of Students with Marks betweeen 45% to 60%"},null,{"$f":"IF(COUNTIF(D25:INDIRECT(D131),\"=AVERAGE\"),COUNTIF(D25:INDIRECT(D131),\"=AVERAGE\"),0)","v":0},"AVERAGE",45]
[{"$f":"\"Number of Students with Marks betweeen \"&E123&\"% to \"&E124&\"%\"","v":"Number of Students with Marks betweeen 60% to 80%"},null,{"$f":"IF(COUNTIF(D25:INDIRECT(D131),\"=GOOD\"),COUNTIF(D25:INDIRECT(D131),\"=GOOD\"),0)","v":0},"GOOD",60]
[{"$f":"\"Number of Students with Marks greater than \"&E124&\"%\"","v":"Number of Students with Marks greater than 80%"},null,{"$f":"IF(COUNTIF(D25:INDIRECT(D131),\"=EXCELLENT\"),COUNTIF(D25:INDIRECT(D131),\"=EXCELLENT\"),0)","v":0},"EXCELLENT",80]
["Class Average",null,{"$f":"ROUND(AVERAGE(C25:INDIRECT(C131)),2)","v":0}]
["Pass Percentage",null,{"$f":"ROUND(((C120-C121)/C120)*100,2)","v":0}]
[]
[null,{"$f":"Data_Sheet!B10","v":"Name of Faculty : "},{"$f":"Data_Sheet!B11","v":"Namitha T N"}]
[null,{"$f":"Data_Sheet!B136","v":"Dated Signature :  "}]
[]
[{"$f":"ROW(A118)-2","v":116},"Last Row Count",{"$f":"\"$C$\"&$A$131","v":"$C$116"},{"$f":"\"$D$\"&$A$131","v":"$D$116"}]

{"sheet":"A1","index":8,"n_rows":181,"n_cols":16,"rows_kept":181,"cut":false,"hidden":false,"merged":[[17,8,21,8],[147,12,152,12],[154,12,159,12],[161,12,166,12],[168,12,173,12],[140,12,145,12],[6,0,6,5],[8,0,8,5],[10,0,10,5],[12,0,12,5],[17,0,21,0],[17,1,21,1],[17,5,21,5],[117,0,117,2],[118,0,118,2],[119,0,119,2],[120,0,120,2],[121,0,121,2],[2,0,4,1],[0,2,0,3],[1,2,1,3],[4,2,4,3],[3,2,3,4],[2,2,2,4]]}
[null,null,"Date : "]
[null,null,"2018-02-11"]
["Add questions one by one as needed..",null,"Assessment Category",null,null,null,"CO1","First Internal Exam"]
[null,null,"Assignment - 1",null,null,null,"CO2","Second Internal Exam"]
[null,null,"Total Marks : ",null,10,null,"CO3","Assessment Exam - 1"]
[null,null,null,null,null,null,"CO4","Assessment Exam - 2"]
[{"$f":"Data_Sheet!A2","v":"Jyothi Engineering College, Cheruthuruthy"},null,null,null,null,null,"CO5","Assignment - 1"]
[null,null,null,null,null,null,"CO6","Assignment - 2"]
[{"$f":"Data_Sheet!A4","v":"Department of Computer Science Engineering"},null,null,null,null,null,null,"Retest"]
[null,null,null,null,null,null,1]
[{"$f":"\"CO Analysis - Internal Marks : \"&C4 &\"                       \" &TEXT(C2,\"dd-mm-yy\")","v":"CO Analysis - Internal Marks : Assignment - 1                       11-02-18"},null,null,null,null,null,2]
[null,null,null,null,null,null,3]
[{"$f":"Data_Sheet!A17","v":"S3 CS              CS203 Switching Theory and Logic Design               2019-20"},null,null,null,null,null,4]
[null,null,null,null,null,null,5]
[null,null,null,null,null,null,6]
[]
[]
["Register No.","Name of Student","Qn. No.",1,2,{"$f":" \"Total Marks (\" &E5 & \")\"","v":"Total Marks (10)"},null,null,"Calculated Total Marks (10)"]
[null,null,"CO's","CO1","CO2"]
[null,null,"Blooms Taxonomy Lavel","1, 2, 3, 4, 5, 6",2]
[null,null,"Max. Marks",5,5]
[null,null,"Difficulty Level in %",60,60]
[]
["Column1","Column2","Column3","Column4","Column5","Column32"]
[{"$f":"Data_Sheet!A25","v":"JEC18CS001"},{"$f":"Data_Sheet!B25","v":"ABHISHEK KRISHNAN MENON E"},null,5,5,10]
[{"$f":"Data_Sheet!A26","v":"JEC18CS002"},{"$f":"Data_Sheet!B26","v":"ABHISHEK SAJEEVAN"},null,2.5,2.5,5]
[{"$f":"Data_Sheet!A27","v":"JEC18CS003"},{"$f":"Data_Sheet!B27","v":"ABHITH SHAJI"},null,4.5,4.5,9]
[{"$f":"Data_Sheet!A28","v":"JEC18CS004"},{"$f":"Data_Sheet!B28","v":"ABIN SANTHOSH ALAPATT"},null,5,5,10]
[{"$f":"Data_Sheet!A29","v":"JEC18CS005"},{"$f":"Data_Sheet!B29","v":"ADARSH KUMAR M A"},null,5,5,10]
[{"$f":"Data_Sheet!A30","v":"JEC18CS006"},{"$f":"Data_Sheet!B30","v":"ADHITHYA KRISHNA S"},null,4.5,4.5,9]
[{"$f":"Data_Sheet!A31","v":"JEC18CS007"},{"$f":"Data_Sheet!B31","v":"ADITHYA HARIDAS"},null,5,5,10]
[{"$f":"Data_Sheet!A32","v":"JEC18CS008"},{"$f":"Data_Sheet!B32","v":"AJMAL BASHEER"},null,2.5,2.5,5]
[{"$f":"Data_Sheet!A33","v":"JEC18CS009"},{"$f":"Data_Sheet!B33","v":"AKASH.V"},null,4,5,9]
[{"$f":"Data_Sheet!A34","v":"JEC18CS010"},{"$f":"Data_Sheet!B34","v":"AKHIL AZEEZ UPPILAMKUNNATH"},null,5,5,10]
[{"$f":"Data_Sheet!A35","v":"JEC18CS011"},{"$f":"Data_Sheet!B35","v":"AKHIL KRISHNA UK"},null,4,5,9]
[{"$f":"Data_Sheet!A36","v":"JEC18CS012"},{"$f":"Data_Sheet!B36","v":"ALAN GEORGE"},null,5,5,10]
[{"$f":"Data_Sheet!A37","v":"JEC18CS013"},{"$f":"Data_Sheet!B37","v":"ALEN VARGHESE"},null,5,5,10]
[{"$f":"Data_Sheet!A38","v":"JEC18CS014"},{"$f":"Data_Sheet!B38","v":"AMAL SEBASTIAN"},null,5,5,10]
[{"$f":"Data_Sheet!A39","v":"JEC18CS015"},{"$f":"Data_Sheet!B39","v":"AMAL SONY"},null,3,5,8]
[{"$f":"Data_Sheet!A40","v":"JEC18CS016"},{"$f":"Data_Sheet!B40","v":"ANAGHA WILSON"},null,5,5,10]
[{"$f":"Data_Sheet!A41","v":"JEC18CS017"},{"$f":"Data_Sheet!B41","v":"ANETTE ANTO"},null,5,5,10]
[{"$f":"Data_Sheet!A42","v":"JEC18CS018"},{"$f":"Data_Sheet!B42","v":"ANIT MARY THOMAS"},null,5,5,10]
[{"$f":"Data_Sheet!A43","v":"JEC18CS020"},{"$f":"Data_Sheet!B43","v":"ANN THERESA SHAJI"},null,5,5,10]
[{"$f":"Data_Sheet!A44","v":"JEC18CS021"},{"$f":"Data_Sheet!B44","v":"ANTONY ROY"},null,4,5,9]
[{"$f":"Data_Sheet!A45","v":"JEC18CS022"},{"$f":"Data_Sheet!B45","v":"ANUGRAHA C"},null,5,5,10]
[{"$f":"Data_Sheet!A46","v":"JEC18CS023"},{"$f":"Data_Sheet!B46","v":"APARNA.V"},null,5,5,10]
[{"$f":"Data_Sheet!A47","v":"JEC18CS024"},{"$f":"Data_Sheet!B47","v":"ARAVIND S KUMAR"},null,5,5,10]
[{"$f":"Data_Sheet!A48","v":"JEC18CS025"},{"$f":"Data_Sheet!B48","v":"ARJUN VINOD"},null,3,2,5]
[{"$f":"Data_Sheet!A49","v":"JEC18CS026"},{"$f":"Data_Sheet!B49","v":"ARUN VG"},null,5,5,10]
[{"$f":"Data_Sheet!A50","v":"JEC18CS027"},{"$f":"Data_Sheet!B50","v":"ASHRUL K"},null,5,5,10]
[{"$f":"Data_Sheet!A51","v":"JEC18CS028"},{"$f":"Data_Sheet!B51","v":"ATHIL PAULY"},null,4,5,9]
[{"$f":"Data_Sheet!A52","v":"JEC18CS029"},{"$f":"Data_Sheet!B52","v":"ATHIRA K P"},null,5,5,10]
[{"$f":"Data_Sheet!A53","v":"JEC18CS030"},{"$f":"Data_Sheet!B53","v":"AWIN ANTO"},null,5,5,10]
[{"$f":"Data_Sheet!A54","v":"JEC18CS031"},{"$f":"Data_Sheet!B54","v":"CHARLES JOHNSON"},null,5,4,9]
[{"$f":"Data_Sheet!A55","v":"JEC18CS032"},{"$f":"Data_Sheet!B55","v":"CHITTILAPPILLY JOVIA JOHNSON"},null,5,5,10]
[{"$f":"Data_Sheet!A56","v":"JEC18CS033"},{"$f":"Data_Sheet!B56","v":"CIYA BABU"},null,5,5,10]
[{"$f":"Data_Sheet!A57","v":"JEC18CS034"},{"$f":"Data_Sheet!B57","v":"DAVID SALUS"},null,5,5,10]
[{"$f":"Data_Sheet!A58","v":"JEC18CS035"},{"$f":"Data_Sheet!B58","v":"DELICIA REJI"},null,5,5,10]
[{"$f":"Data_Sheet!A59","v":"JEC18CS036"},{"$f":"Data_Sheet!B59","v":"DELMA SHAJAN"},null,5,5,10]
[{"$f":"Data_Sheet!A60","v":"JEC18CS037"},{"$f":"Data_Sheet!B60","v":"DILBER SHA AP"},null,4,5,9]
[{"$f":"Data_Sheet!A61","v":"JEC18CS038"},{"$f":"Data_Sheet!B61","v":"EDWIN T JOY"},null,4,5,9]
[{"$f":"Data_Sheet!A62","v":"JEC18CS039"},{"$f":"Data_Sheet!B62","v":"EDWIN WILSON"},null,4,5,9]
[{"$f":"Data_Sheet!A63","v":"JEC18CS040"},{"$f":"Data_Sheet!B63","v":"EMMANUEL SHIBU"},null,5,5,10]
[{"$f":"Data_Sheet!A64","v":"JEC18CS041"},{"$f":"Data_Sheet!B64","v":"GAYATHRI DINESH"},null,5,5,10]
[{"$f":"Data_Sheet!A65","v":"JEC18CS042"},{"$f":"Data_Sheet!B65","v":"GOKUL DAS M"},null,5,5,10]
[{"$f":"Data_Sheet!A66","v":"JEC18CS043"},{"$f":"Data_Sheet!B66","v":"G RAMGOPAL"},null,5,5,10]
[{"$f":"Data_Sheet!A67","v":"JEC18CS044"},{"$f":"Data_Sheet!B67","v":"HARIES DAVIS"},null,5,5,10]
[{"$f":"Data_Sheet!A68","v":"JEC18CS045"},{"$f":"Data_Sheet!B68","v":"HARISANKER P"},null,5,5,10]
[{"$f":"Data_Sheet!A69","v":"JEC18CS046"},{"$f":"Data_Sheet!B69","v":"HARSHA.K.S."},null,5,5,10]
[{"$f":"Data_Sheet!A70","v":"JEC18CS047"},{"$f":"Data_Sheet!B70","v":"HELNA THOMAS"},null,5,5,10]
[{"$f":"Data_Sheet!A71","v":"JEC18CS048"},{"$f":"Data_Sheet!B71","v":"HRIDI KRISHNA.H"},null,5,5,10]
[{"$f":"Data_Sheet!A72","v":"JEC18CS049"},{"$f":"Data_Sheet!B72","v":"INDRAJIT R"},null,5,3,8]
[{"$f":"Data_Sheet!A73","v":"JEC18CS050"},{"$f":"Data_Sheet!B73","v":"JESWIN JOJY"},null,5,3,8]
[{"$f":"Data_Sheet!A74","v":"JEC18CS051"},{"$f":"Data_Sheet!B74","v":"JIBIN A BABU"},null,5,5,10]
[{"$f":"Data_Sheet!A75","v":"JEC18CS052"},{"$f":"Data_Sheet!B75","v":"JISSY JOY"},null,5,5,10]
[{"$f":"Data_Sheet!A76","v":"JEC18CS053"},{"$f":"Data_Sheet!B76","v":"JOEL JAMES KARIKKANDATHIL"},null,5,5,10]
[{"$f":"Data_Sheet!A77","v":"JEC18CS054"},{"$f":"Data_Sheet!B77","v":"JOSE REJI KARIMADATHI"},null,5,3,8]
[{"$f":"Data_Sheet!A78","v":"JEC18CS055"},{"$f":"Data_Sheet!B78","v":"JUMANA HASIN"},null,5,5,10]
[{"$f":"Data_Sheet!A79","v":"JEC18CS056"},{"$f":"Data_Sheet!B79","v":"KAILASHNATH"},null,5,5,9]
[{"$f":"Data_Sheet!A80","v":"JEC18CS057"},{"$f":"Data_Sheet!B80","v":"K AJISHKUMAR"},null,5,5,9]
[{"$f":"Data_Sheet!A81","v":"JEC18CS058"},{"$f":"Data_Sheet!B81","v":"KEERTHANA K S"},null,5,5,9]
[{"$f":"Data_Sheet!A82","v":"JEC18CS059"},{"$f":"Data_Sheet!B82","v":"KEVIN VARGHESE"},null,5,5,10]
[{"$f":"Data_Sheet!A83","v":"JEC18CS060"},{"$f":"Data_Sheet!B83","v":"LAKSHMI SADANANDAN"},null,5,5,10]
[{"$f":"Data_Sheet!A84","v":"JEC18CS061"},{"$f":"Data_Sheet!B84","v":"LEYA PALLAN"},null,5,5,10]
[{"$f":"Data_Sheet!A85","v":"JEC18CS062"},{"$f":"Data_Sheet!B85","v":"MARVEL BABU"},null,5,4,9]
[{"$f":"Data_Sheet!A86","v":"JEC18CS063"},{"$f":"Data_Sheet!B86","v":"MEDWIN PAUL"},null,2.5,2.5,5]
[{"$f":"Data_Sheet!A87","v":0},{"$f":"Data_Sheet!B87","v":0}]
[{"$f":"Data_Sheet!A88","v":0},{"$f":"Data_Sheet!B88","v":0}]
[{"$f":"Data_Sheet!A89","v":"JEC18CS066"},{"$f":"Data_Sheet!B89","v":"MUHAMMED INSHADH"},null,5,4,9]
[{"$f":"Data_Sheet!A90","v":"JEC18CS067"},{"$f":"Data_Sheet!B90","v":"NAIR MIDHUN RAMACHANDRAN"},null,5,3,8]
[{"$f":"Data_Sheet!A91","v":"JEC18CS068"},{"$f":"Data_Sheet!B91","v":"NAVEENA ANTONY"},null,5,5,10]
[{"$f":"Data_Sheet!A92","v":"JEC18CS069"},{"$f":"Data_Sheet!B92","v":"NITIN MADHU"},null,5,3,8]
[{"$f":"Data_Sheet!A93","v":"JEC18CS070"},{"$f":"Data_Sheet!B93","v":"PRATHIUSH ARUN"},null,5,5,10]
[{"$f":"Data_Sheet!A94","v":"JEC18CS071"},{"$f":"Data_Sheet!B94","v":"RACHEL CECER"},null,5,5,10]
[{"$f":"Data_Sheet!A95","v":"JEC18CS072"},{"$f":"Data_Sheet!B95","v":"RAHUL RAJU"},null,5,5,10]
[{"$f":"Data_Sheet!A96","v":"JEC18CS073"},{"$f":"Data_Sheet!B96","v":"RAHUL T RAVI"},null,5,5,10]
[{"$f":"Data_Sheet!A97","v":"JEC18CS074"},{"$f":"Data_Sheet!B97","v":"RAPHEAL K MOYALAN"},null,5,2,7]
[{"$f":"Data_Sheet!A98","v":"JEC18CS075"},{"$f":"Data_Sheet!B98","v":"RISHIKESH. V"},null,5,4,9]
[{"$f":"Data_Sheet!A99","v":"JEC18CS076"},{"$f":"Data_Sheet!B99","v":"ROCKSON T. AUGUSTINE"},null,3,5,8]
[{"$f":"Data_Sheet!A100","v":"JEC18CS077"},{"$f":"Data_Sheet!B100","v":"SARATH C P"},null,5,5,10]
[{"$f":"Data_Sheet!A101","v":"JEC18CS078"},{"$f":"Data_Sheet!B101","v":"SARATH SASI"},null,5,3,8]
[{"$f":"Data_Sheet!A102","v":"JEC18CS079"},{"$f":"Data_Sheet!B102","v":"SHAFNA"},null,5,5,10]
[{"$f":"Data_Sheet!A103","v":"JEC18CS080"},{"$f":"Data_Sheet!B103","v":"SHELMY SHABU"},null,5,5,10]
[{"$f":"Data_Sheet!A104","v":"JEC18CS081"},{"$f":"Data_Sheet!B104","v":"SHIZA SHIHAB PUVAMPARAMBIL"},null,5,5,10]
[{"$f":"Data_Sheet!A105","v":"JEC18CS082"},{"$f":"Data_Sheet!B105","v":"SIJO GEORGE"},null,5,3,8]
[{"$f":"Data_Sheet!A106","v":"JEC18CS083"},{"$f":"Data_Sheet!B106","v":"SOURAV K"},null,5,5,8]
[{"$f":"Data_Sheet!A107","v":0},{"$f":"Data_Sheet!B107","v":0},null,null,null,0]
[{"$f":"Data_Sheet!A108","v":"JEC18CS085"},{"$f":"Data_Sheet!B108","v":"SREEHARI"},null,5,2,7]
[{"$f":"Data_Sheet!A109","v":"JEC18CS086"},{"$f":"Data_Sheet!B109","v":"SREEKANTH P"},null,2,5,7]
[{"$f":"Data_Sheet!A110","v":"JEC18CS087"},{"$f":"Data_Sheet!B110","v":"SREELEKSHMI H KUMAR"},null,5,5,10]
[{"$f":"Data_Sheet!A111","v":"JEC18CS088"},{"$f":"Data_Sheet!B111","v":"SUFAIL BADUSHA.T"},null,5,4,9]
[{"$f":"Data_Sheet!A112","v":"JEC18CS089"},{"$f":"Data_Sheet!B112","v":"TIYA THOMAS"},null,5,5,10]
[{"$f":"Data_Sheet!A113","v":"JEC18CS090"},{"$f":"Data_Sheet!B113","v":"TOMSUN PAVOO P"},null,5,5,10]
[{"$f":"Data_Sheet!A114","v":"JEC18CS091"},{"$f":"Data_Sheet!B114","v":"ULLAS. S"},null,2.5,2.5,5]
[{"$f":"Data_Sheet!A115","v":"JEC18CS092"},{"$f":"Data_Sheet!B115","v":"VAISHNAV M"},null,2.5,2.5,5]
[{"$f":"Data_Sheet!A116","v":"JEC18CS093"},{"$f":"Data_Sheet!B116","v":"VANI PRAKASHAN CHOYYAN"},null,5,5,10]
[]
["Total Marks scored for the Question",null,null,{"$f":"IF(D$22<>\"\",IF(SUM(D25:INDIRECT(D138))>=0,SUM(D25:INDIRECT(D138)),\"\"),\"\")","v":415.5},{"$f":"IF(E$22<>\"\",IF(SUM(E25:INDIRECT(E138))>=0,SUM(E25:INDIRECT(E138)),\"\"),\"\")","v":403.5}]
["No. of Students who attended the Question",null,null,{"$f":"IF(D$22<>\"\",IF(COUNT(D25:INDIRECT(D138))>=0,COUNT(D25:INDIRECT(D138)),\"\"),\"\")","v":89},{"$f":"IF(E$22<>\"\",IF(COUNT(E25:INDIRECT(E138))>=0,COUNT(E25:INDIRECT(E138)),\"\"),\"\")","v":89}]
["Difficulty Level marks of the Question",null,null,{"$f":"IF(D21*D22/100=0,\"\",D21*D22/100)","v":3},3]
["No. of Students who scored above the Difficulty Level",null,null,{"$f":"IF(COUNTIF(D25:INDIRECT(D138),\">=\"&D120)=0,\"\",COUNTIF(D25:INDIRECT(D138),\">=\"&D120))","v":83},{"$f":"IF(COUNTIF(E25:INDIRECT(E138),\">=\"&E120)=0,\"\",COUNTIF(E25:INDIRECT(E138),\">=\"&E120))","v":81}]
["% of Students who scored above the Difficulty Level",null,null,{"$f":"IFERROR(ROUND(D121/D119*100,2),\"\")","v":93.26},91.01]
[null,null,null,{"$f":"IF(D122=\"\",0,IF(D122>=80,3,IF(D122>=70,2,IF(D122>=60,1,0))))","v":3},3,"Marks",null,null,null,"T_Marks","S_Marks","Students","Level","Above","Above %","Attainment"]
[null,{"$f":"IF(Data_Sheet!A119<>\"\",\"Total Attainment level for \"&Data_Sheet!A119&\" :\",\"\")","v":"Total Attainment level for CO1 :"},{"$f":"IF(Data_Sheet!A119<>\"\",I124,\"\")","v":3},{"$f":"IFERROR((IF(ISNUMBER(SEARCH(\"1\", D$19)),D$21,\"0\")),\"0\")*D123","v":15},{"$f":"IFERROR((IF(ISNUMBER(SEARCH(\"1\", E$19)),E$21,\"0\")),\"0\")*E123","v":0},{"$f":"F141","v":5},null,null,{"$f":"IF(F124=0,\"\",ROUND(SUM(D124:E124)/F124,2))","v":3},{"$f":"F141","v":5},{"$f":"F148","v":415.5},{"$f":"F155","v":89},{"$f":"F162","v":3},{"$f":"F169","v":83},{"$f":"IFERROR(ROUND(N124/L124*100,2),\"\")","v":93.26},{"$f":"IF(O124=\"\",\"\",IF(O124>=80,3,IF(O124>=70,2,IF(O124>=60,1,0))))","v":3}]
[null,{"$f":"IF(Data_Sheet!A120<>\"\",\"Total Attainment level for \"&Data_Sheet!A120&\" :\",\"\")","v":"Total Attainment level for CO2 :"},{"$f":"IF(Data_Sheet!A120<>\"\",I125,\"\")","v":3},{"$f":"IFERROR((IF(ISNUMBER(SEARCH(\"2\", D$19)),D$21,\"0\")),\"0\")*D123","v":0},{"$f":"IFERROR((IF(ISNUMBER(SEARCH(\"2\", E$19)),E$21,\"0\")),\"0\")*E123","v":15},{"$f":"F142","v":5},null,null,3,{"$f":"F142","v":5},{"$f":"F149","v":403.5},{"$f":"F156","v":89},{"$f":"F163","v":3},{"$f":"F170","v":81},{"$f":"IFERROR(ROUND(N125/L125*100,2),\"\")","v":91.01},{"$f":"IF(O125=\"\",\"\",IF(O125>=80,3,IF(O125>=70,2,IF(O125>=60,1,0))))","v":3}]
[null,{"$f":"IF(Data_Sheet!A121<>\"\",\"Total Attainment level for \"&Data_Sheet!A121&\" :\",\"\")","v":"Total Attainment level for CO3 :"},{"$f":"IF(Data_Sheet!A121<>\"\",I126,\"\")","v":""},{"$f":"IFERROR((IF(ISNUMBER(SEARCH(\"3\", D$19)),D$21,\"0\")),\"0\")*D123","v":0},{"$f":"IFERROR((IF(ISNUMBER(SEARCH(\"3\", E$19)),E$21,\"0\")),\"0\")*E123","v":0},0,null,null,"",0,0,0,0,0,"",""]
[null,{"$f":"IF(Data_Sheet!A122<>\"\",\"Total Attainment level for \"&Data_Sheet!A122&\" :\",\"\")","v":"Total Attainment level for CO4 :"},{"$f":"IF(Data_Sheet!A122<>\"\",I127,\"\")","v":""},{"$f":"IFERROR((IF(ISNUMBER(SEARCH(\"4\", D$19)),D$21,\"0\")),\"0\")*D123","v":0},{"$f":"IFERROR((IF(ISNUMBER(SEARCH(\"4\", E$19)),E$21,\"0\")),\"0\")*E123","v":0},0,null,null,"",0,0,0,0,0,"",""]
[null,{"$f":"IF(Data_Sheet!A123<>\"\",\"Total Attainment level for \"&Data_Sheet!A123&\" :\",\"\")","v":"Total Attainment level for CO5 :"},{"$f":"IF(Data_Sheet!A123<>\"\",I128,\"\")","v":""},{"$f":"IFERROR((IF(ISNUMBER(SEARCH(\"5\", D$19)),D$21,\"0\")),\"0\")*D123","v":0},{"$f":"IFERROR((IF(ISNUMBER(SEARCH(\"5\", E$19)),E$21,\"0\")),\"0\")*E123","v":0},0,null,null,"",0,0,0,0,0,"",""]
[null,{"$f":"IF(Data_Sheet!A124<>\"\",\"Total Attainment level for \"&Data_Sheet!A124&\" :\",\"\")","v":"Total Attainment level for CO6 :"},{"$f":"IF(Data_Sheet!A124<>\"\",I129,\"\")","v":""},{"$f":"IFERROR((IF(ISNUMBER(SEARCH(\"6\", D$19)),D$21,\"0\")),\"0\")*D123","v":0},{"$f":"IFERROR((IF(ISNUMBER(SEARCH(\"6\", E$19)),E$21,\"0\")),\"0\")*E123","v":0},0,null,null,"",0,0,0,0,0,"",""]
[]
[{"$f":"Data_Sheet!A127","v":"Attainment Level 1: 60% students scoring more than 60% of the Total Marks"}]
[{"$f":"Data_Sheet!A128","v":"Attainment Level 2: 70% students scoring more than 60% of the Total Marks"}]
[{"$f":"Data_Sheet!A129","v":"Attainment Level 3: 80% students scoring more than 60% of the Total Marks"}]
[]
[null,{"$f":"Data_Sheet!B10","v":"Name of Faculty : "},{"$f":"Data_Sheet!B11","v":"Namitha T N"}]
[null,{"$f":"Data_Sheet!B136","v":"Dated Signature :  "}]
[]
[null,"Last Row Count",{"$f":"ROW(A118)-2","v":116},{"$f":"SUBSTITUTE(ADDRESS(1,COLUMN(D1),2),\"1\",\"\")&$C$138","v":"D$116"},{"$f":"\"E\"&$C$138","v":"E116"}]
[]
[]
[null,null,"CO1",{"$f":"IFERROR((IF(ISNUMBER(SEARCH(\"1\", D$19)),D$21,\"0\")),\"0\")","v":5},{"$f":"IFERROR((IF(ISNUMBER(SEARCH(\"1\", E$19)),E$21,\"0\")),\"0\")","v":"0"},{"$f":"IFERROR(SUM($D141:INDIRECT($I141)),\"0\")","v":5},null,null,{"$f":"SUBSTITUTE(ADDRESS(1,K141,4),1,\"\")&ROW($I141)","v":"E141"},{"$f":"COUNTIF($D$20:INDIRECT($L141),\"*1*\")","v":1},{"$f":"COLUMN($F$19)-1","v":5},{"$f":"SUBSTITUTE(ADDRESS(1,K141,4),1,\"\")&ROW($I$19)+1","v":"E20"},"Total Marks"]
[null,null,"CO2",{"$f":"IFERROR((IF(ISNUMBER(SEARCH(\"2\", D$19)),D$21,\"0\")),\"0\")","v":"0"},{"$f":"IFERROR((IF(ISNUMBER(SEARCH(\"2\", E$19)),E$21,\"0\")),\"0\")","v":5},{"$f":"IFERROR(SUM($D142:INDIRECT($I142)),\"0\")","v":5},null,null,"E142",{"$f":"COUNTIF($D$20:INDIRECT($L142),\"*2*\")","v":1},{"$f":"COLUMN($F$19)-1","v":5},{"$f":"SUBSTITUTE(ADDRESS(1,K142,4),1,\"\")&ROW($I$19)+1","v":"E20"}]
[null,null,"CO3",{"$f":"IFERROR((IF(ISNUMBER(SEARCH(\"3\", D$19)),D$21,\"0\")),\"0\")","v":"0"},{"$f":"IFERROR((IF(ISNUMBER(SEARCH(\"3\", E$19)),E$21,\"0\")),\"0\")","v":"0"},{"$f":"IFERROR(SUM($D143:INDIRECT($I143)),\"0\")","v":0},null,null,"E143",{"$f":"COUNTIF($D$20:INDIRECT($L143),\"*2*\")","v":1},5,"E20"]
[null,null,"CO4",{"$f":"IFERROR((IF(ISNUMBER(SEARCH(\"4\", D$19)),D$21,\"0\")),\"0\")","v":"0"},{"$f":"IFERROR((IF(ISNUMBER(SEARCH(\"4\", E$19)),E$21,\"0\")),\"0\")","v":"0"},{"$f":"IFERROR(SUM($D144:INDIRECT($I144)),\"0\")","v":0},null,null,"E144",{"$f":"COUNTIF($D$20:INDIRECT($L144),\"*2*\")","v":1},5,"E20"]
[null,null,"CO5",{"$f":"IFERROR((IF(ISNUMBER(SEARCH(\"5\", D$19)),D$21,\"0\")),\"0\")","v":"0"},{"$f":"IFERROR((IF(ISNUMBER(SEARCH(\"5\", E$19)),E$21,\"0\")),\"0\")","v":"0"},{"$f":"IFERROR(SUM($D145:INDIRECT($I145)),\"0\")","v":0},null,null,"E145",{"$f":"COUNTIF($D$20:INDIRECT($L145),\"*2*\")","v":1},5,"E20"]
[null,null,"CO6",{"$f":"IFERROR((IF(ISNUMBER(SEARCH(\"6\", D$19)),D$21,\"0\")),\"0\")","v":"0"},{"$f":"IFERROR((IF(ISNUMBER(SEARCH(\"6\", E$19)),E$21,\"0\")),\"0\")","v":"0"},{"$f":"IFERROR(SUM($D146:INDIRECT($I146)),\"0\")","v":0},null,null,"E146",{"$f":"COUNTIF($D$20:INDIRECT($L146),\"*2*\")","v":1},5,"E20"]
[]
[null,null,"CO1",{"$f":"IFERROR((IF(ISNUMBER(SEARCH(\"1\", D$19)),D$118,\"0\")),\"0\")","v":415.5},{"$f":"IFERROR((IF(ISNUMBER(SEARCH(\"1\", E$19)),E$118,\"0\")),\"0\")","v":"0"},{"$f":"IFERROR(SUM($D148:INDIRECT($I148)),\"0\")","v":415.5},null,null,{"$f":"SUBSTITUTE(ADDRESS(1,K148,4),1,\"\")&ROW($I148)","v":"E148"},{"$f":"COUNTIF($D$20:INDIRECT($L148),\"*1*\")","v":1},{"$f":"COLUMN($F$19)-1","v":5},{"$f":"SUBSTITUTE(ADDRESS(1,K148,4),1,\"\")&ROW($I$19)+1","v":"E20"},"Total Marks Scored"]
[null,null,"CO2",{"$f":"IFERROR((IF(ISNUMBER(SEARCH(\"2\", D$19)),D$118,\"0\")),\"0\")","v":"0"},{"$f":"IFERROR((IF(ISNUMBER(SEARCH(\"2\", E$19)),E$118,\"0\")),\"0\")","v":403.5},{"$f":"IFERROR(SUM($D149:INDIRECT($I149)),\"0\")","v":403.5},null,null,"E149",{"$f":"COUNTIF($D$20:INDIRECT($L149),\"*2*\")","v":1},{"$f":"COLUMN($F$19)-1","v":5},{"$f":"SUBSTITUTE(ADDRESS(1,K149,4),1,\"\")&ROW($I$19)+1","v":"E20"}]
[null,null,"CO3",{"$f":"IFERROR((IF(ISNUMBER(SEARCH(\"3\", D$19)),D$118,\"0\")),\"0\")","v":"0"},{"$f":"IFERROR((IF(ISNUMBER(SEARCH(\"3\", E$19)),E$118,\"0\")),\"0\")","v":"0"},{"$f":"IFERROR(SUM($D150:INDIRECT($I150)),\"0\")","v":0},null,null,"E150",{"$f":"COUNTIF($D$20:INDIRECT($L150),\"*2*\")","v":1},5,"E20"]
[null,null,"CO4",{"$f":"IFERROR((IF(ISNUMBER(SEARCH(\"4\", D$19)),D$118,\"0\")),\"0\")","v":"0"},{"$f":"IFERROR((IF(ISNUMBER(SEARCH(\"4\", E$19)),E$118,\"0\")),\"0\")","v":"0"},{"$f":"IFERROR(SUM($D151:INDIRECT($I151)),\"0\")","v":0},null,null,"E151",{"$f":"COUNTIF($D$20:INDIRECT($L151),\"*2*\")","v":1},5,"E20"]
[null,null,"CO5",{"$f":"IFERROR((IF(ISNUMBER(SEARCH(\"5\", D$19)),D$118,\"0\")),\"0\")","v":"0"},{"$f":"IFERROR((IF(ISNUMBER(SEARCH(\"5\", E$19)),E$118,\"0\")),\"0\")","v":"0"},{"$f":"IFERROR(SUM($D152:INDIRECT($I152)),\"0\")","v":0},null,null,"E152",{"$f":"COUNTIF($D$20:INDIRECT($L152),\"*2*\")","v":1},5,"E20"]
[null,null,"CO6",{"$f":"IFERROR((IF(ISNUMBER(SEARCH(\"6\", D$19)),D$118,\"0\")),\"0\")","v":"0"},{"$f":"IFERROR((IF(ISNUMBER(SEARCH(\"6\", E$19)),E$118,\"0\")),\"0\")","v":"0"},{"$f":"IFERROR(SUM($D153:INDIRECT($I153)),\"0\")","v":0},null,null,"E153",{"$f":"COUNTIF($D$20:INDIRECT($L153),\"*2*\")","v":1},5,"E20"]
[]
[null,null,"CO1",{"$f":"IFERROR((IF(ISNUMBER(SEARCH(\"1\", D$19)),D$119,\"0\")),\"0\")","v":89},{"$f":"IFERROR((IF(ISNUMBER(SEARCH(\"1\", E$19)),E$119,\"0\")),\"0\")","v":"0"},{"$f":"IFERROR(SUM($D155:INDIRECT($I155)),\"0\")","v":89},null,null,{"$f":"SUBSTITUTE(ADDRESS(1,K155,4),1,\"\")&ROW($I155)","v":"E155"},{"$f":"COUNTIF($D$20:INDIRECT($L155),\"*1*\")","v":1},{"$f":"COLUMN($F$19)-1","v":5},{"$f":"SUBSTITUTE(ADDRESS(1,K155,4),1,\"\")&ROW($I$19)+1","v":"E20"},"No of Studdents Attended"]
[null,null,"CO2",{"$f":"IFERROR((IF(ISNUMBER(SEARCH(\"2\", D$19)),D$119,\"0\")),\"0\")","v":"0"},{"$f":"IFERROR((IF(ISNUMBER(SEARCH(\"2\", E$19)),E$119,\"0\")),\"0\")","v":89},{"$f":"IFERROR(SUM($D156:INDIRECT($I156)),\"0\")","v":89},null,null,"E156",{"$f":"COUNTIF($D$20:INDIRECT($L156),\"*2*\")","v":1},{"$f":"COLUMN($F$19)-1","v":5},{"$f":"SUBSTITUTE(ADDRESS(1,K156,4),1,\"\")&ROW($I$19)+1","v":"E20"}]
[null,null,"CO3",{"$f":"IFERROR((IF(ISNUMBER(SEARCH(\"3\", D$19)),D$119,\"0\")),\"0\")","v":"0"},{"$f":"IFERROR((IF(ISNUMBER(SEARCH(\"3\", E$19)),E$119,\"0\")),\"0\")","v":"0"},{"$f":"IFERROR(SUM($D157:INDIRECT($I157)),\"0\")","v":0},null,null,"E157",{"$f":"COUNTIF($D$20:INDIRECT($L157),\"*2*\")","v":1},5,"E20"]
[null,null,"CO4",{"$f":"IFERROR((IF(ISNUMBER(SEARCH(\"4\", D$19)),D$119,\"0\")),\"0\")","v":"0"},{"$f":"IFERROR((IF(ISNUMBER(SEARCH(\"4\", E$19)),E$119,\"0\")),\"0\")","v":"0"},{"$f":"IFERROR(SUM($D158:INDIRECT($I158)),\"0\")","v":0},null,null,"E158",{"$f":"COUNTIF($D$20:INDIRECT($L158),\"*2*\")","v":1},5,"E20"]
[null,null,"CO5",{"$f":"IFERROR((IF(ISNUMBER(SEARCH(\"5\", D$19)),D$119,\"0\")),\"0\")","v":"0"},{"$f":"IFERROR((IF(ISNUMBER(SEARCH(\"5\", E$19)),E$119,\"0\")),\"0\")","v":"0"},{"$f":"IFERROR(SUM($D159:INDIRECT($I159)),\"0\")","v":0},null,null,"E159",{"$f":"COUNTIF($D$20:INDIRECT($L159),\"*2*\")","v":1},5,"E20"]
[null,null,"CO6",{"$f":"IFERROR((IF(ISNUMBER(SEARCH(\"6\", D$19)),D$119,\"0\")),\"0\")","v":"0"},{"$f":"IFERROR((IF(ISNUMBER(SEARCH(\"6\", E$19)),E$119,\"0\")),\"0\")","v":"0"},{"$f":"IFERROR(SUM($D160:INDIRECT($I160)),\"0\")","v":0},null,null,"E160",{"$f":"COUNTIF($D$20:INDIRECT($L160),\"*2*\")","v":1},5,"E20"]
[]
[null,null,"CO1",{"$f":"IFERROR((IF(ISNUMBER(SEARCH(\"1\", D$19)),D$120,\"0\")),\"0\")","v":3},{"$f":"IFERROR((IF(ISNUMBER(SEARCH(\"1\", E$19)),E$120,\"0\")),\"0\")","v":"0"},{"$f":"IFERROR(SUM($D162:INDIRECT($I162)),\"0\")","v":3},null,null,{"$f":"SUBSTITUTE(ADDRESS(1,K162,4),1,\"\")&ROW($I162)","v":"E162"},{"$f":"COUNTIF($D$20:INDIRECT($L162),\"*1*\")","v":1},{"$f":"COLUMN($F$19)-1","v":5},{"$f":"SUBSTITUTE(ADDRESS(1,K162,4),1,\"\")&ROW($I$19)+1","v":"E20"},"Difficulty Level"]
[null,null,"CO2",{"$f":"IFERROR((IF(ISNUMBER(SEARCH(\"2\", D$19)),D$120,\"0\")),\"0\")","v":"0"},{"$f":"IFERROR((IF(ISNUMBER(SEARCH(\"2\", E$19)),E$120,\"0\")),\"0\")","v":3},{"$f":"IFERROR(SUM($D163:INDIRECT($I163)),\"0\")","v":3},null,null,"E163",{"$f":"COUNTIF($D$20:INDIRECT($L163),\"*2*\")","v":1},{"$f":"COLUMN($F$19)-1","v":5},{"$f":"SUBSTITUTE(ADDRESS(1,K163,4),1,\"\")&ROW($I$19)+1","v":"E20"}]
[null,null,"CO3",{"$f":"IFERROR((IF(ISNUMBER(SEARCH(\"3\", D$19)),D$120,\"0\")),\"0\")","v":"0"},{"$f":"IFERROR((IF(ISNUMBER(SEARCH(\"3\", E$19)),E$120,\"0\")),\"0\")","v":"0"},{"$f":"IFERROR(SUM($D164:INDIRECT($I164)),\"0\")","v":0},null,null,"E164",{"$f":"COUNTIF($D$20:INDIRECT($L164),\"*2*\")","v":1},5,"E20"]
[null,null,"CO4",{"$f":"IFERROR((IF(ISNUMBER(SEARCH(\"4\", D$19)),D$120,\"0\")),\"0\")","v":"0"},{"$f":"IFERROR((IF(ISNUMBER(SEARCH(\"4\", E$19)),E$120,\"0\")),\"0\")","v":"0"},{"$f":"IFERROR(SUM($D165:INDIRECT($I165)),\"0\")","v":0},null,null,"E165",{"$f":"COUNTIF($D$20:INDIRECT($L165),\"*2*\")","v":1},5,"E20"]
[null,null,"CO5",{"$f":"IFERROR((IF(ISNUMBER(SEARCH(\"5\", D$19)),D$120,\"0\")),\"0\")","v":"0"},{"$f":"IFERROR((IF(ISNUMBER(SEARCH(\"5\", E$19)),E$120,\"0\")),\"0\")","v":"0"},{"$f":"IFERROR(SUM($D166:INDIRECT($I166)),\"0\")","v":0},null,null,"E166",{"$f":"COUNTIF($D$20:INDIRECT($L166),\"*2*\")","v":1},5,"E20"]
[null,null,"CO6",{"$f":"IFERROR((IF(ISNUMBER(SEARCH(\"6\", D$19)),D$120,\"0\")),\"0\")","v":"0"},{"$f":"IFERROR((IF(ISNUMBER(SEARCH(\"6\", E$19)),E$120,\"0\")),\"0\")","v":"0"},{"$f":"IFERROR(SUM($D167:INDIRECT($I167)),\"0\")","v":0},null,null,"E167",{"$f":"COUNTIF($D$20:INDIRECT($L167),\"*2*\")","v":1},5,"E20"]
[]
[null,null,"CO1",{"$f":"IFERROR((IF(ISNUMBER(SEARCH(\"1\", D$19)),D$121,\"0\")),\"0\")","v":83},{"$f":"IFERROR((IF(ISNUMBER(SEARCH(\"1\", E$19)),E$121,\"0\")),\"0\")","v":"0"},{"$f":"IFERROR(SUM($D169:INDIRECT($I169)),\"0\")","v":83},null,null,{"$f":"SUBSTITUTE(ADDRESS(1,K169,4),1,\"\")&ROW($I169)","v":"E169"},{"$f":"COUNTIF($D$20:INDIRECT($L169),\"*1*\")","v":1},{"$f":"COLUMN($F$19)-1","v":5},{"$f":"SUBSTITUTE(ADDRESS(1,K169,4),1,\"\")&ROW($I$19)+1","v":"E20"},"No of Studdents Above Difficulty Level"]
[null,null,"CO2",{"$f":"IFERROR((IF(ISNUMBER(SEARCH(\"2\", D$19)),D$121,\"0\")),\"0\")","v":"0"},{"$f":"IFERROR((IF(ISNUMBER(SEARCH(\"2\", E$19)),E$121,\"0\")),\"0\")","v":81},{"$f":"IFERROR(SUM($D170:INDIRECT($I170)),\"0\")","v":81},null,null,"E170",{"$f":"COUNTIF($D$20:INDIRECT($L170),\"*2*\")","v":1},{"$f":"COLUMN($F$19)-1","v":5},{"$f":"SUBSTITUTE(ADDRESS(1,K170,4),1,\"\")&ROW($I$19)+1","v":"E20"}]
[null,null,"CO3",{"$f":"IFERROR((IF(ISNUMBER(SEARCH(\"3\", D$19)),D$121,\"0\")),\"0\")","v":"0"},{"$f":"IFERROR((IF(ISNUMBER(SEARCH(\"3\", E$19)),E$121,\"0\")),\"0\")","v":"0"},{"$f":"IFERROR(SUM($D171:INDIRECT($I171)),\"0\")","v":0},null,null,"E171",{"$f":"COUNTIF($D$20:INDIRECT($L171),\"*2*\")","v":1},5,"E20"]
[null,null,"CO4",{"$f":"IFERROR((IF(ISNUMBER(SEARCH(\"4\", D$19)),D$121,\"0\")),\"0\")","v":"0"},{"$f":"IFERROR((IF(ISNUMBER(SEARCH(\"4\", E$19)),E$121,\"0\")),\"0\")","v":"0"},{"$f":"IFERROR(SUM($D172:INDIRECT($I172)),\"0\")","v":0},null,null,"E172",{"$f":"COUNTIF($D$20:INDIRECT($L172),\"*2*\")","v":1},5,"E20"]
[null,null,"CO5",{"$f":"IFERROR((IF(ISNUMBER(SEARCH(\"5\", D$19)),D$121,\"0\")),\"0\")","v":"0"},{"$f":"IFERROR((IF(ISNUMBER(SEARCH(\"5\", E$19)),E$121,\"0\")),\"0\")","v":"0"},{"$f":"IFERROR(SUM($D173:INDIRECT($I173)),\"0\")","v":0},null,null,"E173",{"$f":"COUNTIF($D$20:INDIRECT($L173),\"*2*\")","v":1},5,"E20"]
[null,null,"CO6",{"$f":"IFERROR((IF(ISNUMBER(SEARCH(\"6\", D$19)),D$121,\"0\")),\"0\")","v":"0"},{"$f":"IFERROR((IF(ISNUMBER(SEARCH(\"6\", E$19)),E$121,\"0\")),\"0\")","v":"0"},{"$f":"IFERROR(SUM($D174:INDIRECT($I174)),\"0\")","v":0},null,null,"E174",{"$f":"COUNTIF($D$20:INDIRECT($L174),\"*2*\")","v":1},5,"E20"]
[]
[null,null,1,{"$f":"IFERROR((IF(ISNUMBER(SEARCH(\"1\", D$20)),D$21/IF(LEN(D20)=16,6,IF(LEN(D20)=13,5,IF(LEN(D20)=10,4,IF(LEN(D20)=7,3,IF(LEN(D20)=4,2,1))))),\"0\")),\"0\")","v":0.83333333333333337},{"$f":"IFERROR((IF(ISNUMBER(SEARCH(\"1\", E$20)),E$21/IF(LEN(E20)=16,6,IF(LEN(E20)=13,5,IF(LEN(E20)=10,4,IF(LEN(E20)=7,3,IF(LEN(E20)=4,2,1))))),\"0\")),\"0\")","v":"0"},{"$f":"IFERROR(SUM($D176:INDIRECT($I176)),\"0\")","v":0.83333333333333337},null,null,{"$f":"SUBSTITUTE(ADDRESS(1,K176,4),1,\"\")&ROW($I176)","v":"E176"},{"$f":"COUNTIF($D$20:INDIRECT($L176),\"1\")","v":0},{"$f":"COLUMN($F$18)-1","v":5},{"$f":"SUBSTITUTE(ADDRESS(1,K176,4),1,\"\")&ROW($I$19)+1","v":"E20"}]
[null,null,2,{"$f":"IFERROR((IF(ISNUMBER(SEARCH(\"2\", D$20)),D$21/IF(LEN(D20)=16,6,IF(LEN(D20)=13,5,IF(LEN(D20)=10,4,IF(LEN(D20)=7,3,IF(LEN(D20)=4,2,1))))),\"0\")),\"0\")","v":0.83333333333333337},{"$f":"IFERROR((IF(ISNUMBER(SEARCH(\"2\", E$20)),E$21/IF(LEN(E20)=16,6,IF(LEN(E20)=13,5,IF(LEN(E20)=10,4,IF(LEN(E20)=7,3,IF(LEN(E20)=4,2,1))))),\"0\")),\"0\")","v":5},{"$f":"IFERROR(SUM($D177:INDIRECT($I177)),\"0\")","v":5.833333333333333},null,null,{"$f":"SUBSTITUTE(ADDRESS(1,K177,4),1,\"\")&ROW($I177)","v":"E177"},{"$f":"COUNTIF($D$20:INDIRECT($L177),\"2\")","v":1},{"$f":"COLUMN($F$18)-1","v":5},{"$f":"SUBSTITUTE(ADDRESS(1,K177,4),1,\"\")&ROW($I$19)+1","v":"E20"}]
[null,null,3,{"$f":"IFERROR((IF(ISNUMBER(SEARCH(\"3\", D$20)),D$21/IF(LEN(D20)=16,6,IF(LEN(D20)=13,5,IF(LEN(D20)=10,4,IF(LEN(D20)=7,3,IF(LEN(D20)=4,2,1))))),\"0\")),\"0\")","v":0.83333333333333337},{"$f":"IFERROR((IF(ISNUMBER(SEARCH(\"3\", E$20)),E$21/IF(LEN(E20)=16,6,IF(LEN(E20)=13,5,IF(LEN(E20)=10,4,IF(LEN(E20)=7,3,IF(LEN(E20)=4,2,1))))),\"0\")),\"0\")","v":"0"},{"$f":"IFERROR(SUM($D178:INDIRECT($I178)),\"0\")","v":0.83333333333333337},null,null,"E178",{"$f":"COUNTIF($D$20:INDIRECT($L178),\"3\")","v":0},5,"E20"]
[null,null,4,{"$f":"IFERROR((IF(ISNUMBER(SEARCH(\"4\", D$20)),D$21/IF(LEN(D20)=16,6,IF(LEN(D20)=13,5,IF(LEN(D20)=10,4,IF(LEN(D20)=7,3,IF(LEN(D20)=4,2,1))))),\"0\")),\"0\")","v":0.83333333333333337},{"$f":"IFERROR((IF(ISNUMBER(SEARCH(\"4\", E$20)),E$21/IF(LEN(E20)=16,6,IF(LEN(E20)=13,5,IF(LEN(E20)=10,4,IF(LEN(E20)=7,3,IF(LEN(E20)=4,2,1))))),\"0\")),\"0\")","v":"0"},{"$f":"IFERROR(SUM($D179:INDIRECT($I179)),\"0\")","v":0.83333333333333337},null,null,"E179",{"$f":"COUNTIF($D$20:INDIRECT($L179),\"4\")","v":0},5,"E20"]
[null,null,5,{"$f":"IFERROR((IF(ISNUMBER(SEARCH(\"5\", D$20)),D$21/IF(LEN(D20)=16,6,IF(LEN(D20)=13,5,IF(LEN(D20)=10,4,IF(LEN(D20)=7,3,IF(LEN(D20)=4,2,1))))),\"0\")),\"0\")","v":0.83333333333333337},{"$f":"IFERROR((IF(ISNUMBER(SEARCH(\"5\", E$20)),E$21/IF(LEN(E20)=16,6,IF(LEN(E20)=13,5,IF(LEN(E20)=10,4,IF(LEN(E20)=7,3,IF(LEN(E20)=4,2,1))))),\"0\")),\"0\")","v":"0"},{"$f":"IFERROR(SUM($D180:INDIRECT($I180)),\"0\")","v":0.83333333333333337},null,null,"E180",{"$f":"COUNTIF($D$20:INDIRECT($L180),\"5\")","v":0},5,"E20"]
[null,null,6,{"$f":"IFERROR((IF(ISNUMBER(SEARCH(\"6\", D$20)),D$21/IF(LEN(D20)=16,6,IF(LEN(D20)=13,5,IF(LEN(D20)=10,4,IF(LEN(D20)=7,3,IF(LEN(D20)=4,2,1))))),\"0\")),\"0\")","v":0.83333333333333337},{"$f":"IFERROR((IF(ISNUMBER(SEARCH(\"6\", E$20)),E$21/IF(LEN(E20)=16,6,IF(LEN(E20)=13,5,IF(LEN(E20)=10,4,IF(LEN(E20)=7,3,IF(LEN(E20)=4,2,1))))),\"0\")),\"0\")","v":"0"},{"$f":"IFERROR(SUM($D181:INDIRECT($I181)),\"0\")","v":0.83333333333333337},null,null,"E181",{"$f":"COUNTIF($D$20:INDIRECT($L181),\"6\")","v":0},5,"E20"]

{"sheet":"A1_Analysis","index":9,"n_rows":131,"n_cols":5,"rows_kept":131,"cut":false,"hidden":false,"merged":[[2,0,2,3],[4,0,4,3],[6,0,6,3],[8,0,8,3]]}
[]
[]
[{"$f":"Data_Sheet!A2","v":"Jyothi Engineering College, Cheruthuruthy"}]
[]
[{"$f":"Data_Sheet!A4","v":"Department of Computer Science Engineering"}]
[]
[{"$f":"'A1'!A11:F11","v":"CO Analysis - Internal Marks : Assignment - 1                       11-02-18"}]
[]
[{"$f":"Data_Sheet!A17","v":"S3 CS              CS203 Switching Theory and Logic Design               2019-20"}]
[]
[]
[]
[]
[]
[]
[]
[]
[]
[]
[]
[]
[{"$f":"'T1'!A18","v":"Register No."},{"$f":"'T1'!B18","v":"Name of Student"},{"$f":"'A1'!F18","v":"Total Marks (10)"},"Category"]
[]
["Column1","Column2","Column3","Column4"]
[{"$f":"Data_Sheet!A25","v":"JEC18CS001"},{"$f":"Data_Sheet!B25","v":"ABHISHEK KRISHNAN MENON E"},{"$f":"'A1'!F25","v":10},{"$f":"IF(C25=\"A\",\"ABSENT\",IF(C25>='A1'!$E$5*$E$124/100,\"EXCELLENT\",IF(C25>='A1'!$E$5*$E$123/100,\"GOOD\",IF(C25>='A1'!$E$5*$E$122/100,\"AVERAGE\",\"POOR\"))))","v":"EXCELLENT"}]
[{"$f":"Data_Sheet!A26","v":"JEC18CS002"},{"$f":"Data_Sheet!B26","v":"ABHISHEK SAJEEVAN"},{"$f":"'A1'!F26","v":5},{"$f":"IF(C26=\"A\",\"ABSENT\",IF(C26>='A1'!$E$5*$E$124/100,\"EXCELLENT\",IF(C26>='A1'!$E$5*$E$123/100,\"GOOD\",IF(C26>='A1'!$E$5*$E$122/100,\"AVERAGE\",\"POOR\"))))","v":"AVERAGE"}]
[{"$f":"Data_Sheet!A27","v":"JEC18CS003"},{"$f":"Data_Sheet!B27","v":"ABHITH SHAJI"},{"$f":"'A1'!F27","v":9},{"$f":"IF(C27=\"A\",\"ABSENT\",IF(C27>='A1'!$E$5*$E$124/100,\"EXCELLENT\",IF(C27>='A1'!$E$5*$E$123/100,\"GOOD\",IF(C27>='A1'!$E$5*$E$122/100,\"AVERAGE\",\"POOR\"))))","v":"EXCELLENT"}]
[{"$f":"Data_Sheet!A28","v":"JEC18CS004"},{"$f":"Data_Sheet!B28","v":"ABIN SANTHOSH ALAPATT"},{"$f":"'A1'!F28","v":10},{"$f":"IF(C28=\"A\",\"ABSENT\",IF(C28>='A1'!$E$5*$E$124/100,\"EXCELLENT\",IF(C28>='A1'!$E$5*$E$123/100,\"GOOD\",IF(C28>='A1'!$E$5*$E$122/100,\"AVERAGE\",\"POOR\"))))","v":"EXCELLENT"}]
[{"$f":"Data_Sheet!A29","v":"JEC18CS005"},{"$f":"Data_Sheet!B29","v":"ADARSH KUMAR M A"},{"$f":"'A1'!F29","v":10},{"$f":"IF(C29=\"A\",\"ABSENT\",IF(C29>='A1'!$E$5*$E$124/100,\"EXCELLENT\",IF(C29>='A1'!$E$5*$E$123/100,\"GOOD\",IF(C29>='A1'!$E$5*$E$122/100,\"AVERAGE\",\"POOR\"))))","v":"EXCELLENT"}]
[{"$f":"Data_Sheet!A30","v":"JEC18CS006"},{"$f":"Data_Sheet!B30","v":"ADHITHYA KRISHNA S"},{"$f":"'A1'!F30","v":9},{"$f":"IF(C30=\"A\",\"ABSENT\",IF(C30>='A1'!$E$5*$E$124/100,\"EXCELLENT\",IF(C30>='A1'!$E$5*$E$123/100,\"GOOD\",IF(C30>='A1'!$E$5*$E$122/100,\"AVERAGE\",\"POOR\"))))","v":"EXCELLENT"}]
[{"$f":"Data_Sheet!A31","v":"JEC18CS007"},{"$f":"Data_Sheet!B31","v":"ADITHYA HARIDAS"},{"$f":"'A1'!F31","v":10},{"$f":"IF(C31=\"A\",\"ABSENT\",IF(C31>='A1'!$E$5*$E$124/100,\"EXCELLENT\",IF(C31>='A1'!$E$5*$E$123/100,\"GOOD\",IF(C31>='A1'!$E$5*$E$122/100,\"AVERAGE\",\"POOR\"))))","v":"EXCELLENT"}]
[{"$f":"Data_Sheet!A32","v":"JEC18CS008"},{"$f":"Data_Sheet!B32","v":"AJMAL BASHEER"},{"$f":"'A1'!F32","v":5},{"$f":"IF(C32=\"A\",\"ABSENT\",IF(C32>='A1'!$E$5*$E$124/100,\"EXCELLENT\",IF(C32>='A1'!$E$5*$E$123/100,\"GOOD\",IF(C32>='A1'!$E$5*$E$122/100,\"AVERAGE\",\"POOR\"))))","v":"AVERAGE"}]
[{"$f":"Data_Sheet!A33","v":"JEC18CS009"},{"$f":"Data_Sheet!B33","v":"AKASH.V"},{"$f":"'A1'!F33","v":9},{"$f":"IF(C33=\"A\",\"ABSENT\",IF(C33>='A1'!$E$5*$E$124/100,\"EXCELLENT\",IF(C33>='A1'!$E$5*$E$123/100,\"GOOD\",IF(C33>='A1'!$E$5*$E$122/100,\"AVERAGE\",\"POOR\"))))","v":"EXCELLENT"}]
[{"$f":"Data_Sheet!A34","v":"JEC18CS010"},{"$f":"Data_Sheet!B34","v":"AKHIL AZEEZ UPPILAMKUNNATH"},{"$f":"'A1'!F34","v":10},{"$f":"IF(C34=\"A\",\"ABSENT\",IF(C34>='A1'!$E$5*$E$124/100,\"EXCELLENT\",IF(C34>='A1'!$E$5*$E$123/100,\"GOOD\",IF(C34>='A1'!$E$5*$E$122/100,\"AVERAGE\",\"POOR\"))))","v":"EXCELLENT"}]
[{"$f":"Data_Sheet!A35","v":"JEC18CS011"},{"$f":"Data_Sheet!B35","v":"AKHIL KRISHNA UK"},{"$f":"'A1'!F35","v":9},{"$f":"IF(C35=\"A\",\"ABSENT\",IF(C35>='A1'!$E$5*$E$124/100,\"EXCELLENT\",IF(C35>='A1'!$E$5*$E$123/100,\"GOOD\",IF(C35>='A1'!$E$5*$E$122/100,\"AVERAGE\",\"POOR\"))))","v":"EXCELLENT"}]
[{"$f":"Data_Sheet!A36","v":"JEC18CS012"},{"$f":"Data_Sheet!B36","v":"ALAN GEORGE"},{"$f":"'A1'!F36","v":10},{"$f":"IF(C36=\"A\",\"ABSENT\",IF(C36>='A1'!$E$5*$E$124/100,\"EXCELLENT\",IF(C36>='A1'!$E$5*$E$123/100,\"GOOD\",IF(C36>='A1'!$E$5*$E$122/100,\"AVERAGE\",\"POOR\"))))","v":"EXCELLENT"}]
[{"$f":"Data_Sheet!A37","v":"JEC18CS013"},{"$f":"Data_Sheet!B37","v":"ALEN VARGHESE"},{"$f":"'A1'!F37","v":10},{"$f":"IF(C37=\"A\",\"ABSENT\",IF(C37>='A1'!$E$5*$E$124/100,\"EXCELLENT\",IF(C37>='A1'!$E$5*$E$123/100,\"GOOD\",IF(C37>='A1'!$E$5*$E$122/100,\"AVERAGE\",\"POOR\"))))","v":"EXCELLENT"}]
[{"$f":"Data_Sheet!A38","v":"JEC18CS014"},{"$f":"Data_Sheet!B38","v":"AMAL SEBASTIAN"},{"$f":"'A1'!F38","v":10},{"$f":"IF(C38=\"A\",\"ABSENT\",IF(C38>='A1'!$E$5*$E$124/100,\"EXCELLENT\",IF(C38>='A1'!$E$5*$E$123/100,\"GOOD\",IF(C38>='A1'!$E$5*$E$122/100,\"AVERAGE\",\"POOR\"))))","v":"EXCELLENT"}]
[{"$f":"Data_Sheet!A39","v":"JEC18CS015"},{"$f":"Data_Sheet!B39","v":"AMAL SONY"},{"$f":"'A1'!F39","v":8},{"$f":"IF(C39=\"A\",\"ABSENT\",IF(C39>='A1'!$E$5*$E$124/100,\"EXCELLENT\",IF(C39>='A1'!$E$5*$E$123/100,\"GOOD\",IF(C39>='A1'!$E$5*$E$122/100,\"AVERAGE\",\"POOR\"))))","v":"EXCELLENT"}]
[{"$f":"Data_Sheet!A40","v":"JEC18CS016"},{"$f":"Data_Sheet!B40","v":"ANAGHA WILSON"},{"$f":"'A1'!F40","v":10},{"$f":"IF(C40=\"A\",\"ABSENT\",IF(C40>='A1'!$E$5*$E$124/100,\"EXCELLENT\",IF(C40>='A1'!$E$5*$E$123/100,\"GOOD\",IF(C40>='A1'!$E$5*$E$122/100,\"AVERAGE\",\"POOR\"))))","v":"EXCELLENT"}]
[{"$f":"Data_Sheet!A41","v":"JEC18CS017"},{"$f":"Data_Sheet!B41","v":"ANETTE ANTO"},{"$f":"'A1'!F41","v":10},{"$f":"IF(C41=\"A\",\"ABSENT\",IF(C41>='A1'!$E$5*$E$124/100,\"EXCELLENT\",IF(C41>='A1'!$E$5*$E$123/100,\"GOOD\",IF(C41>='A1'!$E$5*$E$122/100,\"AVERAGE\",\"POOR\"))))","v":"EXCELLENT"}]
[{"$f":"Data_Sheet!A42","v":"JEC18CS018"},{"$f":"Data_Sheet!B42","v":"ANIT MARY THOMAS"},{"$f":"'A1'!F42","v":10},{"$f":"IF(C42=\"A\",\"ABSENT\",IF(C42>='A1'!$E$5*$E$124/100,\"EXCELLENT\",IF(C42>='A1'!$E$5*$E$123/100,\"GOOD\",IF(C42>='A1'!$E$5*$E$122/100,\"AVERAGE\",\"POOR\"))))","v":"EXCELLENT"}]
[{"$f":"Data_Sheet!A43","v":"JEC18CS020"},{"$f":"Data_Sheet!B43","v":"ANN THERESA SHAJI"},{"$f":"'A1'!F43","v":10},{"$f":"IF(C43=\"A\",\"ABSENT\",IF(C43>='A1'!$E$5*$E$124/100,\"EXCELLENT\",IF(C43>='A1'!$E$5*$E$123/100,\"GOOD\",IF(C43>='A1'!$E$5*$E$122/100,\"AVERAGE\",\"POOR\"))))","v":"EXCELLENT"}]
[{"$f":"Data_Sheet!A44","v":"JEC18CS021"},{"$f":"Data_Sheet!B44","v":"ANTONY ROY"},{"$f":"'A1'!F44","v":9},{"$f":"IF(C44=\"A\",\"ABSENT\",IF(C44>='A1'!$E$5*$E$124/100,\"EXCELLENT\",IF(C44>='A1'!$E$5*$E$123/100,\"GOOD\",IF(C44>='A1'!$E$5*$E$122/100,\"AVERAGE\",\"POOR\"))))","v":"EXCELLENT"}]
[{"$f":"Data_Sheet!A45","v":"JEC18CS022"},{"$f":"Data_Sheet!B45","v":"ANUGRAHA C"},{"$f":"'A1'!F45","v":10},{"$f":"IF(C45=\"A\",\"ABSENT\",IF(C45>='A1'!$E$5*$E$124/100,\"EXCELLENT\",IF(C45>='A1'!$E$5*$E$123/100,\"GOOD\",IF(C45>='A1'!$E$5*$E$122/100,\"AVERAGE\",\"POOR\"))))","v":"EXCELLENT"}]
[{"$f":"Data_Sheet!A46","v":"JEC18CS023"},{"$f":"Data_Sheet!B46","v":"APARNA.V"},{"$f":"'A1'!F46","v":10},{"$f":"IF(C46=\"A\",\"ABSENT\",IF(C46>='A1'!$E$5*$E$124/100,\"EXCELLENT\",IF(C46>='A1'!$E$5*$E$123/100,\"GOOD\",IF(C46>='A1'!$E$5*$E$122/100,\"AVERAGE\",\"POOR\"))))","v":"EXCELLENT"}]
[{"$f":"Data_Sheet!A47","v":"JEC18CS024"},{"$f":"Data_Sheet!B47","v":"ARAVIND S KUMAR"},{"$f":"'A1'!F47","v":10},{"$f":"IF(C47=\"A\",\"ABSENT\",IF(C47>='A1'!$E$5*$E$124/100,\"EXCELLENT\",IF(C47>='A1'!$E$5*$E$123/100,\"GOOD\",IF(C47>='A1'!$E$5*$E$122/100,\"AVERAGE\",\"POOR\"))))","v":"EXCELLENT"}]
[{"$f":"Data_Sheet!A48","v":"JEC18CS025"},{"$f":"Data_Sheet!B48","v":"ARJUN VINOD"},{"$f":"'A1'!F48","v":5},{"$f":"IF(C48=\"A\",\"ABSENT\",IF(C48>='A1'!$E$5*$E$124/100,\"EXCELLENT\",IF(C48>='A1'!$E$5*$E$123/100,\"GOOD\",IF(C48>='A1'!$E$5*$E$122/100,\"AVERAGE\",\"POOR\"))))","v":"AVERAGE"}]
[{"$f":"Data_Sheet!A49","v":"JEC18CS026"},{"$f":"Data_Sheet!B49","v":"ARUN VG"},{"$f":"'A1'!F49","v":10},{"$f":"IF(C49=\"A\",\"ABSENT\",IF(C49>='A1'!$E$5*$E$124/100,\"EXCELLENT\",IF(C49>='A1'!$E$5*$E$123/100,\"GOOD\",IF(C49>='A1'!$E$5*$E$122/100,\"AVERAGE\",\"POOR\"))))","v":"EXCELLENT"}]
[{"$f":"Data_Sheet!A50","v":"JEC18CS027"},{"$f":"Data_Sheet!B50","v":"ASHRUL K"},{"$f":"'A1'!F50","v":10},{"$f":"IF(C50=\"A\",\"ABSENT\",IF(C50>='A1'!$E$5*$E$124/100,\"EXCELLENT\",IF(C50>='A1'!$E$5*$E$123/100,\"GOOD\",IF(C50>='A1'!$E$5*$E$122/100,\"AVERAGE\",\"POOR\"))))","v":"EXCELLENT"}]
[{"$f":"Data_Sheet!A51","v":"JEC18CS028"},{"$f":"Data_Sheet!B51","v":"ATHIL PAULY"},{"$f":"'A1'!F51","v":9},{"$f":"IF(C51=\"A\",\"ABSENT\",IF(C51>='A1'!$E$5*$E$124/100,\"EXCELLENT\",IF(C51>='A1'!$E$5*$E$123/100,\"GOOD\",IF(C51>='A1'!$E$5*$E$122/100,\"AVERAGE\",\"POOR\"))))","v":"EXCELLENT"}]
[{"$f":"Data_Sheet!A52","v":"JEC18CS029"},{"$f":"Data_Sheet!B52","v":"ATHIRA K P"},{"$f":"'A1'!F52","v":10},{"$f":"IF(C52=\"A\",\"ABSENT\",IF(C52>='A1'!$E$5*$E$124/100,\"EXCELLENT\",IF(C52>='A1'!$E$5*$E$123/100,\"GOOD\",IF(C52>='A1'!$E$5*$E$122/100,\"AVERAGE\",\"POOR\"))))","v":"EXCELLENT"}]
[{"$f":"Data_Sheet!A53","v":"JEC18CS030"},{"$f":"Data_Sheet!B53","v":"AWIN ANTO"},{"$f":"'A1'!F53","v":10},{"$f":"IF(C53=\"A\",\"ABSENT\",IF(C53>='A1'!$E$5*$E$124/100,\"EXCELLENT\",IF(C53>='A1'!$E$5*$E$123/100,\"GOOD\",IF(C53>='A1'!$E$5*$E$122/100,\"AVERAGE\",\"POOR\"))))","v":"EXCELLENT"}]
[{"$f":"Data_Sheet!A54","v":"JEC18CS031"},{"$f":"Data_Sheet!B54","v":"CHARLES JOHNSON"},{"$f":"'A1'!F54","v":9},{"$f":"IF(C54=\"A\",\"ABSENT\",IF(C54>='A1'!$E$5*$E$124/100,\"EXCELLENT\",IF(C54>='A1'!$E$5*$E$123/100,\"GOOD\",IF(C54>='A1'!$E$5*$E$122/100,\"AVERAGE\",\"POOR\"))))","v":"EXCELLENT"}]
[{"$f":"Data_Sheet!A55","v":"JEC18CS032"},{"$f":"Data_Sheet!B55","v":"CHITTILAPPILLY JOVIA JOHNSON"},{"$f":"'A1'!F55","v":10},{"$f":"IF(C55=\"A\",\"ABSENT\",IF(C55>='A1'!$E$5*$E$124/100,\"EXCELLENT\",IF(C55>='A1'!$E$5*$E$123/100,\"GOOD\",IF(C55>='A1'!$E$5*$E$122/100,\"AVERAGE\",\"POOR\"))))","v":"EXCELLENT"}]
[{"$f":"Data_Sheet!A56","v":"JEC18CS033"},{"$f":"Data_Sheet!B56","v":"CIYA BABU"},{"$f":"'A1'!F56","v":10},{"$f":"IF(C56=\"A\",\"ABSENT\",IF(C56>='A1'!$E$5*$E$124/100,\"EXCELLENT\",IF(C56>='A1'!$E$5*$E$123/100,\"GOOD\",IF(C56>='A1'!$E$5*$E$122/100,\"AVERAGE\",\"POOR\"))))","v":"EXCELLENT"}]
[{"$f":"Data_Sheet!A57","v":"JEC18CS034"},{"$f":"Data_Sheet!B57","v":"DAVID SALUS"},{"$f":"'A1'!F57","v":10},{"$f":"IF(C57=\"A\",\"ABSENT\",IF(C57>='A1'!$E$5*$E$124/100,\"EXCELLENT\",IF(C57>='A1'!$E$5*$E$123/100,\"GOOD\",IF(C57>='A1'!$E$5*$E$122/100,\"AVERAGE\",\"POOR\"))))","v":"EXCELLENT"}]
[{"$f":"Data_Sheet!A58","v":"JEC18CS035"},{"$f":"Data_Sheet!B58","v":"DELICIA REJI"},{"$f":"'A1'!F58","v":10},{"$f":"IF(C58=\"A\",\"ABSENT\",IF(C58>='A1'!$E$5*$E$124/100,\"EXCELLENT\",IF(C58>='A1'!$E$5*$E$123/100,\"GOOD\",IF(C58>='A1'!$E$5*$E$122/100,\"AVERAGE\",\"POOR\"))))","v":"EXCELLENT"}]
[{"$f":"Data_Sheet!A59","v":"JEC18CS036"},{"$f":"Data_Sheet!B59","v":"DELMA SHAJAN"},{"$f":"'A1'!F59","v":10},{"$f":"IF(C59=\"A\",\"ABSENT\",IF(C59>='A1'!$E$5*$E$124/100,\"EXCELLENT\",IF(C59>='A1'!$E$5*$E$123/100,\"GOOD\",IF(C59>='A1'!$E$5*$E$122/100,\"AVERAGE\",\"POOR\"))))","v":"EXCELLENT"}]
[{"$f":"Data_Sheet!A60","v":"JEC18CS037"},{"$f":"Data_Sheet!B60","v":"DILBER SHA AP"},{"$f":"'A1'!F60","v":9},{"$f":"IF(C60=\"A\",\"ABSENT\",IF(C60>='A1'!$E$5*$E$124/100,\"EXCELLENT\",IF(C60>='A1'!$E$5*$E$123/100,\"GOOD\",IF(C60>='A1'!$E$5*$E$122/100,\"AVERAGE\",\"POOR\"))))","v":"EXCELLENT"}]
[{"$f":"Data_Sheet!A61","v":"JEC18CS038"},{"$f":"Data_Sheet!B61","v":"EDWIN T JOY"},{"$f":"'A1'!F61","v":9},{"$f":"IF(C61=\"A\",\"ABSENT\",IF(C61>='A1'!$E$5*$E$124/100,\"EXCELLENT\",IF(C61>='A1'!$E$5*$E$123/100,\"GOOD\",IF(C61>='A1'!$E$5*$E$122/100,\"AVERAGE\",\"POOR\"))))","v":"EXCELLENT"}]
[{"$f":"Data_Sheet!A62","v":"JEC18CS039"},{"$f":"Data_Sheet!B62","v":"EDWIN WILSON"},{"$f":"'A1'!F62","v":9},{"$f":"IF(C62=\"A\",\"ABSENT\",IF(C62>='A1'!$E$5*$E$124/100,\"EXCELLENT\",IF(C62>='A1'!$E$5*$E$123/100,\"GOOD\",IF(C62>='A1'!$E$5*$E$122/100,\"AVERAGE\",\"POOR\"))))","v":"EXCELLENT"}]
[{"$f":"Data_Sheet!A63","v":"JEC18CS040"},{"$f":"Data_Sheet!B63","v":"EMMANUEL SHIBU"},{"$f":"'A1'!F63","v":10},{"$f":"IF(C63=\"A\",\"ABSENT\",IF(C63>='A1'!$E$5*$E$124/100,\"EXCELLENT\",IF(C63>='A1'!$E$5*$E$123/100,\"GOOD\",IF(C63>='A1'!$E$5*$E$122/100,\"AVERAGE\",\"POOR\"))))","v":"EXCELLENT"}]
[{"$f":"Data_Sheet!A64","v":"JEC18CS041"},{"$f":"Data_Sheet!B64","v":"GAYATHRI DINESH"},{"$f":"'A1'!F64","v":10},{"$f":"IF(C64=\"A\",\"ABSENT\",IF(C64>='A1'!$E$5*$E$124/100,\"EXCELLENT\",IF(C64>='A1'!$E$5*$E$123/100,\"GOOD\",IF(C64>='A1'!$E$5*$E$122/100,\"AVERAGE\",\"POOR\"))))","v":"EXCELLENT"}]
[{"$f":"Data_Sheet!A65","v":"JEC18CS042"},{"$f":"Data_Sheet!B65","v":"GOKUL DAS M"},{"$f":"'A1'!F65","v":10},{"$f":"IF(C65=\"A\",\"ABSENT\",IF(C65>='A1'!$E$5*$E$124/100,\"EXCELLENT\",IF(C65>='A1'!$E$5*$E$123/100,\"GOOD\",IF(C65>='A1'!$E$5*$E$122/100,\"AVERAGE\",\"POOR\"))))","v":"EXCELLENT"}]
[{"$f":"Data_Sheet!A66","v":"JEC18CS043"},{"$f":"Data_Sheet!B66","v":"G RAMGOPAL"},{"$f":"'A1'!F66","v":10},{"$f":"IF(C66=\"A\",\"ABSENT\",IF(C66>='A1'!$E$5*$E$124/100,\"EXCELLENT\",IF(C66>='A1'!$E$5*$E$123/100,\"GOOD\",IF(C66>='A1'!$E$5*$E$122/100,\"AVERAGE\",\"POOR\"))))","v":"EXCELLENT"}]
[{"$f":"Data_Sheet!A67","v":"JEC18CS044"},{"$f":"Data_Sheet!B67","v":"HARIES DAVIS"},{"$f":"'A1'!F67","v":10},{"$f":"IF(C67=\"A\",\"ABSENT\",IF(C67>='A1'!$E$5*$E$124/100,\"EXCELLENT\",IF(C67>='A1'!$E$5*$E$123/100,\"GOOD\",IF(C67>='A1'!$E$5*$E$122/100,\"AVERAGE\",\"POOR\"))))","v":"EXCELLENT"}]
[{"$f":"Data_Sheet!A68","v":"JEC18CS045"},{"$f":"Data_Sheet!B68","v":"HARISANKER P"},{"$f":"'A1'!F68","v":10},{"$f":"IF(C68=\"A\",\"ABSENT\",IF(C68>='A1'!$E$5*$E$124/100,\"EXCELLENT\",IF(C68>='A1'!$E$5*$E$123/100,\"GOOD\",IF(C68>='A1'!$E$5*$E$122/100,\"AVERAGE\",\"POOR\"))))","v":"EXCELLENT"}]
[{"$f":"Data_Sheet!A69","v":"JEC18CS046"},{"$f":"Data_Sheet!B69","v":"HARSHA.K.S."},{"$f":"'A1'!F69","v":10},{"$f":"IF(C69=\"A\",\"ABSENT\",IF(C69>='A1'!$E$5*$E$124/100,\"EXCELLENT\",IF(C69>='A1'!$E$5*$E$123/100,\"GOOD\",IF(C69>='A1'!$E$5*$E$122/100,\"AVERAGE\",\"POOR\"))))","v":"EXCELLENT"}]
[{"$f":"Data_Sheet!A70","v":"JEC18CS047"},{"$f":"Data_Sheet!B70","v":"HELNA THOMAS"},{"$f":"'A1'!F70","v":10},{"$f":"IF(C70=\"A\",\"ABSENT\",IF(C70>='A1'!$E$5*$E$124/100,\"EXCELLENT\",IF(C70>='A1'!$E$5*$E$123/100,\"GOOD\",IF(C70>='A1'!$E$5*$E$122/100,\"AVERAGE\",\"POOR\"))))","v":"EXCELLENT"}]
[{"$f":"Data_Sheet!A71","v":"JEC18CS048"},{"$f":"Data_Sheet!B71","v":"HRIDI KRISHNA.H"},{"$f":"'A1'!F71","v":10},{"$f":"IF(C71=\"A\",\"ABSENT\",IF(C71>='A1'!$E$5*$E$124/100,\"EXCELLENT\",IF(C71>='A1'!$E$5*$E$123/100,\"GOOD\",IF(C71>='A1'!$E$5*$E$122/100,\"AVERAGE\",\"POOR\"))))","v":"EXCELLENT"}]
[{"$f":"Data_Sheet!A72","v":"JEC18CS049"},{"$f":"Data_Sheet!B72","v":"INDRAJIT R"},{"$f":"'A1'!F72","v":8},{"$f":"IF(C72=\"A\",\"ABSENT\",IF(C72>='A1'!$E$5*$E$124/100,\"EXCELLENT\",IF(C72>='A1'!$E$5*$E$123/100,\"GOOD\",IF(C72>='A1'!$E$5*$E$122/100,\"AVERAGE\",\"POOR\"))))","v":"EXCELLENT"}]
[{"$f":"Data_Sheet!A73","v":"JEC18CS050"},{"$f":"Data_Sheet!B73","v":"JESWIN JOJY"},{"$f":"'A1'!F73","v":8},{"$f":"IF(C73=\"A\",\"ABSENT\",IF(C73>='A1'!$E$5*$E$124/100,\"EXCELLENT\",IF(C73>='A1'!$E$5*$E$123/100,\"GOOD\",IF(C73>='A1'!$E$5*$E$122/100,\"AVERAGE\",\"POOR\"))))","v":"EXCELLENT"}]
[{"$f":"Data_Sheet!A74","v":"JEC18CS051"},{"$f":"Data_Sheet!B74","v":"JIBIN A BABU"},{"$f":"'A1'!F74","v":10},{"$f":"IF(C74=\"A\",\"ABSENT\",IF(C74>='A1'!$E$5*$E$124/100,\"EXCELLENT\",IF(C74>='A1'!$E$5*$E$123/100,\"GOOD\",IF(C74>='A1'!$E$5*$E$122/100,\"AVERAGE\",\"POOR\"))))","v":"EXCELLENT"}]
[{"$f":"Data_Sheet!A75","v":"JEC18CS052"},{"$f":"Data_Sheet!B75","v":"JISSY JOY"},{"$f":"'A1'!F75","v":10},{"$f":"IF(C75=\"A\",\"ABSENT\",IF(C75>='A1'!$E$5*$E$124/100,\"EXCELLENT\",IF(C75>='A1'!$E$5*$E$123/100,\"GOOD\",IF(C75>='A1'!$E$5*$E$122/100,\"AVERAGE\",\"POOR\"))))","v":"EXCELLENT"}]
[{"$f":"Data_Sheet!A76","v":"JEC18CS053"},{"$f":"Data_Sheet!B76","v":"JOEL JAMES KARIKKANDATHIL"},{"$f":"'A1'!F76","v":10},{"$f":"IF(C76=\"A\",\"ABSENT\",IF(C76>='A1'!$E$5*$E$124/100,\"EXCELLENT\",IF(C76>='A1'!$E$5*$E$123/100,\"GOOD\",IF(C76>='A1'!$E$5*$E$122/100,\"AVERAGE\",\"POOR\"))))","v":"EXCELLENT"}]
[{"$f":"Data_Sheet!A77","v":"JEC18CS054"},{"$f":"Data_Sheet!B77","v":"JOSE REJI KARIMADATHI"},{"$f":"'A1'!F77","v":8},{"$f":"IF(C77=\"A\",\"ABSENT\",IF(C77>='A1'!$E$5*$E$124/100,\"EXCELLENT\",IF(C77>='A1'!$E$5*$E$123/100,\"GOOD\",IF(C77>='A1'!$E$5*$E$122/100,\"AVERAGE\",\"POOR\"))))","v":"EXCELLENT"}]
[{"$f":"Data_Sheet!A78","v":"JEC18CS055"},{"$f":"Data_Sheet!B78","v":"JUMANA HASIN"},{"$f":"'A1'!F78","v":10},{"$f":"IF(C78=\"A\",\"ABSENT\",IF(C78>='A1'!$E$5*$E$124/100,\"EXCELLENT\",IF(C78>='A1'!$E$5*$E$123/100,\"GOOD\",IF(C78>='A1'!$E$5*$E$122/100,\"AVERAGE\",\"POOR\"))))","v":"EXCELLENT"}]
[{"$f":"Data_Sheet!A79","v":"JEC18CS056"},{"$f":"Data_Sheet!B79","v":"KAILASHNATH"},{"$f":"'A1'!F79","v":9},{"$f":"IF(C79=\"A\",\"ABSENT\",IF(C79>='A1'!$E$5*$E$124/100,\"EXCELLENT\",IF(C79>='A1'!$E$5*$E$123/100,\"GOOD\",IF(C79>='A1'!$E$5*$E$122/100,\"AVERAGE\",\"POOR\"))))","v":"EXCELLENT"}]
[{"$f":"Data_Sheet!A80","v":"JEC18CS057"},{"$f":"Data_Sheet!B80","v":"K AJISHKUMAR"},{"$f":"'A1'!F80","v":9},{"$f":"IF(C80=\"A\",\"ABSENT\",IF(C80>='A1'!$E$5*$E$124/100,\"EXCELLENT\",IF(C80>='A1'!$E$5*$E$123/100,\"GOOD\",IF(C80>='A1'!$E$5*$E$122/100,\"AVERAGE\",\"POOR\"))))","v":"EXCELLENT"}]
[{"$f":"Data_Sheet!A81","v":"JEC18CS058"},{"$f":"Data_Sheet!B81","v":"KEERTHANA K S"},{"$f":"'A1'!F81","v":9},{"$f":"IF(C81=\"A\",\"ABSENT\",IF(C81>='A1'!$E$5*$E$124/100,\"EXCELLENT\",IF(C81>='A1'!$E$5*$E$123/100,\"GOOD\",IF(C81>='A1'!$E$5*$E$122/100,\"AVERAGE\",\"POOR\"))))","v":"EXCELLENT"}]
[{"$f":"Data_Sheet!A82","v":"JEC18CS059"},{"$f":"Data_Sheet!B82","v":"KEVIN VARGHESE"},{"$f":"'A1'!F82","v":10},{"$f":"IF(C82=\"A\",\"ABSENT\",IF(C82>='A1'!$E$5*$E$124/100,\"EXCELLENT\",IF(C82>='A1'!$E$5*$E$123/100,\"GOOD\",IF(C82>='A1'!$E$5*$E$122/100,\"AVERAGE\",\"POOR\"))))","v":"EXCELLENT"}]
[{"$f":"Data_Sheet!A83","v":"JEC18CS060"},{"$f":"Data_Sheet!B83","v":"LAKSHMI SADANANDAN"},{"$f":"'A1'!F83","v":10},{"$f":"IF(C83=\"A\",\"ABSENT\",IF(C83>='A1'!$E$5*$E$124/100,\"EXCELLENT\",IF(C83>='A1'!$E$5*$E$123/100,\"GOOD\",IF(C83>='A1'!$E$5*$E$122/100,\"AVERAGE\",\"POOR\"))))","v":"EXCELLENT"}]
[{"$f":"Data_Sheet!A84","v":"JEC18CS061"},{"$f":"Data_Sheet!B84","v":"LEYA PALLAN"},{"$f":"'A1'!F84","v":10},{"$f":"IF(C84=\"A\",\"ABSENT\",IF(C84>='A1'!$E$5*$E$124/100,\"EXCELLENT\",IF(C84>='A1'!$E$5*$E$123/100,\"GOOD\",IF(C84>='A1'!$E$5*$E$122/100,\"AVERAGE\",\"POOR\"))))","v":"EXCELLENT"}]
[{"$f":"Data_Sheet!A85","v":"JEC18CS062"},{"$f":"Data_Sheet!B85","v":"MARVEL BABU"},{"$f":"'A1'!F85","v":9},{"$f":"IF(C85=\"A\",\"ABSENT\",IF(C85>='A1'!$E$5*$E$124/100,\"EXCELLENT\",IF(C85>='A1'!$E$5*$E$123/100,\"GOOD\",IF(C85>='A1'!$E$5*$E$122/100,\"AVERAGE\",\"POOR\"))))","v":"EXCELLENT"}]
[{"$f":"Data_Sheet!A86","v":"JEC18CS063"},{"$f":"Data_Sheet!B86","v":"MEDWIN PAUL"},{"$f":"'A1'!F86","v":5},{"$f":"IF(C86=\"A\",\"ABSENT\",IF(C86>='A1'!$E$5*$E$124/100,\"EXCELLENT\",IF(C86>='A1'!$E$5*$E$123/100,\"GOOD\",IF(C86>='A1'!$E$5*$E$122/100,\"AVERAGE\",\"POOR\"))))","v":"AVERAGE"}]
[{"$f":"Data_Sheet!A87","v":0},{"$f":"Data_Sheet!B87","v":0},{"$f":"'A1'!F87","v":0},{"$f":"IF(C87=\"A\",\"ABSENT\",IF(C87>='A1'!$E$5*$E$124/100,\"EXCELLENT\",IF(C87>='A1'!$E$5*$E$123/100,\"GOOD\",IF(C87>='A1'!$E$5*$E$122/100,\"AVERAGE\",\"POOR\"))))","v":"POOR"}]
[{"$f":"Data_Sheet!A88","v":0},{"$f":"Data_Sheet!B88","v":0},{"$f":"'A1'!F88","v":0},{"$f":"IF(C88=\"A\",\"ABSENT\",IF(C88>='A1'!$E$5*$E$124/100,\"EXCELLENT\",IF(C88>='A1'!$E$5*$E$123/100,\"GOOD\",IF(C88>='A1'!$E$5*$E$122/100,\"AVERAGE\",\"POOR\"))))","v":"POOR"}]
[{"$f":"Data_Sheet!A89","v":"JEC18CS066"},{"$f":"Data_Sheet!B89","v":"MUHAMMED INSHADH"},{"$f":"'A1'!F89","v":9},{"$f":"IF(C89=\"A\",\"ABSENT\",IF(C89>='A1'!$E$5*$E$124/100,\"EXCELLENT\",IF(C89>='A1'!$E$5*$E$123/100,\"GOOD\",IF(C89>='A1'!$E$5*$E$122/100,\"AVERAGE\",\"POOR\"))))","v":"EXCELLENT"}]
[{"$f":"Data_Sheet!A90","v":"JEC18CS067"},{"$f":"Data_Sheet!B90","v":"NAIR MIDHUN RAMACHANDRAN"},{"$f":"'A1'!F90","v":8},{"$f":"IF(C90=\"A\",\"ABSENT\",IF(C90>='A1'!$E$5*$E$124/100,\"EXCELLENT\",IF(C90>='A1'!$E$5*$E$123/100,\"GOOD\",IF(C90>='A1'!$E$5*$E$122/100,\"AVERAGE\",\"POOR\"))))","v":"EXCELLENT"}]
[{"$f":"Data_Sheet!A91","v":"JEC18CS068"},{"$f":"Data_Sheet!B91","v":"NAVEENA ANTONY"},{"$f":"'A1'!F91","v":10},{"$f":"IF(C91=\"A\",\"ABSENT\",IF(C91>='A1'!$E$5*$E$124/100,\"EXCELLENT\",IF(C91>='A1'!$E$5*$E$123/100,\"GOOD\",IF(C91>='A1'!$E$5*$E$122/100,\"AVERAGE\",\"POOR\"))))","v":"EXCELLENT"}]
[{"$f":"Data_Sheet!A92","v":"JEC18CS069"},{"$f":"Data_Sheet!B92","v":"NITIN MADHU"},{"$f":"'A1'!F92","v":8},{"$f":"IF(C92=\"A\",\"ABSENT\",IF(C92>='A1'!$E$5*$E$124/100,\"EXCELLENT\",IF(C92>='A1'!$E$5*$E$123/100,\"GOOD\",IF(C92>='A1'!$E$5*$E$122/100,\"AVERAGE\",\"POOR\"))))","v":"EXCELLENT"}]
[{"$f":"Data_Sheet!A93","v":"JEC18CS070"},{"$f":"Data_Sheet!B93","v":"PRATHIUSH ARUN"},{"$f":"'A1'!F93","v":10},{"$f":"IF(C93=\"A\",\"ABSENT\",IF(C93>='A1'!$E$5*$E$124/100,\"EXCELLENT\",IF(C93>='A1'!$E$5*$E$123/100,\"GOOD\",IF(C93>='A1'!$E$5*$E$122/100,\"AVERAGE\",\"POOR\"))))","v":"EXCELLENT"}]
[{"$f":"Data_Sheet!A94","v":"JEC18CS071"},{"$f":"Data_Sheet!B94","v":"RACHEL CECER"},{"$f":"'A1'!F94","v":10},{"$f":"IF(C94=\"A\",\"ABSENT\",IF(C94>='A1'!$E$5*$E$124/100,\"EXCELLENT\",IF(C94>='A1'!$E$5*$E$123/100,\"GOOD\",IF(C94>='A1'!$E$5*$E$122/100,\"AVERAGE\",\"POOR\"))))","v":"EXCELLENT"}]
[{"$f":"Data_Sheet!A95","v":"JEC18CS072"},{"$f":"Data_Sheet!B95","v":"RAHUL RAJU"},{"$f":"'A1'!F95","v":10},{"$f":"IF(C95=\"A\",\"ABSENT\",IF(C95>='A1'!$E$5*$E$124/100,\"EXCELLENT\",IF(C95>='A1'!$E$5*$E$123/100,\"GOOD\",IF(C95>='A1'!$E$5*$E$122/100,\"AVERAGE\",\"POOR\"))))","v":"EXCELLENT"}]
[{"$f":"Data_Sheet!A96","v":"JEC18CS073"},{"$f":"Data_Sheet!B96","v":"RAHUL T RAVI"},{"$f":"'A1'!F96","v":10},{"$f":"IF(C96=\"A\",\"ABSENT\",IF(C96>='A1'!$E$5*$E$124/100,\"EXCELLENT\",IF(C96>='A1'!$E$5*$E$123/100,\"GOOD\",IF(C96>='A1'!$E$5*$E$122/100,\"AVERAGE\",\"POOR\"))))","v":"EXCELLENT"}]
[{"$f":"Data_Sheet!A97","v":"JEC18CS074"},{"$f":"Data_Sheet!B97","v":"RAPHEAL K MOYALAN"},{"$f":"'A1'!F97","v":7},{"$f":"IF(C97=\"A\",\"ABSENT\",IF(C97>='A1'!$E$5*$E$124/100,\"EXCELLENT\",IF(C97>='A1'!$E$5*$E$123/100,\"GOOD\",IF(C97>='A1'!$E$5*$E$122/100,\"AVERAGE\",\"POOR\"))))","v":"GOOD"}]
[{"$f":"Data_Sheet!A98","v":"JEC18CS075"},{"$f":"Data_Sheet!B98","v":"RISHIKESH. V"},{"$f":"'A1'!F98","v":9},{"$f":"IF(C98=\"A\",\"ABSENT\",IF(C98>='A1'!$E$5*$E$124/100,\"EXCELLENT\",IF(C98>='A1'!$E$5*$E$123/100,\"GOOD\",IF(C98>='A1'!$E$5*$E$122/100,\"AVERAGE\",\"POOR\"))))","v":"EXCELLENT"}]
[{"$f":"Data_Sheet!A99","v":"JEC18CS076"},{"$f":"Data_Sheet!B99","v":"ROCKSON T. AUGUSTINE"},{"$f":"'A1'!F99","v":8},{"$f":"IF(C99=\"A\",\"ABSENT\",IF(C99>='A1'!$E$5*$E$124/100,\"EXCELLENT\",IF(C99>='A1'!$E$5*$E$123/100,\"GOOD\",IF(C99>='A1'!$E$5*$E$122/100,\"AVERAGE\",\"POOR\"))))","v":"EXCELLENT"}]
[{"$f":"Data_Sheet!A100","v":"JEC18CS077"},{"$f":"Data_Sheet!B100","v":"SARATH C P"},{"$f":"'A1'!F100","v":10},{"$f":"IF(C100=\"A\",\"ABSENT\",IF(C100>='A1'!$E$5*$E$124/100,\"EXCELLENT\",IF(C100>='A1'!$E$5*$E$123/100,\"GOOD\",IF(C100>='A1'!$E$5*$E$122/100,\"AVERAGE\",\"POOR\"))))","v":"EXCELLENT"}]
[{"$f":"Data_Sheet!A101","v":"JEC18CS078"},{"$f":"Data_Sheet!B101","v":"SARATH SASI"},{"$f":"'A1'!F101","v":8},{"$f":"IF(C101=\"A\",\"ABSENT\",IF(C101>='A1'!$E$5*$E$124/100,\"EXCELLENT\",IF(C101>='A1'!$E$5*$E$123/100,\"GOOD\",IF(C101>='A1'!$E$5*$E$122/100,\"AVERAGE\",\"POOR\"))))","v":"EXCELLENT"}]
[{"$f":"Data_Sheet!A102","v":"JEC18CS079"},{"$f":"Data_Sheet!B102","v":"SHAFNA"},{"$f":"'A1'!F102","v":10},{"$f":"IF(C102=\"A\",\"ABSENT\",IF(C102>='A1'!$E$5*$E$124/100,\"EXCELLENT\",IF(C102>='A1'!$E$5*$E$123/100,\"GOOD\",IF(C102>='A1'!$E$5*$E$122/100,\"AVERAGE\",\"POOR\"))))","v":"EXCELLENT"}]
[{"$f":"Data_Sheet!A103","v":"JEC18CS080"},{"$f":"Data_Sheet!B103","v":"SHELMY SHABU"},{"$f":"'A1'!F103","v":10},{"$f":"IF(C103=\"A\",\"ABSENT\",IF(C103>='A1'!$E$5*$E$124/100,\"EXCELLENT\",IF(C103>='A1'!$E$5*$E$123/100,\"GOOD\",IF(C103>='A1'!$E$5*$E$122/100,\"AVERAGE\",\"POOR\"))))","v":"EXCELLENT"}]
[{"$f":"Data_Sheet!A104","v":"JEC18CS081"},{"$f":"Data_Sheet!B104","v":"SHIZA SHIHAB PUVAMPARAMBIL"},{"$f":"'A1'!F104","v":10},{"$f":"IF(C104=\"A\",\"ABSENT\",IF(C104>='A1'!$E$5*$E$124/100,\"EXCELLENT\",IF(C104>='A1'!$E$5*$E$123/100,\"GOOD\",IF(C104>='A1'!$E$5*$E$122/100,\"AVERAGE\",\"POOR\"))))","v":"EXCELLENT"}]
[{"$f":"Data_Sheet!A105","v":"JEC18CS082"},{"$f":"Data_Sheet!B105","v":"SIJO GEORGE"},{"$f":"'A1'!F105","v":8},{"$f":"IF(C105=\"A\",\"ABSENT\",IF(C105>='A1'!$E$5*$E$124/100,\"EXCELLENT\",IF(C105>='A1'!$E$5*$E$123/100,\"GOOD\",IF(C105>='A1'!$E$5*$E$122/100,\"AVERAGE\",\"POOR\"))))","v":"EXCELLENT"}]
[{"$f":"Data_Sheet!A106","v":"JEC18CS083"},{"$f":"Data_Sheet!B106","v":"SOURAV K"},{"$f":"'A1'!F106","v":8},{"$f":"IF(C106=\"A\",\"ABSENT\",IF(C106>='A1'!$E$5*$E$124/100,\"EXCELLENT\",IF(C106>='A1'!$E$5*$E$123/100,\"GOOD\",IF(C106>='A1'!$E$5*$E$122/100,\"AVERAGE\",\"POOR\"))))","v":"EXCELLENT"}]
[{"$f":"Data_Sheet!A107","v":0},{"$f":"Data_Sheet!B107","v":0},{"$f":"'A1'!F107","v":0},{"$f":"IF(C107=\"A\",\"ABSENT\",IF(C107>='A1'!$E$5*$E$124/100,\"EXCELLENT\",IF(C107>='A1'!$E$5*$E$123/100,\"GOOD\",IF(C107>='A1'!$E$5*$E$122/100,\"AVERAGE\",\"POOR\"))))","v":"POOR"}]
[{"$f":"Data_Sheet!A108","v":"JEC18CS085"},{"$f":"Data_Sheet!B108","v":"SREEHARI"},{"$f":"'A1'!F108","v":7},{"$f":"IF(C108=\"A\",\"ABSENT\",IF(C108>='A1'!$E$5*$E$124/100,\"EXCELLENT\",IF(C108>='A1'!$E$5*$E$123/100,\"GOOD\",IF(C108>='A1'!$E$5*$E$122/100,\"AVERAGE\",\"POOR\"))))","v":"GOOD"}]
[{"$f":"Data_Sheet!A109","v":"JEC18CS086"},{"$f":"Data_Sheet!B109","v":"SREEKANTH P"},{"$f":"'A1'!F109","v":7},{"$f":"IF(C109=\"A\",\"ABSENT\",IF(C109>='A1'!$E$5*$E$124/100,\"EXCELLENT\",IF(C109>='A1'!$E$5*$E$123/100,\"GOOD\",IF(C109>='A1'!$E$5*$E$122/100,\"AVERAGE\",\"POOR\"))))","v":"GOOD"}]
[{"$f":"Data_Sheet!A110","v":"JEC18CS087"},{"$f":"Data_Sheet!B110","v":"SREELEKSHMI H KUMAR"},{"$f":"'A1'!F110","v":10},{"$f":"IF(C110=\"A\",\"ABSENT\",IF(C110>='A1'!$E$5*$E$124/100,\"EXCELLENT\",IF(C110>='A1'!$E$5*$E$123/100,\"GOOD\",IF(C110>='A1'!$E$5*$E$122/100,\"AVERAGE\",\"POOR\"))))","v":"EXCELLENT"}]
[{"$f":"Data_Sheet!A111","v":"JEC18CS088"},{"$f":"Data_Sheet!B111","v":"SUFAIL BADUSHA.T"},{"$f":"'A1'!F111","v":9},{"$f":"IF(C111=\"A\",\"ABSENT\",IF(C111>='A1'!$E$5*$E$124/100,\"EXCELLENT\",IF(C111>='A1'!$E$5*$E$123/100,\"GOOD\",IF(C111>='A1'!$E$5*$E$122/100,\"AVERAGE\",\"POOR\"))))","v":"EXCELLENT"}]
[{"$f":"Data_Sheet!A112","v":"JEC18CS089"},{"$f":"Data_Sheet!B112","v":"TIYA THOMAS"},{"$f":"'A1'!F112","v":10},{"$f":"IF(C112=\"A\",\"ABSENT\",IF(C112>='A1'!$E$5*$E$124/100,\"EXCELLENT\",IF(C112>='A1'!$E$5*$E$123/100,\"GOOD\",IF(C112>='A1'!$E$5*$E$122/100,\"AVERAGE\",\"POOR\"))))","v":"EXCELLENT"}]
[{"$f":"Data_Sheet!A113","v":"JEC18CS090"},{"$f":"Data_Sheet!B113","v":"TOMSUN PAVOO P"},{"$f":"'A1'!F113","v":10},{"$f":"IF(C113=\"A\",\"ABSENT\",IF(C113>='A1'!$E$5*$E$124/100,\"EXCELLENT\",IF(C113>='A1'!$E$5*$E$123/100,\"GOOD\",IF(C113>='A1'!$E$5*$E$122/100,\"AVERAGE\",\"POOR\"))))","v":"EXCELLENT"}]
[{"$f":"Data_Sheet!A114","v":"JEC18CS091"},{"$f":"Data_Sheet!B114","v":"ULLAS. S"},{"$f":"'A1'!F114","v":5},{"$f":"IF(C114=\"A\",\"ABSENT\",IF(C114>='A1'!$E$5*$E$124/100,\"EXCELLENT\",IF(C114>='A1'!$E$5*$E$123/100,\"GOOD\",IF(C114>='A1'!$E$5*$E$122/100,\"AVERAGE\",\"POOR\"))))","v":"AVERAGE"}]
[{"$f":"Data_Sheet!A115","v":"JEC18CS092"},{"$f":"Data_Sheet!B115","v":"VAISHNAV M"},{"$f":"'A1'!F115","v":5},{"$f":"IF(C115=\"A\",\"ABSENT\",IF(C115>='A1'!$E$5*$E$124/100,\"EXCELLENT\",IF(C115>='A1'!$E$5*$E$123/100,\"GOOD\",IF(C115>='A1'!$E$5*$E$122/100,\"AVERAGE\",\"POOR\"))))","v":"AVERAGE"}]
[{"$f":"Data_Sheet!A116","v":"JEC18CS093"},{"$f":"Data_Sheet!B116","v":"VANI PRAKASHAN CHOYYAN"},{"$f":"'A1'!F116","v":10},{"$f":"IF(C116=\"A\",\"ABSENT\",IF(C116>='A1'!$E$5*$E$124/100,\"EXCELLENT\",IF(C116>='A1'!$E$5*$E$123/100,\"GOOD\",IF(C116>='A1'!$E$5*$E$122/100,\"AVERAGE\",\"POOR\"))))","v":"EXCELLENT"}]
[]
["Total Number of Students",null,{"$f":"Data_Sheet!$C$6","v":92}]
["Number of Students Absent",null,{"$f":"IF(COUNTIF(C25:INDIRECT(C131),\"=A\"),COUNTIF(C25:INDIRECT(C131),\"=A\"),0)","v":0}]
["Total Number of Students attended",null,{"$f":"C118-C119","v":92}]
[{"$f":"\"Number of Students with Marks less than \"&E122&\"%\"","v":"Number of Students with Marks less than 45%"},null,{"$f":"IF(COUNTIF(D25:INDIRECT(D131),\"=POOR\"),COUNTIF(D25:INDIRECT(D131),\"=POOR\"),0)","v":3},"POOR","Range"]
[{"$f":"\"Number of Students with Marks betweeen \"&E122&\"% to \"&E123&\"%\"","v":"Number of Students with Marks betweeen 45% to 60%"},null,{"$f":"IF(COUNTIF(D25:INDIRECT(D131),\"=AVERAGE\"),COUNTIF(D25:INDIRECT(D131),\"=AVERAGE\"),0)","v":6},"AVERAGE",45]
[{"$f":"\"Number of Students with Marks betweeen \"&E123&\"% to \"&E124&\"%\"","v":"Number of Students with Marks betweeen 60% to 80%"},null,{"$f":"IF(COUNTIF(D25:INDIRECT(D131),\"=GOOD\"),COUNTIF(D25:INDIRECT(D131),\"=GOOD\"),0)","v":3},"GOOD",60]
[{"$f":"\"Number of Students with Marks greater than \"&E124&\"%\"","v":"Number of Students with Marks greater than 80%"},null,{"$f":"IF(COUNTIF(D25:INDIRECT(D131),\"=EXCELLENT\"),COUNTIF(D25:INDIRECT(D131),\"=EXCELLENT\"),0)","v":80},"EXCELLENT",80]
["Class Average",null,{"$f":"ROUND(AVERAGE(C25:INDIRECT(C131)),2)","v":8.85}]
["Pass Percentage",null,{"$f":"ROUND(((C120-C121)/C120)*100,2)","v":96.74}]
[]
[null,{"$f":"Data_Sheet!B10","v":"Name of Faculty : "},{"$f":"Data_Sheet!B11","v":"Namitha T N"}]
[null,{"$f":"Data_Sheet!B136","v":"Dated Signature :  "}]
[]
[{"$f":"ROW(A118)-2","v":116},"Last Row Count",{"$f":"\"$C$\"&$A$131","v":"$C$116"},{"$f":"\"$D$\"&$A$131","v":"$D$116"}]

{"sheet":"A2","index":10,"n_rows":181,"n_cols":16,"rows_kept":181,"cut":false,"hidden":false,"merged":[[17,8,21,8],[168,12,173,12],[140,12,145,12],[147,12,152,12],[154,12,159,12],[161,12,166,12],[0,2,0,3],[1,2,1,3],[2,0,4,1],[2,2,2,4],[3,2,3,4],[4,2,4,3],[6,0,6,5],[8,0,8,5],[10,0,10,5],[12,0,12,5],[17,0,21,0],[17,1,21,1],[17,5,21,5],[117,0,117,2],[118,0,118,2],[119,0,119,2],[120,0,120,2],[121,0,121,2]]}
[null,null,"Date : "]
[null,null,"2018-03-21"]
["Add questions one by one as needed..",null,"Assessment Category",null,null,null,"CO1","First Internal Exam"]
[null,null,"Assignment - 2",null,null,null,"CO2","Second Internal Exam"]
[null,null,"Total Marks : ",null,10,null,"CO3","Assessment Exam - 1"]
[null,null,null,null,null,null,"CO4","Assessment Exam - 2"]
[{"$f":"Data_Sheet!A2","v":"Jyothi Engineering College, Cheruthuruthy"},null,null,null,null,null,"CO5","Assignment - 1"]
[null,null,null,null,null,null,"CO6","Assignment - 2"]
[{"$f":"Data_Sheet!A4","v":"Department of Computer Science Engineering"},null,null,null,null,null,null,"Retest"]
[null,null,null,null,null,null,1]
[{"$f":"\"CO Analysis - Internal Marks : \"&C4 &\"                       \" &TEXT(C2,\"dd-mm-yy\")","v":"CO Analysis - Internal Marks : Assignment - 2                       21-03-18"},null,null,null,null,null,2]
[null,null,null,null,null,null,3]
[{"$f":"Data_Sheet!A17","v":"S3 CS              CS203 Switching Theory and Logic Design               2019-20"},null,null,null,null,null,4]
[null,null,null,null,null,null,5]
[null,null,null,null,null,null,6]
[]
[]
["Register No.","Name of Student","Qn. No.",1,2,{"$f":" \"Total Marks (\" &E5 & \")\"","v":"Total Marks (10)"},null,null,"Calculated Total Marks (10)"]
[null,null,"CO's","CO1, CO6","CO2, CO1"]
[null,null,"Blooms Taxonomy Lavel","4, 5","5, 6"]
[null,null,"Max. Marks",5,5]
[null,null,"Difficulty Level in %",60,60]
[]
["Column1","Column2","Column3","Column4","Column5","Column32"]
[{"$f":"Data_Sheet!A25","v":"JEC18CS001"},{"$f":"Data_Sheet!B25","v":"ABHISHEK KRISHNAN MENON E"},null,5,5,10]
[{"$f":"Data_Sheet!A26","v":"JEC18CS002"},{"$f":"Data_Sheet!B26","v":"ABHISHEK SAJEEVAN"},null,2.5,2.5,5]
[{"$f":"Data_Sheet!A27","v":"JEC18CS003"},{"$f":"Data_Sheet!B27","v":"ABHITH SHAJI"},null,4.5,4.5,9]
[{"$f":"Data_Sheet!A28","v":"JEC18CS004"},{"$f":"Data_Sheet!B28","v":"ABIN SANTHOSH ALAPATT"},null,5,5,10]
[{"$f":"Data_Sheet!A29","v":"JEC18CS005"},{"$f":"Data_Sheet!B29","v":"ADARSH KUMAR M A"},null,5,5,10]
[{"$f":"Data_Sheet!A30","v":"JEC18CS006"},{"$f":"Data_Sheet!B30","v":"ADHITHYA KRISHNA S"},null,4.5,4.5,9]
[{"$f":"Data_Sheet!A31","v":"JEC18CS007"},{"$f":"Data_Sheet!B31","v":"ADITHYA HARIDAS"},null,5,5,10]
[{"$f":"Data_Sheet!A32","v":"JEC18CS008"},{"$f":"Data_Sheet!B32","v":"AJMAL BASHEER"},null,2.5,2.5,5]
[{"$f":"Data_Sheet!A33","v":"JEC18CS009"},{"$f":"Data_Sheet!B33","v":"AKASH.V"},null,4,5,9]
[{"$f":"Data_Sheet!A34","v":"JEC18CS010"},{"$f":"Data_Sheet!B34","v":"AKHIL AZEEZ UPPILAMKUNNATH"},null,5,5,10]
[{"$f":"Data_Sheet!A35","v":"JEC18CS011"},{"$f":"Data_Sheet!B35","v":"AKHIL KRISHNA UK"},null,4,5,9]
[{"$f":"Data_Sheet!A36","v":"JEC18CS012"},{"$f":"Data_Sheet!B36","v":"ALAN GEORGE"},null,5,5,10]
[{"$f":"Data_Sheet!A37","v":"JEC18CS013"},{"$f":"Data_Sheet!B37","v":"ALEN VARGHESE"},null,5,5,10]
[{"$f":"Data_Sheet!A38","v":"JEC18CS014"},{"$f":"Data_Sheet!B38","v":"AMAL SEBASTIAN"},null,5,5,10]
[{"$f":"Data_Sheet!A39","v":"JEC18CS015"},{"$f":"Data_Sheet!B39","v":"AMAL SONY"},null,3,5,8]
[{"$f":"Data_Sheet!A40","v":"JEC18CS016"},{"$f":"Data_Sheet!B40","v":"ANAGHA WILSON"},null,5,5,10]
[{"$f":"Data_Sheet!A41","v":"JEC18CS017"},{"$f":"Data_Sheet!B41","v":"ANETTE ANTO"},null,5,5,10]
[{"$f":"Data_Sheet!A42","v":"JEC18CS018"},{"$f":"Data_Sheet!B42","v":"ANIT MARY THOMAS"},null,5,5,10]
[{"$f":"Data_Sheet!A43","v":"JEC18CS020"},{"$f":"Data_Sheet!B43","v":"ANN THERESA SHAJI"},null,5,5,10]
[{"$f":"Data_Sheet!A44","v":"JEC18CS021"},{"$f":"Data_Sheet!B44","v":"ANTONY ROY"},null,4,5,9]
[{"$f":"Data_Sheet!A45","v":"JEC18CS022"},{"$f":"Data_Sheet!B45","v":"ANUGRAHA C"},null,5,5,10]
[{"$f":"Data_Sheet!A46","v":"JEC18CS023"},{"$f":"Data_Sheet!B46","v":"APARNA.V"},null,5,5,10]
[{"$f":"Data_Sheet!A47","v":"JEC18CS024"},{"$f":"Data_Sheet!B47","v":"ARAVIND S KUMAR"},null,5,5,10]
[{"$f":"Data_Sheet!A48","v":"JEC18CS025"},{"$f":"Data_Sheet!B48","v":"ARJUN VINOD"},null,3,2,5]
[{"$f":"Data_Sheet!A49","v":"JEC18CS026"},{"$f":"Data_Sheet!B49","v":"ARUN VG"},null,5,5,10]
[{"$f":"Data_Sheet!A50","v":"JEC18CS027"},{"$f":"Data_Sheet!B50","v":"ASHRUL K"},null,5,5,10]
[{"$f":"Data_Sheet!A51","v":"JEC18CS028"},{"$f":"Data_Sheet!B51","v":"ATHIL PAULY"},null,4,5,9]
[{"$f":"Data_Sheet!A52","v":"JEC18CS029"},{"$f":"Data_Sheet!B52","v":"ATHIRA K P"},null,5,5,10]
[{"$f":"Data_Sheet!A53","v":"JEC18CS030"},{"$f":"Data_Sheet!B53","v":"AWIN ANTO"},null,5,5,10]
[{"$f":"Data_Sheet!A54","v":"JEC18CS031"},{"$f":"Data_Sheet!B54","v":"CHARLES JOHNSON"},null,5,4,9]
[{"$f":"Data_Sheet!A55","v":"JEC18CS032"},{"$f":"Data_Sheet!B55","v":"CHITTILAPPILLY JOVIA JOHNSON"},null,5,5,10]
[{"$f":"Data_Sheet!A56","v":"JEC18CS033"},{"$f":"Data_Sheet!B56","v":"CIYA BABU"},null,5,5,10]
[{"$f":"Data_Sheet!A57","v":"JEC18CS034"},{"$f":"Data_Sheet!B57","v":"DAVID SALUS"},null,5,5,10]
[{"$f":"Data_Sheet!A58","v":"JEC18CS035"},{"$f":"Data_Sheet!B58","v":"DELICIA REJI"},null,5,5,10]
[{"$f":"Data_Sheet!A59","v":"JEC18CS036"},{"$f":"Data_Sheet!B59","v":"DELMA SHAJAN"},null,5,5,10]
[{"$f":"Data_Sheet!A60","v":"JEC18CS037"},{"$f":"Data_Sheet!B60","v":"DILBER SHA AP"},null,4,5,9]
[{"$f":"Data_Sheet!A61","v":"JEC18CS038"},{"$f":"Data_Sheet!B61","v":"EDWIN T JOY"},null,4,5,9]
[{"$f":"Data_Sheet!A62","v":"JEC18CS039"},{"$f":"Data_Sheet!B62","v":"EDWIN WILSON"},null,4,5,9]
[{"$f":"Data_Sheet!A63","v":"JEC18CS040"},{"$f":"Data_Sheet!B63","v":"EMMANUEL SHIBU"},null,5,5,10]
[{"$f":"Data_Sheet!A64","v":"JEC18CS041"},{"$f":"Data_Sheet!B64","v":"GAYATHRI DINESH"},null,5,5,10]
[{"$f":"Data_Sheet!A65","v":"JEC18CS042"},{"$f":"Data_Sheet!B65","v":"GOKUL DAS M"},null,5,5,10]
[{"$f":"Data_Sheet!A66","v":"JEC18CS043"},{"$f":"Data_Sheet!B66","v":"G RAMGOPAL"},null,5,5,10]
[{"$f":"Data_Sheet!A67","v":"JEC18CS044"},{"$f":"Data_Sheet!B67","v":"HARIES DAVIS"},null,5,5,10]
[{"$f":"Data_Sheet!A68","v":"JEC18CS045"},{"$f":"Data_Sheet!B68","v":"HARISANKER P"},null,5,5,10]
[{"$f":"Data_Sheet!A69","v":"JEC18CS046"},{"$f":"Data_Sheet!B69","v":"HARSHA.K.S."},null,5,5,10]
[{"$f":"Data_Sheet!A70","v":"JEC18CS047"},{"$f":"Data_Sheet!B70","v":"HELNA THOMAS"},null,5,5,10]
[{"$f":"Data_Sheet!A71","v":"JEC18CS048"},{"$f":"Data_Sheet!B71","v":"HRIDI KRISHNA.H"},null,5,5,10]
[{"$f":"Data_Sheet!A72","v":"JEC18CS049"},{"$f":"Data_Sheet!B72","v":"INDRAJIT R"},null,5,3,8]
[{"$f":"Data_Sheet!A73","v":"JEC18CS050"},{"$f":"Data_Sheet!B73","v":"JESWIN JOJY"},null,5,3,8]
[{"$f":"Data_Sheet!A74","v":"JEC18CS051"},{"$f":"Data_Sheet!B74","v":"JIBIN A BABU"},null,5,5,10]
[{"$f":"Data_Sheet!A75","v":"JEC18CS052"},{"$f":"Data_Sheet!B75","v":"JISSY JOY"},null,5,5,10]
[{"$f":"Data_Sheet!A76","v":"JEC18CS053"},{"$f":"Data_Sheet!B76","v":"JOEL JAMES KARIKKANDATHIL"},null,5,5,10]
[{"$f":"Data_Sheet!A77","v":"JEC18CS054"},{"$f":"Data_Sheet!B77","v":"JOSE REJI KARIMADATHI"},null,5,3,8]
[{"$f":"Data_Sheet!A78","v":"JEC18CS055"},{"$f":"Data_Sheet!B78","v":"JUMANA HASIN"},null,5,5,10]
[{"$f":"Data_Sheet!A79","v":"JEC18CS056"},{"$f":"Data_Sheet!B79","v":"KAILASHNATH"},null,5,5,9]
[{"$f":"Data_Sheet!A80","v":"JEC18CS057"},{"$f":"Data_Sheet!B80","v":"K AJISHKUMAR"},null,5,5,9]
[{"$f":"Data_Sheet!A81","v":"JEC18CS058"},{"$f":"Data_Sheet!B81","v":"KEERTHANA K S"},null,5,5,9]
[{"$f":"Data_Sheet!A82","v":"JEC18CS059"},{"$f":"Data_Sheet!B82","v":"KEVIN VARGHESE"},null,5,5,10]
[{"$f":"Data_Sheet!A83","v":"JEC18CS060"},{"$f":"Data_Sheet!B83","v":"LAKSHMI SADANANDAN"},null,5,5,10]
[{"$f":"Data_Sheet!A84","v":"JEC18CS061"},{"$f":"Data_Sheet!B84","v":"LEYA PALLAN"},null,5,5,10]
[{"$f":"Data_Sheet!A85","v":"JEC18CS062"},{"$f":"Data_Sheet!B85","v":"MARVEL BABU"},null,5,4,9]
[{"$f":"Data_Sheet!A86","v":"JEC18CS063"},{"$f":"Data_Sheet!B86","v":"MEDWIN PAUL"},null,2.5,2.5,5]
[{"$f":"Data_Sheet!A87","v":0},{"$f":"Data_Sheet!B87","v":0}]
[{"$f":"Data_Sheet!A88","v":0},{"$f":"Data_Sheet!B88","v":0}]
[{"$f":"Data_Sheet!A89","v":"JEC18CS066"},{"$f":"Data_Sheet!B89","v":"MUHAMMED INSHADH"},null,5,4,9]
[{"$f":"Data_Sheet!A90","v":"JEC18CS067"},{"$f":"Data_Sheet!B90","v":"NAIR MIDHUN RAMACHANDRAN"},null,5,3,8]
[{"$f":"Data_Sheet!A91","v":"JEC18CS068"},{"$f":"Data_Sheet!B91","v":"NAVEENA ANTONY"},null,5,5,10]
[{"$f":"Data_Sheet!A92","v":"JEC18CS069"},{"$f":"Data_Sheet!B92","v":"NITIN MADHU"},null,5,3,8]
[{"$f":"Data_Sheet!A93","v":"JEC18CS070"},{"$f":"Data_Sheet!B93","v":"PRATHIUSH ARUN"},null,5,5,10]
[{"$f":"Data_Sheet!A94","v":"JEC18CS071"},{"$f":"Data_Sheet!B94","v":"RACHEL CECER"},null,5,5,10]
[{"$f":"Data_Sheet!A95","v":"JEC18CS072"},{"$f":"Data_Sheet!B95","v":"RAHUL RAJU"},null,5,5,10]
[{"$f":"Data_Sheet!A96","v":"JEC18CS073"},{"$f":"Data_Sheet!B96","v":"RAHUL T RAVI"},null,5,5,10]
[{"$f":"Data_Sheet!A97","v":"JEC18CS074"},{"$f":"Data_Sheet!B97","v":"RAPHEAL K MOYALAN"},null,5,2,7]
[{"$f":"Data_Sheet!A98","v":"JEC18CS075"},{"$f":"Data_Sheet!B98","v":"RISHIKESH. V"},null,5,4,9]
[{"$f":"Data_Sheet!A99","v":"JEC18CS076"},{"$f":"Data_Sheet!B99","v":"ROCKSON T. AUGUSTINE"},null,3,5,8]
[{"$f":"Data_Sheet!A100","v":"JEC18CS077"},{"$f":"Data_Sheet!B100","v":"SARATH C P"},null,5,5,10]
[{"$f":"Data_Sheet!A101","v":"JEC18CS078"},{"$f":"Data_Sheet!B101","v":"SARATH SASI"},null,5,3,8]
[{"$f":"Data_Sheet!A102","v":"JEC18CS079"},{"$f":"Data_Sheet!B102","v":"SHAFNA"},null,5,5,10]
[{"$f":"Data_Sheet!A103","v":"JEC18CS080"},{"$f":"Data_Sheet!B103","v":"SHELMY SHABU"},null,5,5,10]
[{"$f":"Data_Sheet!A104","v":"JEC18CS081"},{"$f":"Data_Sheet!B104","v":"SHIZA SHIHAB PUVAMPARAMBIL"},null,5,5,10]
[{"$f":"Data_Sheet!A105","v":"JEC18CS082"},{"$f":"Data_Sheet!B105","v":"SIJO GEORGE"},null,5,3,8]
[{"$f":"Data_Sheet!A106","v":"JEC18CS083"},{"$f":"Data_Sheet!B106","v":"SOURAV K"},null,5,5,8]
[{"$f":"Data_Sheet!A107","v":0},{"$f":"Data_Sheet!B107","v":0}]
[{"$f":"Data_Sheet!A108","v":"JEC18CS085"},{"$f":"Data_Sheet!B108","v":"SREEHARI"},null,5,2,7]
[{"$f":"Data_Sheet!A109","v":"JEC18CS086"},{"$f":"Data_Sheet!B109","v":"SREEKANTH P"},null,2,5,7]
[{"$f":"Data_Sheet!A110","v":"JEC18CS087"},{"$f":"Data_Sheet!B110","v":"SREELEKSHMI H KUMAR"},null,5,5,10]
[{"$f":"Data_Sheet!A111","v":"JEC18CS088"},{"$f":"Data_Sheet!B111","v":"SUFAIL BADUSHA.T"},null,5,4,9]
[{"$f":"Data_Sheet!A112","v":"JEC18CS089"},{"$f":"Data_Sheet!B112","v":"TIYA THOMAS"},null,5,5,10]
[{"$f":"Data_Sheet!A113","v":"JEC18CS090"},{"$f":"Data_Sheet!B113","v":"TOMSUN PAVOO P"},null,5,5,10]
[{"$f":"Data_Sheet!A114","v":"JEC18CS091"},{"$f":"Data_Sheet!B114","v":"ULLAS. S"},null,2.5,2.5,5]
[{"$f":"Data_Sheet!A115","v":"JEC18CS092"},{"$f":"Data_Sheet!B115","v":"VAISHNAV M"},null,2.5,2.5,5]
[{"$f":"Data_Sheet!A116","v":"JEC18CS093"},{"$f":"Data_Sheet!B116","v":"VANI PRAKASHAN CHOYYAN"},null,5,5,10]
[]
["Total Marks scored for the Question",null,null,{"$f":"IF(D$22<>\"\",IF(SUM(D25:INDIRECT(D138))>=0,SUM(D25:INDIRECT(D138)),\"\"),\"\")","v":415.5},{"$f":"IF(E$22<>\"\",IF(SUM(E25:INDIRECT(E138))>=0,SUM(E25:INDIRECT(E138)),\"\"),\"\")","v":403.5}]
["No. of Students who attended the Question",null,null,{"$f":"IF(D$22<>\"\",IF(COUNT(D25:INDIRECT(D138))>=0,COUNT(D25:INDIRECT(D138)),\"\"),\"\")","v":89},{"$f":"IF(E$22<>\"\",IF(COUNT(E25:INDIRECT(E138))>=0,COUNT(E25:INDIRECT(E138)),\"\"),\"\")","v":89}]
["Difficulty Level marks of the Question",null,null,{"$f":"IF(D21*D22/100=0,\"\",D21*D22/100)","v":3},3]
["No. of Students who scored above the Difficulty Level",null,null,{"$f":"IF(COUNTIF(D25:INDIRECT(D138),\">=\"&D120)=0,\"\",COUNTIF(D25:INDIRECT(D138),\">=\"&D120))","v":83},{"$f":"IF(COUNTIF(E25:INDIRECT(E138),\">=\"&E120)=0,\"\",COUNTIF(E25:INDIRECT(E138),\">=\"&E120))","v":81}]
["% of Students who scored above the Difficulty Level",null,null,{"$f":"IFERROR(ROUND(D121/D119*100,2),\"\")","v":93.26},91.01]
[null,null,null,{"$f":"IF(D122=\"\",0,IF(D122>=80,3,IF(D122>=70,2,IF(D122>=60,1,0))))","v":3},3,"Marks"]
[null,{"$f":"IF(Data_Sheet!A119<>\"\",\"Total Attainment level for \"&Data_Sheet!A119&\" :\",\"\")","v":"Total Attainment level for CO1 :"},{"$f":"IF(Data_Sheet!A119<>\"\",I124,\"\")","v":3},{"$f":"IFERROR((IF(ISNUMBER(SEARCH(\"1\", D$19)),D$21,\"0\")),\"0\")*D123","v":15},{"$f":"IFERROR((IF(ISNUMBER(SEARCH(\"1\", E$19)),E$21,\"0\")),\"0\")*E123","v":15},{"$f":"F141","v":10},null,null,{"$f":"IF(F124=0,\"\",ROUND(SUM(D124:E124)/F124,2))","v":3},"T_Marks","S_Marks","Students","Level","Above","Above %","Attainment"]
[null,{"$f":"IF(Data_Sheet!A120<>\"\",\"Total Attainment level for \"&Data_Sheet!A120&\" :\",\"\")","v":"Total Attainment level for CO2 :"},{"$f":"IF(Data_Sheet!A120<>\"\",I125,\"\")","v":3},{"$f":"IFERROR((IF(ISNUMBER(SEARCH(\"2\", D$19)),D$21,\"0\")),\"0\")*D123","v":0},{"$f":"IFERROR((IF(ISNUMBER(SEARCH(\"2\", E$19)),E$21,\"0\")),\"0\")*E123","v":15},{"$f":"F142","v":5},null,null,3,{"$f":"F141","v":10},{"$f":"F148","v":819},{"$f":"F155","v":178},{"$f":"F162","v":6},{"$f":"F169","v":164},{"$f":"IFERROR(ROUND(N125/L125*100,2),\"\")","v":92.13},{"$f":"IF(O125=\"\",\"\",IF(O125>=80,3,IF(O125>=70,2,IF(O125>=60,1,0))))","v":3}]
[null,{"$f":"IF(Data_Sheet!A121<>\"\",\"Total Attainment level for \"&Data_Sheet!A121&\" :\",\"\")","v":"Total Attainment level for CO3 :"},{"$f":"IF(Data_Sheet!A121<>\"\",I126,\"\")","v":""},{"$f":"IFERROR((IF(ISNUMBER(SEARCH(\"3\", D$19)),D$21,\"0\")),\"0\")*D123","v":0},{"$f":"IFERROR((IF(ISNUMBER(SEARCH(\"3\", E$19)),E$21,\"0\")),\"0\")*E123","v":0},0,null,null,"",{"$f":"F142","v":5},{"$f":"F149","v":403.5},{"$f":"F156","v":89},{"$f":"F163","v":3},{"$f":"F170","v":81},{"$f":"IFERROR(ROUND(N126/L126*100,2),\"\")","v":91.01},{"$f":"IF(O126=\"\",\"\",IF(O126>=80,3,IF(O126>=70,2,IF(O126>=60,1,0))))","v":3}]
[null,{"$f":"IF(Data_Sheet!A122<>\"\",\"Total Attainment level for \"&Data_Sheet!A122&\" :\",\"\")","v":"Total Attainment level for CO4 :"},{"$f":"IF(Data_Sheet!A122<>\"\",I127,\"\")","v":""},{"$f":"IFERROR((IF(ISNUMBER(SEARCH(\"4\", D$19)),D$21,\"0\")),\"0\")*D123","v":0},{"$f":"IFERROR((IF(ISNUMBER(SEARCH(\"4\", E$19)),E$21,\"0\")),\"0\")*E123","v":0},0,null,null,"",0,0,0,0,0,"",""]
[null,{"$f":"IF(Data_Sheet!A123<>\"\",\"Total Attainment level for \"&Data_Sheet!A123&\" :\",\"\")","v":"Total Attainment level for CO5 :"},{"$f":"IF(Data_Sheet!A123<>\"\",I128,\"\")","v":""},{"$f":"IFERROR((IF(ISNUMBER(SEARCH(\"5\", D$19)),D$21,\"0\")),\"0\")*D123","v":0},{"$f":"IFERROR((IF(ISNUMBER(SEARCH(\"5\", E$19)),E$21,\"0\")),\"0\")*E123","v":0},0,null,null,"",0,0,0,0,0,"",""]
[null,{"$f":"IF(Data_Sheet!A124<>\"\",\"Total Attainment level for \"&Data_Sheet!A124&\" :\",\"\")","v":"Total Attainment level for CO6 :"},{"$f":"IF(Data_Sheet!A124<>\"\",I129,\"\")","v":3},{"$f":"IFERROR((IF(ISNUMBER(SEARCH(\"6\", D$19)),D$21,\"0\")),\"0\")*D123","v":15},{"$f":"IFERROR((IF(ISNUMBER(SEARCH(\"6\", E$19)),E$21,\"0\")),\"0\")*E123","v":0},5,null,null,3,0,0,0,0,0,"",""]
[null,null,null,null,null,null,null,null,null,5,415.5,89,3,83,93.26,3]
[{"$f":"Data_Sheet!A127","v":"Attainment Level 1: 60% students scoring more than 60% of the Total Marks"}]
[{"$f":"Data_Sheet!A128","v":"Attainment Level 2: 70% students scoring more than 60% of the Total Marks"}]
[{"$f":"Data_Sheet!A129","v":"Attainment Level 3: 80% students scoring more than 60% of the Total Marks"}]
[]
[null,{"$f":"Data_Sheet!B10","v":"Name of Faculty : "},{"$f":"Data_Sheet!B11","v":"Namitha T N"}]
[null,{"$f":"Data_Sheet!B136","v":"Dated Signature :  "}]
[]
[null,"Last Row Count",{"$f":"ROW(A118)-2","v":116},{"$f":"SUBSTITUTE(ADDRESS(1,COLUMN(D1),2),\"1\",\"\")&$C$138","v":"D$116"},{"$f":"\"E\"&$C$138","v":"E116"}]
[]
[]
[null,null,"CO1",{"$f":"IFERROR((IF(ISNUMBER(SEARCH(\"1\", D$19)),D$21,\"0\")),\"0\")","v":5},{"$f":"IFERROR((IF(ISNUMBER(SEARCH(\"1\", E$19)),E$21,\"0\")),\"0\")","v":5},{"$f":"IFERROR(SUM($D141:INDIRECT($I141)),\"0\")","v":10},null,null,{"$f":"SUBSTITUTE(ADDRESS(1,K141,4),1,\"\")&ROW($I141)","v":"E141"},{"$f":"COUNTIF($D$20:INDIRECT($L141),\"*1*\")","v":0},{"$f":"COLUMN($F$19)-1","v":5},{"$f":"SUBSTITUTE(ADDRESS(1,K141,4),1,\"\")&ROW($I$19)+1","v":"E20"},"Total Marks"]
[null,null,"CO2",{"$f":"IFERROR((IF(ISNUMBER(SEARCH(\"2\", D$19)),D$21,\"0\")),\"0\")","v":"0"},{"$f":"IFERROR((IF(ISNUMBER(SEARCH(\"2\", E$19)),E$21,\"0\")),\"0\")","v":5},{"$f":"IFERROR(SUM($D142:INDIRECT($I142)),\"0\")","v":5},null,null,"E142",{"$f":"COUNTIF($D$20:INDIRECT($L142),\"*2*\")","v":0},{"$f":"COLUMN($F$19)-1","v":5},{"$f":"SUBSTITUTE(ADDRESS(1,K142,4),1,\"\")&ROW($I$19)+1","v":"E20"}]
[null,null,"CO3",{"$f":"IFERROR((IF(ISNUMBER(SEARCH(\"3\", D$19)),D$21,\"0\")),\"0\")","v":"0"},{"$f":"IFERROR((IF(ISNUMBER(SEARCH(\"3\", E$19)),E$21,\"0\")),\"0\")","v":"0"},{"$f":"IFERROR(SUM($D143:INDIRECT($I143)),\"0\")","v":0},null,null,"E143",{"$f":"COUNTIF($D$20:INDIRECT($L143),\"*2*\")","v":0},5,"E20"]
[null,null,"CO4",{"$f":"IFERROR((IF(ISNUMBER(SEARCH(\"4\", D$19)),D$21,\"0\")),\"0\")","v":"0"},{"$f":"IFERROR((IF(ISNUMBER(SEARCH(\"4\", E$19)),E$21,\"0\")),\"0\")","v":"0"},{"$f":"IFERROR(SUM($D144:INDIRECT($I144)),\"0\")","v":0},null,null,"E144",{"$f":"COUNTIF($D$20:INDIRECT($L144),\"*2*\")","v":0},5,"E20"]
[null,null,"CO5",{"$f":"IFERROR((IF(ISNUMBER(SEARCH(\"5\", D$19)),D$21,\"0\")),\"0\")","v":"0"},{"$f":"IFERROR((IF(ISNUMBER(SEARCH(\"5\", E$19)),E$21,\"0\")),\"0\")","v":"0"},{"$f":"IFERROR(SUM($D145:INDIRECT($I145)),\"0\")","v":0},null,null,"E145",{"$f":"COUNTIF($D$20:INDIRECT($L145),\"*2*\")","v":0},5,"E20"]
[null,null,"CO6",{"$f":"IFERROR((IF(ISNUMBER(SEARCH(\"6\", D$19)),D$21,\"0\")),\"0\")","v":5},{"$f":"IFERROR((IF(ISNUMBER(SEARCH(\"6\", E$19)),E$21,\"0\")),\"0\")","v":"0"},{"$f":"IFERROR(SUM($D146:INDIRECT($I146)),\"0\")","v":5},null,null,"E146",{"$f":"COUNTIF($D$20:INDIRECT($L146),\"*2*\")","v":0},5,"E20"]
[]
[null,null,"CO1",{"$f":"IFERROR((IF(ISNUMBER(SEARCH(\"1\", D$19)),D$118,\"0\")),\"0\")","v":415.5},{"$f":"IFERROR((IF(ISNUMBER(SEARCH(\"1\", E$19)),E$118,\"0\")),\"0\")","v":403.5},{"$f":"IFERROR(SUM($D148:INDIRECT($I148)),\"0\")","v":819},null,null,{"$f":"SUBSTITUTE(ADDRESS(1,K148,4),1,\"\")&ROW($I148)","v":"E148"},{"$f":"COUNTIF($D$20:INDIRECT($L148),\"*1*\")","v":0},{"$f":"COLUMN($F$19)-1","v":5},{"$f":"SUBSTITUTE(ADDRESS(1,K148,4),1,\"\")&ROW($I$19)+1","v":"E20"},"Total Marks Scored"]
[null,null,"CO2",{"$f":"IFERROR((IF(ISNUMBER(SEARCH(\"2\", D$19)),D$118,\"0\")),\"0\")","v":"0"},{"$f":"IFERROR((IF(ISNUMBER(SEARCH(\"2\", E$19)),E$118,\"0\")),\"0\")","v":403.5},{"$f":"IFERROR(SUM($D149:INDIRECT($I149)),\"0\")","v":403.5},null,null,"E149",{"$f":"COUNTIF($D$20:INDIRECT($L149),\"*2*\")","v":0},{"$f":"COLUMN($F$19)-1","v":5},{"$f":"SUBSTITUTE(ADDRESS(1,K149,4),1,\"\")&ROW($I$19)+1","v":"E20"}]
[null,null,"CO3",{"$f":"IFERROR((IF(ISNUMBER(SEARCH(\"3\", D$19)),D$118,\"0\")),\"0\")","v":"0"},{"$f":"IFERROR((IF(ISNUMBER(SEARCH(\"3\", E$19)),E$118,\"0\")),\"0\")","v":"0"},{"$f":"IFERROR(SUM($D150:INDIRECT($I150)),\"0\")","v":0},null,null,"E150",{"$f":"COUNTIF($D$20:INDIRECT($L150),\"*2*\")","v":0},5,"E20"]
[null,null,"CO4",{"$f":"IFERROR((IF(ISNUMBER(SEARCH(\"4\", D$19)),D$118,\"0\")),\"0\")","v":"0"},{"$f":"IFERROR((IF(ISNUMBER(SEARCH(\"4\", E$19)),E$118,\"0\")),\"0\")","v":"0"},{"$f":"IFERROR(SUM($D151:INDIRECT($I151)),\"0\")","v":0},null,null,"E151",{"$f":"COUNTIF($D$20:INDIRECT($L151),\"*2*\")","v":0},5,"E20"]
[null,null,"CO5",{"$f":"IFERROR((IF(ISNUMBER(SEARCH(\"5\", D$19)),D$118,\"0\")),\"0\")","v":"0"},{"$f":"IFERROR((IF(ISNUMBER(SEARCH(\"5\", E$19)),E$118,\"0\")),\"0\")","v":"0"},{"$f":"IFERROR(SUM($D152:INDIRECT($I152)),\"0\")","v":0},null,null,"E152",{"$f":"COUNTIF($D$20:INDIRECT($L152),\"*2*\")","v":0},5,"E20"]
[null,null,"CO6",{"$f":"IFERROR((IF(ISNUMBER(SEARCH(\"6\", D$19)),D$118,\"0\")),\"0\")","v":415.5},{"$f":"IFERROR((IF(ISNUMBER(SEARCH(\"6\", E$19)),E$118,\"0\")),\"0\")","v":"0"},{"$f":"IFERROR(SUM($D153:INDIRECT($I153)),\"0\")","v":415.5},null,null,"E153",{"$f":"COUNTIF($D$20:INDIRECT($L153),\"*2*\")","v":0},5,"E20"]
[]
[null,null,"CO1",{"$f":"IFERROR((IF(ISNUMBER(SEARCH(\"1\", D$19)),D$119,\"0\")),\"0\")","v":89},{"$f":"IFERROR((IF(ISNUMBER(SEARCH(\"1\", E$19)),E$119,\"0\")),\"0\")","v":89},{"$f":"IFERROR(SUM($D155:INDIRECT($I155)),\"0\")","v":178},null,null,{"$f":"SUBSTITUTE(ADDRESS(1,K155,4),1,\"\")&ROW($I155)","v":"E155"},{"$f":"COUNTIF($D$20:INDIRECT($L155),\"*1*\")","v":0},{"$f":"COLUMN($F$19)-1","v":5},{"$f":"SUBSTITUTE(ADDRESS(1,K155,4),1,\"\")&ROW($I$19)+1","v":"E20"},"No of Studdents Attended"]
[null,null,"CO2",{"$f":"IFERROR((IF(ISNUMBER(SEARCH(\"2\", D$19)),D$119,\"0\")),\"0\")","v":"0"},{"$f":"IFERROR((IF(ISNUMBER(SEARCH(\"2\", E$19)),E$119,\"0\")),\"0\")","v":89},{"$f":"IFERROR(SUM($D156:INDIRECT($I156)),\"0\")","v":89},null,null,"E156",{"$f":"COUNTIF($D$20:INDIRECT($L156),\"*2*\")","v":0},{"$f":"COLUMN($F$19)-1","v":5},{"$f":"SUBSTITUTE(ADDRESS(1,K156,4),1,\"\")&ROW($I$19)+1","v":"E20"}]
[null,null,"CO3",{"$f":"IFERROR((IF(ISNUMBER(SEARCH(\"3\", D$19)),D$119,\"0\")),\"0\")","v":"0"},{"$f":"IFERROR((IF(ISNUMBER(SEARCH(\"3\", E$19)),E$119,\"0\")),\"0\")","v":"0"},{"$f":"IFERROR(SUM($D157:INDIRECT($I157)),\"0\")","v":0},null,null,"E157",{"$f":"COUNTIF($D$20:INDIRECT($L157),\"*2*\")","v":0},5,"E20"]
[null,null,"CO4",{"$f":"IFERROR((IF(ISNUMBER(SEARCH(\"4\", D$19)),D$119,\"0\")),\"0\")","v":"0"},{"$f":"IFERROR((IF(ISNUMBER(SEARCH(\"4\", E$19)),E$119,\"0\")),\"0\")","v":"0"},{"$f":"IFERROR(SUM($D158:INDIRECT($I158)),\"0\")","v":0},null,null,"E158",{"$f":"COUNTIF($D$20:INDIRECT($L158),\"*2*\")","v":0},5,"E20"]
[null,null,"CO5",{"$f":"IFERROR((IF(ISNUMBER(SEARCH(\"5\", D$19)),D$119,\"0\")),\"0\")","v":"0"},{"$f":"IFERROR((IF(ISNUMBER(SEARCH(\"5\", E$19)),E$119,\"0\")),\"0\")","v":"0"},{"$f":"IFERROR(SUM($D159:INDIRECT($I159)),\"0\")","v":0},null,null,"E159",{"$f":"COUNTIF($D$20:INDIRECT($L159),\"*2*\")","v":0},5,"E20"]
[null,null,"CO6",{"$f":"IFERROR((IF(ISNUMBER(SEARCH(\"6\", D$19)),D$119,\"0\")),\"0\")","v":89},{"$f":"IFERROR((IF(ISNUMBER(SEARCH(\"6\", E$19)),E$119,\"0\")),\"0\")","v":"0"},{"$f":"IFERROR(SUM($D160:INDIRECT($I160)),\"0\")","v":89},null,null,"E160",{"$f":"COUNTIF($D$20:INDIRECT($L160),\"*2*\")","v":0},5,"E20"]
[]
[null,null,"CO1",{"$f":"IFERROR((IF(ISNUMBER(SEARCH(\"1\", D$19)),D$120,\"0\")),\"0\")","v":3},{"$f":"IFERROR((IF(ISNUMBER(SEARCH(\"1\", E$19)),E$120,\"0\")),\"0\")","v":3},{"$f":"IFERROR(SUM($D162:INDIRECT($I162)),\"0\")","v":6},null,null,{"$f":"SUBSTITUTE(ADDRESS(1,K162,4),1,\"\")&ROW($I162)","v":"E162"},{"$f":"COUNTIF($D$20:INDIRECT($L162),\"*1*\")","v":0},{"$f":"COLUMN($F$19)-1","v":5},{"$f":"SUBSTITUTE(ADDRESS(1,K162,4),1,\"\")&ROW($I$19)+1","v":"E20"},"Difficulty Level"]
[null,null,"CO2",{"$f":"IFERROR((IF(ISNUMBER(SEARCH(\"2\", D$19)),D$120,\"0\")),\"0\")","v":"0"},{"$f":"IFERROR((IF(ISNUMBER(SEARCH(\"2\", E$19)),E$120,\"0\")),\"0\")","v":3},{"$f":"IFERROR(SUM($D163:INDIRECT($I163)),\"0\")","v":3},null,null,"E163",{"$f":"COUNTIF($D$20:INDIRECT($L163),\"*2*\")","v":0},{"$f":"COLUMN($F$19)-1","v":5},{"$f":"SUBSTITUTE(ADDRESS(1,K163,4),1,\"\")&ROW($I$19)+1","v":"E20"}]
[null,null,"CO3",{"$f":"IFERROR((IF(ISNUMBER(SEARCH(\"3\", D$19)),D$120,\"0\")),\"0\")","v":"0"},{"$f":"IFERROR((IF(ISNUMBER(SEARCH(\"3\", E$19)),E$120,\"0\")),\"0\")","v":"0"},{"$f":"IFERROR(SUM($D164:INDIRECT($I164)),\"0\")","v":0},null,null,"E164",{"$f":"COUNTIF($D$20:INDIRECT($L164),\"*2*\")","v":0},5,"E20"]
[null,null,"CO4",{"$f":"IFERROR((IF(ISNUMBER(SEARCH(\"4\", D$19)),D$120,\"0\")),\"0\")","v":"0"},{"$f":"IFERROR((IF(ISNUMBER(SEARCH(\"4\", E$19)),E$120,\"0\")),\"0\")","v":"0"},{"$f":"IFERROR(SUM($D165:INDIRECT($I165)),\"0\")","v":0},null,null,"E165",{"$f":"COUNTIF($D$20:INDIRECT($L165),\"*2*\")","v":0},5,"E20"]
[null,null,"CO5",{"$f":"IFERROR((IF(ISNUMBER(SEARCH(\"5\", D$19)),D$120,\"0\")),\"0\")","v":"0"},{"$f":"IFERROR((IF(ISNUMBER(SEARCH(\"5\", E$19)),E$120,\"0\")),\"0\")","v":"0"},{"$f":"IFERROR(SUM($D166:INDIRECT($I166)),\"0\")","v":0},null,null,"E166",{"$f":"COUNTIF($D$20:INDIRECT($L166),\"*2*\")","v":0},5,"E20"]
[null,null,"CO6",{"$f":"IFERROR((IF(ISNUMBER(SEARCH(\"6\", D$19)),D$120,\"0\")),\"0\")","v":3},{"$f":"IFERROR((IF(ISNUMBER(SEARCH(\"6\", E$19)),E$120,\"0\")),\"0\")","v":"0"},{"$f":"IFERROR(SUM($D167:INDIRECT($I167)),\"0\")","v":3},null,null,"E167",{"$f":"COUNTIF($D$20:INDIRECT($L167),\"*2*\")","v":0},5,"E20"]
[]
[null,null,"CO1",{"$f":"IFERROR((IF(ISNUMBER(SEARCH(\"1\", D$19)),D$121,\"0\")),\"0\")","v":83},{"$f":"IFERROR((IF(ISNUMBER(SEARCH(\"1\", E$19)),E$121,\"0\")),\"0\")","v":81},{"$f":"IFERROR(SUM($D169:INDIRECT($I169)),\"0\")","v":164},null,null,{"$f":"SUBSTITUTE(ADDRESS(1,K169,4),1,\"\")&ROW($I169)","v":"E169"},{"$f":"COUNTIF($D$20:INDIRECT($L169),\"*1*\")","v":0},{"$f":"COLUMN($F$19)-1","v":5},{"$f":"SUBSTITUTE(ADDRESS(1,K169,4),1,\"\")&ROW($I$19)+1","v":"E20"},"No of Studdents Above Difficulty Level"]
[null,null,"CO2",{"$f":"IFERROR((IF(ISNUMBER(SEARCH(\"2\", D$19)),D$121,\"0\")),\"0\")","v":"0"},{"$f":"IFERROR((IF(ISNUMBER(SEARCH(\"2\", E$19)),E$121,\"0\")),\"0\")","v":81},{"$f":"IFERROR(SUM($D170:INDIRECT($I170)),\"0\")","v":81},null,null,"E170",{"$f":"COUNTIF($D$20:INDIRECT($L170),\"*2*\")","v":0},{"$f":"COLUMN($F$19)-1","v":5},{"$f":"SUBSTITUTE(ADDRESS(1,K170,4),1,\"\")&ROW($I$19)+1","v":"E20"}]
[null,null,"CO3",{"$f":"IFERROR((IF(ISNUMBER(SEARCH(\"3\", D$19)),D$121,\"0\")),\"0\")","v":"0"},{"$f":"IFERROR((IF(ISNUMBER(SEARCH(\"3\", E$19)),E$121,\"0\")),\"0\")","v":"0"},{"$f":"IFERROR(SUM($D171:INDIRECT($I171)),\"0\")","v":0},null,null,"E171",{"$f":"COUNTIF($D$20:INDIRECT($L171),\"*2*\")","v":0},5,"E20"]
[null,null,"CO4",{"$f":"IFERROR((IF(ISNUMBER(SEARCH(\"4\", D$19)),D$121,\"0\")),\"0\")","v":"0"},{"$f":"IFERROR((IF(ISNUMBER(SEARCH(\"4\", E$19)),E$121,\"0\")),\"0\")","v":"0"},{"$f":"IFERROR(SUM($D172:INDIRECT($I172)),\"0\")","v":0},null,null,"E172",{"$f":"COUNTIF($D$20:INDIRECT($L172),\"*2*\")","v":0},5,"E20"]
[null,null,"CO5",{"$f":"IFERROR((IF(ISNUMBER(SEARCH(\"5\", D$19)),D$121,\"0\")),\"0\")","v":"0"},{"$f":"IFERROR((IF(ISNUMBER(SEARCH(\"5\", E$19)),E$121,\"0\")),\"0\")","v":"0"},{"$f":"IFERROR(SUM($D173:INDIRECT($I173)),\"0\")","v":0},null,null,"E173",{"$f":"COUNTIF($D$20:INDIRECT($L173),\"*2*\")","v":0},5,"E20"]
[null,null,"CO6",{"$f":"IFERROR((IF(ISNUMBER(SEARCH(\"6\", D$19)),D$121,\"0\")),\"0\")","v":83},{"$f":"IFERROR((IF(ISNUMBER(SEARCH(\"6\", E$19)),E$121,\"0\")),\"0\")","v":"0"},{"$f":"IFERROR(SUM($D174:INDIRECT($I174)),\"0\")","v":83},null,null,"E174",{"$f":"COUNTIF($D$20:INDIRECT($L174),\"*2*\")","v":0},5,"E20"]
[]
[null,null,1,{"$f":"IFERROR((IF(ISNUMBER(SEARCH(\"1\", D$20)),D$21/IF(LEN(D20)=16,6,IF(LEN(D20)=13,5,IF(LEN(D20)=10,4,IF(LEN(D20)=7,3,IF(LEN(D20)=4,2,1))))),\"0\")),\"0\")","v":"0"},{"$f":"IFERROR((IF(ISNUMBER(SEARCH(\"1\", E$20)),E$21/IF(LEN(E20)=16,6,IF(LEN(E20)=13,5,IF(LEN(E20)=10,4,IF(LEN(E20)=7,3,IF(LEN(E20)=4,2,1))))),\"0\")),\"0\")","v":"0"},{"$f":"IFERROR(SUM($D176:INDIRECT($I176)),\"0\")","v":0},null,null,{"$f":"SUBSTITUTE(ADDRESS(1,K176,4),1,\"\")&ROW($I176)","v":"E176"},{"$f":"COUNTIF($D$20:INDIRECT($L176),\"1\")","v":0},{"$f":"COLUMN($F$18)-1","v":5},{"$f":"SUBSTITUTE(ADDRESS(1,K176,4),1,\"\")&ROW($I$19)+1","v":"E20"}]
[null,null,2,{"$f":"IFERROR((IF(ISNUMBER(SEARCH(\"2\", D$20)),D$21/IF(LEN(D20)=16,6,IF(LEN(D20)=13,5,IF(LEN(D20)=10,4,IF(LEN(D20)=7,3,IF(LEN(D20)=4,2,1))))),\"0\")),\"0\")","v":"0"},{"$f":"IFERROR((IF(ISNUMBER(SEARCH(\"2\", E$20)),E$21/IF(LEN(E20)=16,6,IF(LEN(E20)=13,5,IF(LEN(E20)=10,4,IF(LEN(E20)=7,3,IF(LEN(E20)=4,2,1))))),\"0\")),\"0\")","v":"0"},{"$f":"IFERROR(SUM($D177:INDIRECT($I177)),\"0\")","v":0},null,null,{"$f":"SUBSTITUTE(ADDRESS(1,K177,4),1,\"\")&ROW($I177)","v":"E177"},{"$f":"COUNTIF($D$20:INDIRECT($L177),\"2\")","v":0},{"$f":"COLUMN($F$18)-1","v":5},{"$f":"SUBSTITUTE(ADDRESS(1,K177,4),1,\"\")&ROW($I$19)+1","v":"E20"}]
[null,null,3,{"$f":"IFERROR((IF(ISNUMBER(SEARCH(\"3\", D$20)),D$21/IF(LEN(D20)=16,6,IF(LEN(D20)=13,5,IF(LEN(D20)=10,4,IF(LEN(D20)=7,3,IF(LEN(D20)=4,2,1))))),\"0\")),\"0\")","v":"0"},{"$f":"IFERROR((IF(ISNUMBER(SEARCH(\"3\", E$20)),E$21/IF(LEN(E20)=16,6,IF(LEN(E20)=13,5,IF(LEN(E20)=10,4,IF(LEN(E20)=7,3,IF(LEN(E20)=4,2,1))))),\"0\")),\"0\")","v":"0"},{"$f":"IFERROR(SUM($D178:INDIRECT($I178)),\"0\")","v":0},null,null,"E178",{"$f":"COUNTIF($D$20:INDIRECT($L178),\"3\")","v":0},5,"E20"]
[null,null,4,{"$f":"IFERROR((IF(ISNUMBER(SEARCH(\"4\", D$20)),D$21/IF(LEN(D20)=16,6,IF(LEN(D20)=13,5,IF(LEN(D20)=10,4,IF(LEN(D20)=7,3,IF(LEN(D20)=4,2,1))))),\"0\")),\"0\")","v":2.5},{"$f":"IFERROR((IF(ISNUMBER(SEARCH(\"4\", E$20)),E$21/IF(LEN(E20)=16,6,IF(LEN(E20)=13,5,IF(LEN(E20)=10,4,IF(LEN(E20)=7,3,IF(LEN(E20)=4,2,1))))),\"0\")),\"0\")","v":"0"},{"$f":"IFERROR(SUM($D179:INDIRECT($I179)),\"0\")","v":2.5},null,null,"E179",{"$f":"COUNTIF($D$20:INDIRECT($L179),\"4\")","v":0},5,"E20"]
[null,null,5,{"$f":"IFERROR((IF(ISNUMBER(SEARCH(\"5\", D$20)),D$21/IF(LEN(D20)=16,6,IF(LEN(D20)=13,5,IF(LEN(D20)=10,4,IF(LEN(D20)=7,3,IF(LEN(D20)=4,2,1))))),\"0\")),\"0\")","v":2.5},{"$f":"IFERROR((IF(ISNUMBER(SEARCH(\"5\", E$20)),E$21/IF(LEN(E20)=16,6,IF(LEN(E20)=13,5,IF(LEN(E20)=10,4,IF(LEN(E20)=7,3,IF(LEN(E20)=4,2,1))))),\"0\")),\"0\")","v":2.5},{"$f":"IFERROR(SUM($D180:INDIRECT($I180)),\"0\")","v":5},null,null,"E180",{"$f":"COUNTIF($D$20:INDIRECT($L180),\"5\")","v":0},5,"E20"]
[null,null,6,{"$f":"IFERROR((IF(ISNUMBER(SEARCH(\"6\", D$20)),D$21/IF(LEN(D20)=16,6,IF(LEN(D20)=13,5,IF(LEN(D20)=10,4,IF(LEN(D20)=7,3,IF(LEN(D20)=4,2,1))))),\"0\")),\"0\")","v":"0"},{"$f":"IFERROR((IF(ISNUMBER(SEARCH(\"6\", E$20)),E$21/IF(LEN(E20)=16,6,IF(LEN(E20)=13,5,IF(LEN(E20)=10,4,IF(LEN(E20)=7,3,IF(LEN(E20)=4,2,1))))),\"0\")),\"0\")","v":2.5},{"$f":"IFERROR(SUM($D181:INDIRECT($I181)),\"0\")","v":2.5},null,null,"E181",{"$f":"COUNTIF($D$20:INDIRECT($L181),\"6\")","v":0},5,"E20"]

{"sheet":"A2_Analysis","index":11,"n_rows":131,"n_cols":5,"rows_kept":131,"cut":false,"hidden":false,"merged":[[2,0,2,3],[4,0,4,3],[6,0,6,3],[8,0,8,3]]}
[]
[]
[{"$f":"Data_Sheet!A2","v":"Jyothi Engineering College, Cheruthuruthy"}]
[]
[{"$f":"Data_Sheet!A4","v":"Department of Computer Science Engineering"}]
[]
[{"$f":"'A2'!A11:F11","v":"CO Analysis - Internal Marks : Assignment - 2                       21-03-18"}]
[]
[{"$f":"Data_Sheet!A17","v":"S3 CS              CS203 Switching Theory and Logic Design               2019-20"}]
[]
[]
[]
[]
[]
[]
[]
[]
[]
[]
[]
[]
[{"$f":"'T1'!A18","v":"Register No."},{"$f":"'T1'!B18","v":"Name of Student"},{"$f":"'A2'!F18","v":"Total Marks (10)"},"Category"]
[]
["Column1","Column2","Column3","Column4"]
[{"$f":"Data_Sheet!A25","v":"JEC18CS001"},{"$f":"Data_Sheet!B25","v":"ABHISHEK KRISHNAN MENON E"},{"$f":"'A2'!F25","v":10},{"$f":"IF(C25=\"A\",\"ABSENT\",IF(C25>='A2'!$E$5*$E$124/100,\"EXCELLENT\",IF(C25>='A2'!$E$5*$E$123/100,\"GOOD\",IF(C25>='A2'!$E$5*$E$122/100,\"AVERAGE\",\"POOR\"))))","v":"EXCELLENT"}]
[{"$f":"Data_Sheet!A26","v":"JEC18CS002"},{"$f":"Data_Sheet!B26","v":"ABHISHEK SAJEEVAN"},{"$f":"'A2'!F26","v":5},{"$f":"IF(C26=\"A\",\"ABSENT\",IF(C26>='A2'!$E$5*$E$124/100,\"EXCELLENT\",IF(C26>='A2'!$E$5*$E$123/100,\"GOOD\",IF(C26>='A2'!$E$5*$E$122/100,\"AVERAGE\",\"POOR\"))))","v":"AVERAGE"}]
[{"$f":"Data_Sheet!A27","v":"JEC18CS003"},{"$f":"Data_Sheet!B27","v":"ABHITH SHAJI"},{"$f":"'A2'!F27","v":9},{"$f":"IF(C27=\"A\",\"ABSENT\",IF(C27>='A2'!$E$5*$E$124/100,\"EXCELLENT\",IF(C27>='A2'!$E$5*$E$123/100,\"GOOD\",IF(C27>='A2'!$E$5*$E$122/100,\"AVERAGE\",\"POOR\"))))","v":"EXCELLENT"}]
[{"$f":"Data_Sheet!A28","v":"JEC18CS004"},{"$f":"Data_Sheet!B28","v":"ABIN SANTHOSH ALAPATT"},{"$f":"'A2'!F28","v":10},{"$f":"IF(C28=\"A\",\"ABSENT\",IF(C28>='A2'!$E$5*$E$124/100,\"EXCELLENT\",IF(C28>='A2'!$E$5*$E$123/100,\"GOOD\",IF(C28>='A2'!$E$5*$E$122/100,\"AVERAGE\",\"POOR\"))))","v":"EXCELLENT"}]
[{"$f":"Data_Sheet!A29","v":"JEC18CS005"},{"$f":"Data_Sheet!B29","v":"ADARSH KUMAR M A"},{"$f":"'A2'!F29","v":10},{"$f":"IF(C29=\"A\",\"ABSENT\",IF(C29>='A2'!$E$5*$E$124/100,\"EXCELLENT\",IF(C29>='A2'!$E$5*$E$123/100,\"GOOD\",IF(C29>='A2'!$E$5*$E$122/100,\"AVERAGE\",\"POOR\"))))","v":"EXCELLENT"}]
[{"$f":"Data_Sheet!A30","v":"JEC18CS006"},{"$f":"Data_Sheet!B30","v":"ADHITHYA KRISHNA S"},{"$f":"'A2'!F30","v":9},{"$f":"IF(C30=\"A\",\"ABSENT\",IF(C30>='A2'!$E$5*$E$124/100,\"EXCELLENT\",IF(C30>='A2'!$E$5*$E$123/100,\"GOOD\",IF(C30>='A2'!$E$5*$E$122/100,\"AVERAGE\",\"POOR\"))))","v":"EXCELLENT"}]
[{"$f":"Data_Sheet!A31","v":"JEC18CS007"},{"$f":"Data_Sheet!B31","v":"ADITHYA HARIDAS"},{"$f":"'A2'!F31","v":10},{"$f":"IF(C31=\"A\",\"ABSENT\",IF(C31>='A2'!$E$5*$E$124/100,\"EXCELLENT\",IF(C31>='A2'!$E$5*$E$123/100,\"GOOD\",IF(C31>='A2'!$E$5*$E$122/100,\"AVERAGE\",\"POOR\"))))","v":"EXCELLENT"}]
[{"$f":"Data_Sheet!A32","v":"JEC18CS008"},{"$f":"Data_Sheet!B32","v":"AJMAL BASHEER"},{"$f":"'A2'!F32","v":5},{"$f":"IF(C32=\"A\",\"ABSENT\",IF(C32>='A2'!$E$5*$E$124/100,\"EXCELLENT\",IF(C32>='A2'!$E$5*$E$123/100,\"GOOD\",IF(C32>='A2'!$E$5*$E$122/100,\"AVERAGE\",\"POOR\"))))","v":"AVERAGE"}]
[{"$f":"Data_Sheet!A33","v":"JEC18CS009"},{"$f":"Data_Sheet!B33","v":"AKASH.V"},{"$f":"'A2'!F33","v":9},{"$f":"IF(C33=\"A\",\"ABSENT\",IF(C33>='A2'!$E$5*$E$124/100,\"EXCELLENT\",IF(C33>='A2'!$E$5*$E$123/100,\"GOOD\",IF(C33>='A2'!$E$5*$E$122/100,\"AVERAGE\",\"POOR\"))))","v":"EXCELLENT"}]
[{"$f":"Data_Sheet!A34","v":"JEC18CS010"},{"$f":"Data_Sheet!B34","v":"AKHIL AZEEZ UPPILAMKUNNATH"},{"$f":"'A2'!F34","v":10},{"$f":"IF(C34=\"A\",\"ABSENT\",IF(C34>='A2'!$E$5*$E$124/100,\"EXCELLENT\",IF(C34>='A2'!$E$5*$E$123/100,\"GOOD\",IF(C34>='A2'!$E$5*$E$122/100,\"AVERAGE\",\"POOR\"))))","v":"EXCELLENT"}]
[{"$f":"Data_Sheet!A35","v":"JEC18CS011"},{"$f":"Data_Sheet!B35","v":"AKHIL KRISHNA UK"},{"$f":"'A2'!F35","v":9},{"$f":"IF(C35=\"A\",\"ABSENT\",IF(C35>='A2'!$E$5*$E$124/100,\"EXCELLENT\",IF(C35>='A2'!$E$5*$E$123/100,\"GOOD\",IF(C35>='A2'!$E$5*$E$122/100,\"AVERAGE\",\"POOR\"))))","v":"EXCELLENT"}]
[{"$f":"Data_Sheet!A36","v":"JEC18CS012"},{"$f":"Data_Sheet!B36","v":"ALAN GEORGE"},{"$f":"'A2'!F36","v":10},{"$f":"IF(C36=\"A\",\"ABSENT\",IF(C36>='A2'!$E$5*$E$124/100,\"EXCELLENT\",IF(C36>='A2'!$E$5*$E$123/100,\"GOOD\",IF(C36>='A2'!$E$5*$E$122/100,\"AVERAGE\",\"POOR\"))))","v":"EXCELLENT"}]
[{"$f":"Data_Sheet!A37","v":"JEC18CS013"},{"$f":"Data_Sheet!B37","v":"ALEN VARGHESE"},{"$f":"'A2'!F37","v":10},{"$f":"IF(C37=\"A\",\"ABSENT\",IF(C37>='A2'!$E$5*$E$124/100,\"EXCELLENT\",IF(C37>='A2'!$E$5*$E$123/100,\"GOOD\",IF(C37>='A2'!$E$5*$E$122/100,\"AVERAGE\",\"POOR\"))))","v":"EXCELLENT"}]
[{"$f":"Data_Sheet!A38","v":"JEC18CS014"},{"$f":"Data_Sheet!B38","v":"AMAL SEBASTIAN"},{"$f":"'A2'!F38","v":10},{"$f":"IF(C38=\"A\",\"ABSENT\",IF(C38>='A2'!$E$5*$E$124/100,\"EXCELLENT\",IF(C38>='A2'!$E$5*$E$123/100,\"GOOD\",IF(C38>='A2'!$E$5*$E$122/100,\"AVERAGE\",\"POOR\"))))","v":"EXCELLENT"}]
[{"$f":"Data_Sheet!A39","v":"JEC18CS015"},{"$f":"Data_Sheet!B39","v":"AMAL SONY"},{"$f":"'A2'!F39","v":8},{"$f":"IF(C39=\"A\",\"ABSENT\",IF(C39>='A2'!$E$5*$E$124/100,\"EXCELLENT\",IF(C39>='A2'!$E$5*$E$123/100,\"GOOD\",IF(C39>='A2'!$E$5*$E$122/100,\"AVERAGE\",\"POOR\"))))","v":"EXCELLENT"}]
[{"$f":"Data_Sheet!A40","v":"JEC18CS016"},{"$f":"Data_Sheet!B40","v":"ANAGHA WILSON"},{"$f":"'A2'!F40","v":10},{"$f":"IF(C40=\"A\",\"ABSENT\",IF(C40>='A2'!$E$5*$E$124/100,\"EXCELLENT\",IF(C40>='A2'!$E$5*$E$123/100,\"GOOD\",IF(C40>='A2'!$E$5*$E$122/100,\"AVERAGE\",\"POOR\"))))","v":"EXCELLENT"}]
[{"$f":"Data_Sheet!A41","v":"JEC18CS017"},{"$f":"Data_Sheet!B41","v":"ANETTE ANTO"},{"$f":"'A2'!F41","v":10},{"$f":"IF(C41=\"A\",\"ABSENT\",IF(C41>='A2'!$E$5*$E$124/100,\"EXCELLENT\",IF(C41>='A2'!$E$5*$E$123/100,\"GOOD\",IF(C41>='A2'!$E$5*$E$122/100,\"AVERAGE\",\"POOR\"))))","v":"EXCELLENT"}]
[{"$f":"Data_Sheet!A42","v":"JEC18CS018"},{"$f":"Data_Sheet!B42","v":"ANIT MARY THOMAS"},{"$f":"'A2'!F42","v":10},{"$f":"IF(C42=\"A\",\"ABSENT\",IF(C42>='A2'!$E$5*$E$124/100,\"EXCELLENT\",IF(C42>='A2'!$E$5*$E$123/100,\"GOOD\",IF(C42>='A2'!$E$5*$E$122/100,\"AVERAGE\",\"POOR\"))))","v":"EXCELLENT"}]
[{"$f":"Data_Sheet!A43","v":"JEC18CS020"},{"$f":"Data_Sheet!B43","v":"ANN THERESA SHAJI"},{"$f":"'A2'!F43","v":10},{"$f":"IF(C43=\"A\",\"ABSENT\",IF(C43>='A2'!$E$5*$E$124/100,\"EXCELLENT\",IF(C43>='A2'!$E$5*$E$123/100,\"GOOD\",IF(C43>='A2'!$E$5*$E$122/100,\"AVERAGE\",\"POOR\"))))","v":"EXCELLENT"}]
[{"$f":"Data_Sheet!A44","v":"JEC18CS021"},{"$f":"Data_Sheet!B44","v":"ANTONY ROY"},{"$f":"'A2'!F44","v":9},{"$f":"IF(C44=\"A\",\"ABSENT\",IF(C44>='A2'!$E$5*$E$124/100,\"EXCELLENT\",IF(C44>='A2'!$E$5*$E$123/100,\"GOOD\",IF(C44>='A2'!$E$5*$E$122/100,\"AVERAGE\",\"POOR\"))))","v":"EXCELLENT"}]
[{"$f":"Data_Sheet!A45","v":"JEC18CS022"},{"$f":"Data_Sheet!B45","v":"ANUGRAHA C"},{"$f":"'A2'!F45","v":10},{"$f":"IF(C45=\"A\",\"ABSENT\",IF(C45>='A2'!$E$5*$E$124/100,\"EXCELLENT\",IF(C45>='A2'!$E$5*$E$123/100,\"GOOD\",IF(C45>='A2'!$E$5*$E$122/100,\"AVERAGE\",\"POOR\"))))","v":"EXCELLENT"}]
[{"$f":"Data_Sheet!A46","v":"JEC18CS023"},{"$f":"Data_Sheet!B46","v":"APARNA.V"},{"$f":"'A2'!F46","v":10},{"$f":"IF(C46=\"A\",\"ABSENT\",IF(C46>='A2'!$E$5*$E$124/100,\"EXCELLENT\",IF(C46>='A2'!$E$5*$E$123/100,\"GOOD\",IF(C46>='A2'!$E$5*$E$122/100,\"AVERAGE\",\"POOR\"))))","v":"EXCELLENT"}]
[{"$f":"Data_Sheet!A47","v":"JEC18CS024"},{"$f":"Data_Sheet!B47","v":"ARAVIND S KUMAR"},{"$f":"'A2'!F47","v":10},{"$f":"IF(C47=\"A\",\"ABSENT\",IF(C47>='A2'!$E$5*$E$124/100,\"EXCELLENT\",IF(C47>='A2'!$E$5*$E$123/100,\"GOOD\",IF(C47>='A2'!$E$5*$E$122/100,\"AVERAGE\",\"POOR\"))))","v":"EXCELLENT"}]
[{"$f":"Data_Sheet!A48","v":"JEC18CS025"},{"$f":"Data_Sheet!B48","v":"ARJUN VINOD"},{"$f":"'A2'!F48","v":5},{"$f":"IF(C48=\"A\",\"ABSENT\",IF(C48>='A2'!$E$5*$E$124/100,\"EXCELLENT\",IF(C48>='A2'!$E$5*$E$123/100,\"GOOD\",IF(C48>='A2'!$E$5*$E$122/100,\"AVERAGE\",\"POOR\"))))","v":"AVERAGE"}]
[{"$f":"Data_Sheet!A49","v":"JEC18CS026"},{"$f":"Data_Sheet!B49","v":"ARUN VG"},{"$f":"'A2'!F49","v":10},{"$f":"IF(C49=\"A\",\"ABSENT\",IF(C49>='A2'!$E$5*$E$124/100,\"EXCELLENT\",IF(C49>='A2'!$E$5*$E$123/100,\"GOOD\",IF(C49>='A2'!$E$5*$E$122/100,\"AVERAGE\",\"POOR\"))))","v":"EXCELLENT"}]
[{"$f":"Data_Sheet!A50","v":"JEC18CS027"},{"$f":"Data_Sheet!B50","v":"ASHRUL K"},{"$f":"'A2'!F50","v":10},{"$f":"IF(C50=\"A\",\"ABSENT\",IF(C50>='A2'!$E$5*$E$124/100,\"EXCELLENT\",IF(C50>='A2'!$E$5*$E$123/100,\"GOOD\",IF(C50>='A2'!$E$5*$E$122/100,\"AVERAGE\",\"POOR\"))))","v":"EXCELLENT"}]
[{"$f":"Data_Sheet!A51","v":"JEC18CS028"},{"$f":"Data_Sheet!B51","v":"ATHIL PAULY"},{"$f":"'A2'!F51","v":9},{"$f":"IF(C51=\"A\",\"ABSENT\",IF(C51>='A2'!$E$5*$E$124/100,\"EXCELLENT\",IF(C51>='A2'!$E$5*$E$123/100,\"GOOD\",IF(C51>='A2'!$E$5*$E$122/100,\"AVERAGE\",\"POOR\"))))","v":"EXCELLENT"}]
[{"$f":"Data_Sheet!A52","v":"JEC18CS029"},{"$f":"Data_Sheet!B52","v":"ATHIRA K P"},{"$f":"'A2'!F52","v":10},{"$f":"IF(C52=\"A\",\"ABSENT\",IF(C52>='A2'!$E$5*$E$124/100,\"EXCELLENT\",IF(C52>='A2'!$E$5*$E$123/100,\"GOOD\",IF(C52>='A2'!$E$5*$E$122/100,\"AVERAGE\",\"POOR\"))))","v":"EXCELLENT"}]
[{"$f":"Data_Sheet!A53","v":"JEC18CS030"},{"$f":"Data_Sheet!B53","v":"AWIN ANTO"},{"$f":"'A2'!F53","v":10},{"$f":"IF(C53=\"A\",\"ABSENT\",IF(C53>='A2'!$E$5*$E$124/100,\"EXCELLENT\",IF(C53>='A2'!$E$5*$E$123/100,\"GOOD\",IF(C53>='A2'!$E$5*$E$122/100,\"AVERAGE\",\"POOR\"))))","v":"EXCELLENT"}]
[{"$f":"Data_Sheet!A54","v":"JEC18CS031"},{"$f":"Data_Sheet!B54","v":"CHARLES JOHNSON"},{"$f":"'A2'!F54","v":9},{"$f":"IF(C54=\"A\",\"ABSENT\",IF(C54>='A2'!$E$5*$E$124/100,\"EXCELLENT\",IF(C54>='A2'!$E$5*$E$123/100,\"GOOD\",IF(C54>='A2'!$E$5*$E$122/100,\"AVERAGE\",\"POOR\"))))","v":"EXCELLENT"}]
[{"$f":"Data_Sheet!A55","v":"JEC18CS032"},{"$f":"Data_Sheet!B55","v":"CHITTILAPPILLY JOVIA JOHNSON"},{"$f":"'A2'!F55","v":10},{"$f":"IF(C55=\"A\",\"ABSENT\",IF(C55>='A2'!$E$5*$E$124/100,\"EXCELLENT\",IF(C55>='A2'!$E$5*$E$123/100,\"GOOD\",IF(C55>='A2'!$E$5*$E$122/100,\"AVERAGE\",\"POOR\"))))","v":"EXCELLENT"}]
[{"$f":"Data_Sheet!A56","v":"JEC18CS033"},{"$f":"Data_Sheet!B56","v":"CIYA BABU"},{"$f":"'A2'!F56","v":10},{"$f":"IF(C56=\"A\",\"ABSENT\",IF(C56>='A2'!$E$5*$E$124/100,\"EXCELLENT\",IF(C56>='A2'!$E$5*$E$123/100,\"GOOD\",IF(C56>='A2'!$E$5*$E$122/100,\"AVERAGE\",\"POOR\"))))","v":"EXCELLENT"}]
[{"$f":"Data_Sheet!A57","v":"JEC18CS034"},{"$f":"Data_Sheet!B57","v":"DAVID SALUS"},{"$f":"'A2'!F57","v":10},{"$f":"IF(C57=\"A\",\"ABSENT\",IF(C57>='A2'!$E$5*$E$124/100,\"EXCELLENT\",IF(C57>='A2'!$E$5*$E$123/100,\"GOOD\",IF(C57>='A2'!$E$5*$E$122/100,\"AVERAGE\",\"POOR\"))))","v":"EXCELLENT"}]
[{"$f":"Data_Sheet!A58","v":"JEC18CS035"},{"$f":"Data_Sheet!B58","v":"DELICIA REJI"},{"$f":"'A2'!F58","v":10},{"$f":"IF(C58=\"A\",\"ABSENT\",IF(C58>='A2'!$E$5*$E$124/100,\"EXCELLENT\",IF(C58>='A2'!$E$5*$E$123/100,\"GOOD\",IF(C58>='A2'!$E$5*$E$122/100,\"AVERAGE\",\"POOR\"))))","v":"EXCELLENT"}]
[{"$f":"Data_Sheet!A59","v":"JEC18CS036"},{"$f":"Data_Sheet!B59","v":"DELMA SHAJAN"},{"$f":"'A2'!F59","v":10},{"$f":"IF(C59=\"A\",\"ABSENT\",IF(C59>='A2'!$E$5*$E$124/100,\"EXCELLENT\",IF(C59>='A2'!$E$5*$E$123/100,\"GOOD\",IF(C59>='A2'!$E$5*$E$122/100,\"AVERAGE\",\"POOR\"))))","v":"EXCELLENT"}]
[{"$f":"Data_Sheet!A60","v":"JEC18CS037"},{"$f":"Data_Sheet!B60","v":"DILBER SHA AP"},{"$f":"'A2'!F60","v":9},{"$f":"IF(C60=\"A\",\"ABSENT\",IF(C60>='A2'!$E$5*$E$124/100,\"EXCELLENT\",IF(C60>='A2'!$E$5*$E$123/100,\"GOOD\",IF(C60>='A2'!$E$5*$E$122/100,\"AVERAGE\",\"POOR\"))))","v":"EXCELLENT"}]
[{"$f":"Data_Sheet!A61","v":"JEC18CS038"},{"$f":"Data_Sheet!B61","v":"EDWIN T JOY"},{"$f":"'A2'!F61","v":9},{"$f":"IF(C61=\"A\",\"ABSENT\",IF(C61>='A2'!$E$5*$E$124/100,\"EXCELLENT\",IF(C61>='A2'!$E$5*$E$123/100,\"GOOD\",IF(C61>='A2'!$E$5*$E$122/100,\"AVERAGE\",\"POOR\"))))","v":"EXCELLENT"}]
[{"$f":"Data_Sheet!A62","v":"JEC18CS039"},{"$f":"Data_Sheet!B62","v":"EDWIN WILSON"},{"$f":"'A2'!F62","v":9},{"$f":"IF(C62=\"A\",\"ABSENT\",IF(C62>='A2'!$E$5*$E$124/100,\"EXCELLENT\",IF(C62>='A2'!$E$5*$E$123/100,\"GOOD\",IF(C62>='A2'!$E$5*$E$122/100,\"AVERAGE\",\"POOR\"))))","v":"EXCELLENT"}]
[{"$f":"Data_Sheet!A63","v":"JEC18CS040"},{"$f":"Data_Sheet!B63","v":"EMMANUEL SHIBU"},{"$f":"'A2'!F63","v":10},{"$f":"IF(C63=\"A\",\"ABSENT\",IF(C63>='A2'!$E$5*$E$124/100,\"EXCELLENT\",IF(C63>='A2'!$E$5*$E$123/100,\"GOOD\",IF(C63>='A2'!$E$5*$E$122/100,\"AVERAGE\",\"POOR\"))))","v":"EXCELLENT"}]
[{"$f":"Data_Sheet!A64","v":"JEC18CS041"},{"$f":"Data_Sheet!B64","v":"GAYATHRI DINESH"},{"$f":"'A2'!F64","v":10},{"$f":"IF(C64=\"A\",\"ABSENT\",IF(C64>='A2'!$E$5*$E$124/100,\"EXCELLENT\",IF(C64>='A2'!$E$5*$E$123/100,\"GOOD\",IF(C64>='A2'!$E$5*$E$122/100,\"AVERAGE\",\"POOR\"))))","v":"EXCELLENT"}]
[{"$f":"Data_Sheet!A65","v":"JEC18CS042"},{"$f":"Data_Sheet!B65","v":"GOKUL DAS M"},{"$f":"'A2'!F65","v":10},{"$f":"IF(C65=\"A\",\"ABSENT\",IF(C65>='A2'!$E$5*$E$124/100,\"EXCELLENT\",IF(C65>='A2'!$E$5*$E$123/100,\"GOOD\",IF(C65>='A2'!$E$5*$E$122/100,\"AVERAGE\",\"POOR\"))))","v":"EXCELLENT"}]
[{"$f":"Data_Sheet!A66","v":"JEC18CS043"},{"$f":"Data_Sheet!B66","v":"G RAMGOPAL"},{"$f":"'A2'!F66","v":10},{"$f":"IF(C66=\"A\",\"ABSENT\",IF(C66>='A2'!$E$5*$E$124/100,\"EXCELLENT\",IF(C66>='A2'!$E$5*$E$123/100,\"GOOD\",IF(C66>='A2'!$E$5*$E$122/100,\"AVERAGE\",\"POOR\"))))","v":"EXCELLENT"}]
[{"$f":"Data_Sheet!A67","v":"JEC18CS044"},{"$f":"Data_Sheet!B67","v":"HARIES DAVIS"},{"$f":"'A2'!F67","v":10},{"$f":"IF(C67=\"A\",\"ABSENT\",IF(C67>='A2'!$E$5*$E$124/100,\"EXCELLENT\",IF(C67>='A2'!$E$5*$E$123/100,\"GOOD\",IF(C67>='A2'!$E$5*$E$122/100,\"AVERAGE\",\"POOR\"))))","v":"EXCELLENT"}]
[{"$f":"Data_Sheet!A68","v":"JEC18CS045"},{"$f":"Data_Sheet!B68","v":"HARISANKER P"},{"$f":"'A2'!F68","v":10},{"$f":"IF(C68=\"A\",\"ABSENT\",IF(C68>='A2'!$E$5*$E$124/100,\"EXCELLENT\",IF(C68>='A2'!$E$5*$E$123/100,\"GOOD\",IF(C68>='A2'!$E$5*$E$122/100,\"AVERAGE\",\"POOR\"))))","v":"EXCELLENT"}]
[{"$f":"Data_Sheet!A69","v":"JEC18CS046"},{"$f":"Data_Sheet!B69","v":"HARSHA.K.S."},{"$f":"'A2'!F69","v":10},{"$f":"IF(C69=\"A\",\"ABSENT\",IF(C69>='A2'!$E$5*$E$124/100,\"EXCELLENT\",IF(C69>='A2'!$E$5*$E$123/100,\"GOOD\",IF(C69>='A2'!$E$5*$E$122/100,\"AVERAGE\",\"POOR\"))))","v":"EXCELLENT"}]
[{"$f":"Data_Sheet!A70","v":"JEC18CS047"},{"$f":"Data_Sheet!B70","v":"HELNA THOMAS"},{"$f":"'A2'!F70","v":10},{"$f":"IF(C70=\"A\",\"ABSENT\",IF(C70>='A2'!$E$5*$E$124/100,\"EXCELLENT\",IF(C70>='A2'!$E$5*$E$123/100,\"GOOD\",IF(C70>='A2'!$E$5*$E$122/100,\"AVERAGE\",\"POOR\"))))","v":"EXCELLENT"}]
[{"$f":"Data_Sheet!A71","v":"JEC18CS048"},{"$f":"Data_Sheet!B71","v":"HRIDI KRISHNA.H"},{"$f":"'A2'!F71","v":10},{"$f":"IF(C71=\"A\",\"ABSENT\",IF(C71>='A2'!$E$5*$E$124/100,\"EXCELLENT\",IF(C71>='A2'!$E$5*$E$123/100,\"GOOD\",IF(C71>='A2'!$E$5*$E$122/100,\"AVERAGE\",\"POOR\"))))","v":"EXCELLENT"}]
[{"$f":"Data_Sheet!A72","v":"JEC18CS049"},{"$f":"Data_Sheet!B72","v":"INDRAJIT R"},{"$f":"'A2'!F72","v":8},{"$f":"IF(C72=\"A\",\"ABSENT\",IF(C72>='A2'!$E$5*$E$124/100,\"EXCELLENT\",IF(C72>='A2'!$E$5*$E$123/100,\"GOOD\",IF(C72>='A2'!$E$5*$E$122/100,\"AVERAGE\",\"POOR\"))))","v":"EXCELLENT"}]
[{"$f":"Data_Sheet!A73","v":"JEC18CS050"},{"$f":"Data_Sheet!B73","v":"JESWIN JOJY"},{"$f":"'A2'!F73","v":8},{"$f":"IF(C73=\"A\",\"ABSENT\",IF(C73>='A2'!$E$5*$E$124/100,\"EXCELLENT\",IF(C73>='A2'!$E$5*$E$123/100,\"GOOD\",IF(C73>='A2'!$E$5*$E$122/100,\"AVERAGE\",\"POOR\"))))","v":"EXCELLENT"}]
[{"$f":"Data_Sheet!A74","v":"JEC18CS051"},{"$f":"Data_Sheet!B74","v":"JIBIN A BABU"},{"$f":"'A2'!F74","v":10},{"$f":"IF(C74=\"A\",\"ABSENT\",IF(C74>='A2'!$E$5*$E$124/100,\"EXCELLENT\",IF(C74>='A2'!$E$5*$E$123/100,\"GOOD\",IF(C74>='A2'!$E$5*$E$122/100,\"AVERAGE\",\"POOR\"))))","v":"EXCELLENT"}]
[{"$f":"Data_Sheet!A75","v":"JEC18CS052"},{"$f":"Data_Sheet!B75","v":"JISSY JOY"},{"$f":"'A2'!F75","v":10},{"$f":"IF(C75=\"A\",\"ABSENT\",IF(C75>='A2'!$E$5*$E$124/100,\"EXCELLENT\",IF(C75>='A2'!$E$5*$E$123/100,\"GOOD\",IF(C75>='A2'!$E$5*$E$122/100,\"AVERAGE\",\"POOR\"))))","v":"EXCELLENT"}]
[{"$f":"Data_Sheet!A76","v":"JEC18CS053"},{"$f":"Data_Sheet!B76","v":"JOEL JAMES KARIKKANDATHIL"},{"$f":"'A2'!F76","v":10},{"$f":"IF(C76=\"A\",\"ABSENT\",IF(C76>='A2'!$E$5*$E$124/100,\"EXCELLENT\",IF(C76>='A2'!$E$5*$E$123/100,\"GOOD\",IF(C76>='A2'!$E$5*$E$122/100,\"AVERAGE\",\"POOR\"))))","v":"EXCELLENT"}]
[{"$f":"Data_Sheet!A77","v":"JEC18CS054"},{"$f":"Data_Sheet!B77","v":"JOSE REJI KARIMADATHI"},{"$f":"'A2'!F77","v":8},{"$f":"IF(C77=\"A\",\"ABSENT\",IF(C77>='A2'!$E$5*$E$124/100,\"EXCELLENT\",IF(C77>='A2'!$E$5*$E$123/100,\"GOOD\",IF(C77>='A2'!$E$5*$E$122/100,\"AVERAGE\",\"POOR\"))))","v":"EXCELLENT"}]
[{"$f":"Data_Sheet!A78","v":"JEC18CS055"},{"$f":"Data_Sheet!B78","v":"JUMANA HASIN"},{"$f":"'A2'!F78","v":10},{"$f":"IF(C78=\"A\",\"ABSENT\",IF(C78>='A2'!$E$5*$E$124/100,\"EXCELLENT\",IF(C78>='A2'!$E$5*$E$123/100,\"GOOD\",IF(C78>='A2'!$E$5*$E$122/100,\"AVERAGE\",\"POOR\"))))","v":"EXCELLENT"}]
[{"$f":"Data_Sheet!A79","v":"JEC18CS056"},{"$f":"Data_Sheet!B79","v":"KAILASHNATH"},{"$f":"'A2'!F79","v":9},{"$f":"IF(C79=\"A\",\"ABSENT\",IF(C79>='A2'!$E$5*$E$124/100,\"EXCELLENT\",IF(C79>='A2'!$E$5*$E$123/100,\"GOOD\",IF(C79>='A2'!$E$5*$E$122/100,\"AVERAGE\",\"POOR\"))))","v":"EXCELLENT"}]
[{"$f":"Data_Sheet!A80","v":"JEC18CS057"},{"$f":"Data_Sheet!B80","v":"K AJISHKUMAR"},{"$f":"'A2'!F80","v":9},{"$f":"IF(C80=\"A\",\"ABSENT\",IF(C80>='A2'!$E$5*$E$124/100,\"EXCELLENT\",IF(C80>='A2'!$E$5*$E$123/100,\"GOOD\",IF(C80>='A2'!$E$5*$E$122/100,\"AVERAGE\",\"POOR\"))))","v":"EXCELLENT"}]
[{"$f":"Data_Sheet!A81","v":"JEC18CS058"},{"$f":"Data_Sheet!B81","v":"KEERTHANA K S"},{"$f":"'A2'!F81","v":9},{"$f":"IF(C81=\"A\",\"ABSENT\",IF(C81>='A2'!$E$5*$E$124/100,\"EXCELLENT\",IF(C81>='A2'!$E$5*$E$123/100,\"GOOD\",IF(C81>='A2'!$E$5*$E$122/100,\"AVERAGE\",\"POOR\"))))","v":"EXCELLENT"}]
[{"$f":"Data_Sheet!A82","v":"JEC18CS059"},{"$f":"Data_Sheet!B82","v":"KEVIN VARGHESE"},{"$f":"'A2'!F82","v":10},{"$f":"IF(C82=\"A\",\"ABSENT\",IF(C82>='A2'!$E$5*$E$124/100,\"EXCELLENT\",IF(C82>='A2'!$E$5*$E$123/100,\"GOOD\",IF(C82>='A2'!$E$5*$E$122/100,\"AVERAGE\",\"POOR\"))))","v":"EXCELLENT"}]
[{"$f":"Data_Sheet!A83","v":"JEC18CS060"},{"$f":"Data_Sheet!B83","v":"LAKSHMI SADANANDAN"},{"$f":"'A2'!F83","v":10},{"$f":"IF(C83=\"A\",\"ABSENT\",IF(C83>='A2'!$E$5*$E$124/100,\"EXCELLENT\",IF(C83>='A2'!$E$5*$E$123/100,\"GOOD\",IF(C83>='A2'!$E$5*$E$122/100,\"AVERAGE\",\"POOR\"))))","v":"EXCELLENT"}]
[{"$f":"Data_Sheet!A84","v":"JEC18CS061"},{"$f":"Data_Sheet!B84","v":"LEYA PALLAN"},{"$f":"'A2'!F84","v":10},{"$f":"IF(C84=\"A\",\"ABSENT\",IF(C84>='A2'!$E$5*$E$124/100,\"EXCELLENT\",IF(C84>='A2'!$E$5*$E$123/100,\"GOOD\",IF(C84>='A2'!$E$5*$E$122/100,\"AVERAGE\",\"POOR\"))))","v":"EXCELLENT"}]
[{"$f":"Data_Sheet!A85","v":"JEC18CS062"},{"$f":"Data_Sheet!B85","v":"MARVEL BABU"},{"$f":"'A2'!F85","v":9},{"$f":"IF(C85=\"A\",\"ABSENT\",IF(C85>='A2'!$E$5*$E$124/100,\"EXCELLENT\",IF(C85>='A2'!$E$5*$E$123/100,\"GOOD\",IF(C85>='A2'!$E$5*$E$122/100,\"AVERAGE\",\"POOR\"))))","v":"EXCELLENT"}]
[{"$f":"Data_Sheet!A86","v":"JEC18CS063"},{"$f":"Data_Sheet!B86","v":"MEDWIN PAUL"},{"$f":"'A2'!F86","v":5},{"$f":"IF(C86=\"A\",\"ABSENT\",IF(C86>='A2'!$E$5*$E$124/100,\"EXCELLENT\",IF(C86>='A2'!$E$5*$E$123/100,\"GOOD\",IF(C86>='A2'!$E$5*$E$122/100,\"AVERAGE\",\"POOR\"))))","v":"AVERAGE"}]
[{"$f":"Data_Sheet!A87","v":0},{"$f":"Data_Sheet!B87","v":0},{"$f":"'A2'!F87","v":0},{"$f":"IF(C87=\"A\",\"ABSENT\",IF(C87>='A2'!$E$5*$E$124/100,\"EXCELLENT\",IF(C87>='A2'!$E$5*$E$123/100,\"GOOD\",IF(C87>='A2'!$E$5*$E$122/100,\"AVERAGE\",\"POOR\"))))","v":"POOR"}]
[{"$f":"Data_Sheet!A88","v":0},{"$f":"Data_Sheet!B88","v":0},{"$f":"'A2'!F88","v":0},{"$f":"IF(C88=\"A\",\"ABSENT\",IF(C88>='A2'!$E$5*$E$124/100,\"EXCELLENT\",IF(C88>='A2'!$E$5*$E$123/100,\"GOOD\",IF(C88>='A2'!$E$5*$E$122/100,\"AVERAGE\",\"POOR\"))))","v":"POOR"}]
[{"$f":"Data_Sheet!A89","v":"JEC18CS066"},{"$f":"Data_Sheet!B89","v":"MUHAMMED INSHADH"},{"$f":"'A2'!F89","v":9},{"$f":"IF(C89=\"A\",\"ABSENT\",IF(C89>='A2'!$E$5*$E$124/100,\"EXCELLENT\",IF(C89>='A2'!$E$5*$E$123/100,\"GOOD\",IF(C89>='A2'!$E$5*$E$122/100,\"AVERAGE\",\"POOR\"))))","v":"EXCELLENT"}]
[{"$f":"Data_Sheet!A90","v":"JEC18CS067"},{"$f":"Data_Sheet!B90","v":"NAIR MIDHUN RAMACHANDRAN"},{"$f":"'A2'!F90","v":8},{"$f":"IF(C90=\"A\",\"ABSENT\",IF(C90>='A2'!$E$5*$E$124/100,\"EXCELLENT\",IF(C90>='A2'!$E$5*$E$123/100,\"GOOD\",IF(C90>='A2'!$E$5*$E$122/100,\"AVERAGE\",\"POOR\"))))","v":"EXCELLENT"}]
[{"$f":"Data_Sheet!A91","v":"JEC18CS068"},{"$f":"Data_Sheet!B91","v":"NAVEENA ANTONY"},{"$f":"'A2'!F91","v":10},{"$f":"IF(C91=\"A\",\"ABSENT\",IF(C91>='A2'!$E$5*$E$124/100,\"EXCELLENT\",IF(C91>='A2'!$E$5*$E$123/100,\"GOOD\",IF(C91>='A2'!$E$5*$E$122/100,\"AVERAGE\",\"POOR\"))))","v":"EXCELLENT"}]
[{"$f":"Data_Sheet!A92","v":"JEC18CS069"},{"$f":"Data_Sheet!B92","v":"NITIN MADHU"},{"$f":"'A2'!F92","v":8},{"$f":"IF(C92=\"A\",\"ABSENT\",IF(C92>='A2'!$E$5*$E$124/100,\"EXCELLENT\",IF(C92>='A2'!$E$5*$E$123/100,\"GOOD\",IF(C92>='A2'!$E$5*$E$122/100,\"AVERAGE\",\"POOR\"))))","v":"EXCELLENT"}]
[{"$f":"Data_Sheet!A93","v":"JEC18CS070"},{"$f":"Data_Sheet!B93","v":"PRATHIUSH ARUN"},{"$f":"'A2'!F93","v":10},{"$f":"IF(C93=\"A\",\"ABSENT\",IF(C93>='A2'!$E$5*$E$124/100,\"EXCELLENT\",IF(C93>='A2'!$E$5*$E$123/100,\"GOOD\",IF(C93>='A2'!$E$5*$E$122/100,\"AVERAGE\",\"POOR\"))))","v":"EXCELLENT"}]
[{"$f":"Data_Sheet!A94","v":"JEC18CS071"},{"$f":"Data_Sheet!B94","v":"RACHEL CECER"},{"$f":"'A2'!F94","v":10},{"$f":"IF(C94=\"A\",\"ABSENT\",IF(C94>='A2'!$E$5*$E$124/100,\"EXCELLENT\",IF(C94>='A2'!$E$5*$E$123/100,\"GOOD\",IF(C94>='A2'!$E$5*$E$122/100,\"AVERAGE\",\"POOR\"))))","v":"EXCELLENT"}]
[{"$f":"Data_Sheet!A95","v":"JEC18CS072"},{"$f":"Data_Sheet!B95","v":"RAHUL RAJU"},{"$f":"'A2'!F95","v":10},{"$f":"IF(C95=\"A\",\"ABSENT\",IF(C95>='A2'!$E$5*$E$124/100,\"EXCELLENT\",IF(C95>='A2'!$E$5*$E$123/100,\"GOOD\",IF(C95>='A2'!$E$5*$E$122/100,\"AVERAGE\",\"POOR\"))))","v":"EXCELLENT"}]
[{"$f":"Data_Sheet!A96","v":"JEC18CS073"},{"$f":"Data_Sheet!B96","v":"RAHUL T RAVI"},{"$f":"'A2'!F96","v":10},{"$f":"IF(C96=\"A\",\"ABSENT\",IF(C96>='A2'!$E$5*$E$124/100,\"EXCELLENT\",IF(C96>='A2'!$E$5*$E$123/100,\"GOOD\",IF(C96>='A2'!$E$5*$E$122/100,\"AVERAGE\",\"POOR\"))))","v":"EXCELLENT"}]
[{"$f":"Data_Sheet!A97","v":"JEC18CS074"},{"$f":"Data_Sheet!B97","v":"RAPHEAL K MOYALAN"},{"$f":"'A2'!F97","v":7},{"$f":"IF(C97=\"A\",\"ABSENT\",IF(C97>='A2'!$E$5*$E$124/100,\"EXCELLENT\",IF(C97>='A2'!$E$5*$E$123/100,\"GOOD\",IF(C97>='A2'!$E$5*$E$122/100,\"AVERAGE\",\"POOR\"))))","v":"GOOD"}]
[{"$f":"Data_Sheet!A98","v":"JEC18CS075"},{"$f":"Data_Sheet!B98","v":"RISHIKESH. V"},{"$f":"'A2'!F98","v":9},{"$f":"IF(C98=\"A\",\"ABSENT\",IF(C98>='A2'!$E$5*$E$124/100,\"EXCELLENT\",IF(C98>='A2'!$E$5*$E$123/100,\"GOOD\",IF(C98>='A2'!$E$5*$E$122/100,\"AVERAGE\",\"POOR\"))))","v":"EXCELLENT"}]
[{"$f":"Data_Sheet!A99","v":"JEC18CS076"},{"$f":"Data_Sheet!B99","v":"ROCKSON T. AUGUSTINE"},{"$f":"'A2'!F99","v":8},{"$f":"IF(C99=\"A\",\"ABSENT\",IF(C99>='A2'!$E$5*$E$124/100,\"EXCELLENT\",IF(C99>='A2'!$E$5*$E$123/100,\"GOOD\",IF(C99>='A2'!$E$5*$E$122/100,\"AVERAGE\",\"POOR\"))))","v":"EXCELLENT"}]
[{"$f":"Data_Sheet!A100","v":"JEC18CS077"},{"$f":"Data_Sheet!B100","v":"SARATH C P"},{"$f":"'A2'!F100","v":10},{"$f":"IF(C100=\"A\",\"ABSENT\",IF(C100>='A2'!$E$5*$E$124/100,\"EXCELLENT\",IF(C100>='A2'!$E$5*$E$123/100,\"GOOD\",IF(C100>='A2'!$E$5*$E$122/100,\"AVERAGE\",\"POOR\"))))","v":"EXCELLENT"}]
[{"$f":"Data_Sheet!A101","v":"JEC18CS078"},{"$f":"Data_Sheet!B101","v":"SARATH SASI"},{"$f":"'A2'!F101","v":8},{"$f":"IF(C101=\"A\",\"ABSENT\",IF(C101>='A2'!$E$5*$E$124/100,\"EXCELLENT\",IF(C101>='A2'!$E$5*$E$123/100,\"GOOD\",IF(C101>='A2'!$E$5*$E$122/100,\"AVERAGE\",\"POOR\"))))","v":"EXCELLENT"}]
[{"$f":"Data_Sheet!A102","v":"JEC18CS079"},{"$f":"Data_Sheet!B102","v":"SHAFNA"},{"$f":"'A2'!F102","v":10},{"$f":"IF(C102=\"A\",\"ABSENT\",IF(C102>='A2'!$E$5*$E$124/100,\"EXCELLENT\",IF(C102>='A2'!$E$5*$E$123/100,\"GOOD\",IF(C102>='A2'!$E$5*$E$122/100,\"AVERAGE\",\"POOR\"))))","v":"EXCELLENT"}]
[{"$f":"Data_Sheet!A103","v":"JEC18CS080"},{"$f":"Data_Sheet!B103","v":"SHELMY SHABU"},{"$f":"'A2'!F103","v":10},{"$f":"IF(C103=\"A\",\"ABSENT\",IF(C103>='A2'!$E$5*$E$124/100,\"EXCELLENT\",IF(C103>='A2'!$E$5*$E$123/100,\"GOOD\",IF(C103>='A2'!$E$5*$E$122/100,\"AVERAGE\",\"POOR\"))))","v":"EXCELLENT"}]
[{"$f":"Data_Sheet!A104","v":"JEC18CS081"},{"$f":"Data_Sheet!B104","v":"SHIZA SHIHAB PUVAMPARAMBIL"},{"$f":"'A2'!F104","v":10},{"$f":"IF(C104=\"A\",\"ABSENT\",IF(C104>='A2'!$E$5*$E$124/100,\"EXCELLENT\",IF(C104>='A2'!$E$5*$E$123/100,\"GOOD\",IF(C104>='A2'!$E$5*$E$122/100,\"AVERAGE\",\"POOR\"))))","v":"EXCELLENT"}]
[{"$f":"Data_Sheet!A105","v":"JEC18CS082"},{"$f":"Data_Sheet!B105","v":"SIJO GEORGE"},{"$f":"'A2'!F105","v":8},{"$f":"IF(C105=\"A\",\"ABSENT\",IF(C105>='A2'!$E$5*$E$124/100,\"EXCELLENT\",IF(C105>='A2'!$E$5*$E$123/100,\"GOOD\",IF(C105>='A2'!$E$5*$E$122/100,\"AVERAGE\",\"POOR\"))))","v":"EXCELLENT"}]
[{"$f":"Data_Sheet!A106","v":"JEC18CS083"},{"$f":"Data_Sheet!B106","v":"SOURAV K"},{"$f":"'A2'!F106","v":8},{"$f":"IF(C106=\"A\",\"ABSENT\",IF(C106>='A2'!$E$5*$E$124/100,\"EXCELLENT\",IF(C106>='A2'!$E$5*$E$123/100,\"GOOD\",IF(C106>='A2'!$E$5*$E$122/100,\"AVERAGE\",\"POOR\"))))","v":"EXCELLENT"}]
[{"$f":"Data_Sheet!A107","v":0},{"$f":"Data_Sheet!B107","v":0},{"$f":"'A2'!F107","v":0},{"$f":"IF(C107=\"A\",\"ABSENT\",IF(C107>='A2'!$E$5*$E$124/100,\"EXCELLENT\",IF(C107>='A2'!$E$5*$E$123/100,\"GOOD\",IF(C107>='A2'!$E$5*$E$122/100,\"AVERAGE\",\"POOR\"))))","v":"POOR"}]
[{"$f":"Data_Sheet!A108","v":"JEC18CS085"},{"$f":"Data_Sheet!B108","v":"SREEHARI"},{"$f":"'A2'!F108","v":7},{"$f":"IF(C108=\"A\",\"ABSENT\",IF(C108>='A2'!$E$5*$E$124/100,\"EXCELLENT\",IF(C108>='A2'!$E$5*$E$123/100,\"GOOD\",IF(C108>='A2'!$E$5*$E$122/100,\"AVERAGE\",\"POOR\"))))","v":"GOOD"}]
[{"$f":"Data_Sheet!A109","v":"JEC18CS086"},{"$f":"Data_Sheet!B109","v":"SREEKANTH P"},{"$f":"'A2'!F109","v":7},{"$f":"IF(C109=\"A\",\"ABSENT\",IF(C109>='A2'!$E$5*$E$124/100,\"EXCELLENT\",IF(C109>='A2'!$E$5*$E$123/100,\"GOOD\",IF(C109>='A2'!$E$5*$E$122/100,\"AVERAGE\",\"POOR\"))))","v":"GOOD"}]
[{"$f":"Data_Sheet!A110","v":"JEC18CS087"},{"$f":"Data_Sheet!B110","v":"SREELEKSHMI H KUMAR"},{"$f":"'A2'!F110","v":10},{"$f":"IF(C110=\"A\",\"ABSENT\",IF(C110>='A2'!$E$5*$E$124/100,\"EXCELLENT\",IF(C110>='A2'!$E$5*$E$123/100,\"GOOD\",IF(C110>='A2'!$E$5*$E$122/100,\"AVERAGE\",\"POOR\"))))","v":"EXCELLENT"}]
[{"$f":"Data_Sheet!A111","v":"JEC18CS088"},{"$f":"Data_Sheet!B111","v":"SUFAIL BADUSHA.T"},{"$f":"'A2'!F111","v":9},{"$f":"IF(C111=\"A\",\"ABSENT\",IF(C111>='A2'!$E$5*$E$124/100,\"EXCELLENT\",IF(C111>='A2'!$E$5*$E$123/100,\"GOOD\",IF(C111>='A2'!$E$5*$E$122/100,\"AVERAGE\",\"POOR\"))))","v":"EXCELLENT"}]
[{"$f":"Data_Sheet!A112","v":"JEC18CS089"},{"$f":"Data_Sheet!B112","v":"TIYA THOMAS"},{"$f":"'A2'!F112","v":10},{"$f":"IF(C112=\"A\",\"ABSENT\",IF(C112>='A2'!$E$5*$E$124/100,\"EXCELLENT\",IF(C112>='A2'!$E$5*$E$123/100,\"GOOD\",IF(C112>='A2'!$E$5*$E$122/100,\"AVERAGE\",\"POOR\"))))","v":"EXCELLENT"}]
[{"$f":"Data_Sheet!A113","v":"JEC18CS090"},{"$f":"Data_Sheet!B113","v":"TOMSUN PAVOO P"},{"$f":"'A2'!F113","v":10},{"$f":"IF(C113=\"A\",\"ABSENT\",IF(C113>='A2'!$E$5*$E$124/100,\"EXCELLENT\",IF(C113>='A2'!$E$5*$E$123/100,\"GOOD\",IF(C113>='A2'!$E$5*$E$122/100,\"AVERAGE\",\"POOR\"))))","v":"EXCELLENT"}]
[{"$f":"Data_Sheet!A114","v":"JEC18CS091"},{"$f":"Data_Sheet!B114","v":"ULLAS. S"},{"$f":"'A2'!F114","v":5},{"$f":"IF(C114=\"A\",\"ABSENT\",IF(C114>='A2'!$E$5*$E$124/100,\"EXCELLENT\",IF(C114>='A2'!$E$5*$E$123/100,\"GOOD\",IF(C114>='A2'!$E$5*$E$122/100,\"AVERAGE\",\"POOR\"))))","v":"AVERAGE"}]
[{"$f":"Data_Sheet!A115","v":"JEC18CS092"},{"$f":"Data_Sheet!B115","v":"VAISHNAV M"},{"$f":"'A2'!F115","v":5},{"$f":"IF(C115=\"A\",\"ABSENT\",IF(C115>='A2'!$E$5*$E$124/100,\"EXCELLENT\",IF(C115>='A2'!$E$5*$E$123/100,\"GOOD\",IF(C115>='A2'!$E$5*$E$122/100,\"AVERAGE\",\"POOR\"))))","v":"AVERAGE"}]
[{"$f":"Data_Sheet!A116","v":"JEC18CS093"},{"$f":"Data_Sheet!B116","v":"VANI PRAKASHAN CHOYYAN"},{"$f":"'A2'!F116","v":10},{"$f":"IF(C116=\"A\",\"ABSENT\",IF(C116>='A2'!$E$5*$E$124/100,\"EXCELLENT\",IF(C116>='A2'!$E$5*$E$123/100,\"GOOD\",IF(C116>='A2'!$E$5*$E$122/100,\"AVERAGE\",\"POOR\"))))","v":"EXCELLENT"}]
[]
["Total Number of Students",null,{"$f":"Data_Sheet!$C$6","v":92}]
["Number of Students Absent",null,{"$f":"IF(COUNTIF(C25:INDIRECT(C131),\"=A\"),COUNTIF(C25:INDIRECT(C131),\"=A\"),0)","v":0}]
["Total Number of Students attended",null,{"$f":"C118-C119","v":92}]
[{"$f":"\"Number of Students with Marks less than \"&E122&\"%\"","v":"Number of Students with Marks less than 45%"},null,{"$f":"IF(COUNTIF(D25:INDIRECT(D131),\"=POOR\"),COUNTIF(D25:INDIRECT(D131),\"=POOR\"),0)","v":3},"POOR","Range"]
[{"$f":"\"Number of Students with Marks betweeen \"&E122&\"% to \"&E123&\"%\"","v":"Number of Students with Marks betweeen 45% to 60%"},null,{"$f":"IF(COUNTIF(D25:INDIRECT(D131),\"=AVERAGE\"),COUNTIF(D25:INDIRECT(D131),\"=AVERAGE\"),0)","v":6},"AVERAGE",45]
[{"$f":"\"Number of Students with Marks betweeen \"&E123&\"% to \"&E124&\"%\"","v":"Number of Students with Marks betweeen 60% to 80%"},null,{"$f":"IF(COUNTIF(D25:INDIRECT(D131),\"=GOOD\"),COUNTIF(D25:INDIRECT(D131),\"=GOOD\"),0)","v":3},"GOOD",60]
[{"$f":"\"Number of Students with Marks greater than \"&E124&\"%\"","v":"Number of Students with Marks greater than 80%"},null,{"$f":"IF(COUNTIF(D25:INDIRECT(D131),\"=EXCELLENT\"),COUNTIF(D25:INDIRECT(D131),\"=EXCELLENT\"),0)","v":80},"EXCELLENT",80]
["Class Average",null,{"$f":"ROUND(AVERAGE(C25:INDIRECT(C131)),2)","v":8.85}]
["Pass Percentage",null,{"$f":"ROUND(((C120-C121)/C120)*100,2)","v":96.74}]
[]
[null,{"$f":"Data_Sheet!B10","v":"Name of Faculty : "},{"$f":"Data_Sheet!B11","v":"Namitha T N"}]
[null,{"$f":"Data_Sheet!B136","v":"Dated Signature :  "}]
[]
[{"$f":"ROW(A118)-2","v":116},"Last Row Count",{"$f":"\"$C$\"&$A$131","v":"$C$116"},{"$f":"\"$D$\"&$A$131","v":"$D$116"}]

{"sheet":"Overall_CO","index":12,"n_rows":61,"n_cols":22,"rows_kept":61,"cut":false,"hidden":false,"merged":[[42,0,47,0],[32,0,32,13],[34,0,34,13],[36,0,36,13],[38,0,38,13],[40,0,41,1],[40,12,41,12],[40,13,41,13],[19,0,20,1],[18,0,18,11],[22,0,22,11],[19,8,19,9],[20,8,20,9],[2,0,2,13],[4,0,4,13],[6,0,6,13],[8,0,8,13],[12,0,17,0],[10,2,10,3],[10,4,10,5],[10,6,10,7],[10,8,10,9],[10,10,10,11],[10,0,11,1]]}
[]
[]
[{"$f":"Data_Sheet!A2","v":"Jyothi Engineering College, Cheruthuruthy"}]
[]
[{"$f":"Data_Sheet!A4","v":"Department of Computer Science Engineering"}]
[]
["Overall CO Analysis - Internal Marks",null,null,null,null,null,null,null,null,null,null,null,null,null,null,{"$f":"\"Overall \"&LEFT(Data_Sheet!A15, LEN(Data_Sheet!A15)-12)","v":"Overall CO Analysis - Internal Marks                    "}]
[]
[{"$f":"Data_Sheet!A17","v":"S3 CS              CS203 Switching Theory and Logic Design               2019-20"}]
[]
["Internal Marks Analysis",null,"T1",null,"T2",null,"T3",null,"A1",null,"A2",null,"Average","Remarks"]
[null,null,"A_Value","Marks","A_Value","Marks","A_Value","Marks","A_Value","Marks","A_Value","Marks"]
["Total Attainment level for",{"$f":"IF(Data_Sheet!A119<>\"\",Data_Sheet!A119,\"\")","v":"CO1"},{"$f":"IF(Data_Sheet!A119<>\"\",'T1'!C124,\"\")","v":1.33},{"$f":"IF(Data_Sheet!A119<>\"\",'T1'!P124,\"\")","v":54},{"$f":"IF(Data_Sheet!A119<>\"\",'T2'!C124,\"\")","v":""},{"$f":"IF(Data_Sheet!A119<>\"\",'T2'!R124,\"\")","v":0},{"$f":"IF(Data_Sheet!A119<>\"\",'T3'!C124,\"\")","v":""},{"$f":"IF(Data_Sheet!A119<>\"\",'T3'!I124,\"\")","v":0},{"$f":"IF(Data_Sheet!A119<>\"\",'A1'!C124,\"\")","v":3},{"$f":"IF(Data_Sheet!A119<>\"\",'A1'!F124,\"\")","v":5},{"$f":"IF(Data_Sheet!A119<>\"\",'A2'!C124,\"\")","v":3},{"$f":"IF(Data_Sheet!A119<>\"\",'A2'!F124,\"\")","v":10},{"$f":"IF(SUM(D13,F13,H13,J13,L13)=0,\"\",ROUND((IF(C13=\"\",0,C13*D13)+IF(E13=\"\",0,E13*F13)+IF(G13=\"\",0,H13*G13)+IF(I13=\"\",0,I13*J13)+IF(K13=\"\",0,K13*L13))/(SUM(D13,F13,H13,J13,L13)),2))","v":1.69},{"$f":"IF(Data_Sheet!A119<>\"\",IF(M13=\"\",\"No Correlation\",\"\"),\"\")","v":""},{"$f":"IFERROR(IF(Data_Sheet!A119<>\"\",ROUND(AVERAGE('T1'!C124,'T2'!C124,'A1'!C124,'A2'!C124),2),\"\"),\"\")","v":2.44},{"$f":"IF(Data_Sheet!A119<>\"\",ROUND(SUM('T1'!C124,'T2'!C124,'A1'!C124,'A2'!C124)/4,2),\"\")","v":1.83}]
[null,{"$f":"IF(Data_Sheet!A120<>\"\",Data_Sheet!A120,\"\")","v":"CO2"},{"$f":"IF(Data_Sheet!A120<>\"\",'T1'!C125,\"\")","v":2.4},{"$f":"IF(Data_Sheet!A120<>\"\",'T1'!P125,\"\")","v":5},{"$f":"IF(Data_Sheet!A120<>\"\",'T2'!C125,\"\")","v":""},{"$f":"IF(Data_Sheet!A120<>\"\",'T2'!R125,\"\")","v":0},{"$f":"IF(Data_Sheet!A120<>\"\",'T3'!C125,\"\")","v":""},{"$f":"IF(Data_Sheet!A120<>\"\",'T3'!I125,\"\")","v":0},{"$f":"IF(Data_Sheet!A120<>\"\",'A1'!C125,\"\")","v":3},{"$f":"IF(Data_Sheet!A120<>\"\",'A1'!F125,\"\")","v":5},{"$f":"IF(Data_Sheet!A120<>\"\",'A2'!C125,\"\")","v":3},{"$f":"IF(Data_Sheet!A120<>\"\",'A2'!F125,\"\")","v":5},2.8,{"$f":"IF(Data_Sheet!A120<>\"\",IF(M14=\"\",\"No Correlation\",\"\"),\"\")","v":""},{"$f":"IFERROR(IF(Data_Sheet!A120<>\"\",ROUND(AVERAGE('T1'!C125,'T2'!C125,'A1'!C125,'A2'!C125),2),\"\"),\"\")","v":2.8},{"$f":"IF(Data_Sheet!A120<>\"\",ROUND(SUM('T1'!C125,'T2'!C125,'A1'!C125,'A2'!C125)/4,2),\"\")","v":2.1}]
[null,{"$f":"IF(Data_Sheet!A121<>\"\",Data_Sheet!A121,\"\")","v":"CO3"},{"$f":"IF(Data_Sheet!A121<>\"\",'T1'!C126,\"\")","v":""},{"$f":"IF(Data_Sheet!A121<>\"\",'T1'!P126,\"\")","v":0},{"$f":"IF(Data_Sheet!A121<>\"\",'T2'!C126,\"\")","v":0.82},{"$f":"IF(Data_Sheet!A121<>\"\",'T2'!R126,\"\")","v":55},{"$f":"IF(Data_Sheet!A121<>\"\",'T3'!C126,\"\")","v":0},{"$f":"IF(Data_Sheet!A121<>\"\",'T3'!I126,\"\")","v":10},{"$f":"IF(Data_Sheet!A121<>\"\",'A1'!C126,\"\")","v":""},{"$f":"IF(Data_Sheet!A121<>\"\",'A1'!F126,\"\")","v":0},{"$f":"IF(Data_Sheet!A121<>\"\",'A2'!C126,\"\")","v":""},{"$f":"IF(Data_Sheet!A121<>\"\",'A2'!F126,\"\")","v":0},0.69,{"$f":"IF(Data_Sheet!A121<>\"\",IF(M15=\"\",\"No Correlation\",\"\"),\"\")","v":""},{"$f":"IFERROR(IF(Data_Sheet!A121<>\"\",ROUND(AVERAGE('T1'!C126,'T2'!C126,'A1'!C126,'A2'!C126),2),\"\"),\"\")","v":0.82},{"$f":"IF(Data_Sheet!A121<>\"\",ROUND(SUM('T1'!C126,'T2'!C126,'A1'!C126,'A2'!C126)/4,2),\"\")","v":0.21}]
[null,{"$f":"IF(Data_Sheet!A122<>\"\",Data_Sheet!A122,\"\")","v":"CO4"},{"$f":"IF(Data_Sheet!A122<>\"\",'T1'!C127,\"\")","v":""},{"$f":"IF(Data_Sheet!A122<>\"\",'T1'!P127,\"\")","v":0},{"$f":"IF(Data_Sheet!A122<>\"\",'T2'!C127,\"\")","v":1},{"$f":"IF(Data_Sheet!A122<>\"\",'T2'!R127,\"\")","v":10},{"$f":"IF(Data_Sheet!A122<>\"\",'T3'!C127,\"\")","v":0},{"$f":"IF(Data_Sheet!A122<>\"\",'T3'!I127,\"\")","v":10},{"$f":"IF(Data_Sheet!A122<>\"\",'A1'!C127,\"\")","v":""},{"$f":"IF(Data_Sheet!A122<>\"\",'A1'!F127,\"\")","v":0},{"$f":"IF(Data_Sheet!A122<>\"\",'A2'!C127,\"\")","v":""},{"$f":"IF(Data_Sheet!A122<>\"\",'A2'!F127,\"\")","v":0},0.5,{"$f":"IF(Data_Sheet!A122<>\"\",IF(M16=\"\",\"No Correlation\",\"\"),\"\")","v":""},{"$f":"IFERROR(IF(Data_Sheet!A122<>\"\",ROUND(AVERAGE('T1'!C127,'T2'!C127,'A1'!C127,'A2'!C127),2),\"\"),\"\")","v":1},{"$f":"IF(Data_Sheet!A122<>\"\",ROUND(SUM('T1'!C127,'T2'!C127,'A1'!C127,'A2'!C127)/4,2),\"\")","v":0.25}]
[null,{"$f":"IF(Data_Sheet!A123<>\"\",Data_Sheet!A123,\"\")","v":"CO5"},{"$f":"IF(Data_Sheet!A123<>\"\",'T1'!C128,\"\")","v":""},{"$f":"IF(Data_Sheet!A123<>\"\",'T1'!P128,\"\")","v":0},{"$f":"IF(Data_Sheet!A123<>\"\",'T2'!C128,\"\")","v":1},{"$f":"IF(Data_Sheet!A123<>\"\",'T2'!R128,\"\")","v":5},{"$f":"IF(Data_Sheet!A123<>\"\",'T3'!C128,\"\")","v":0},{"$f":"IF(Data_Sheet!A123<>\"\",'T3'!I128,\"\")","v":5},{"$f":"IF(Data_Sheet!A123<>\"\",'A1'!C128,\"\")","v":""},{"$f":"IF(Data_Sheet!A123<>\"\",'A1'!F128,\"\")","v":0},{"$f":"IF(Data_Sheet!A123<>\"\",'A2'!C128,\"\")","v":""},{"$f":"IF(Data_Sheet!A123<>\"\",'A2'!F128,\"\")","v":0},0.5,{"$f":"IF(Data_Sheet!A123<>\"\",IF(M17=\"\",\"No Correlation\",\"\"),\"\")","v":""},{"$f":"IFERROR(IF(Data_Sheet!A123<>\"\",ROUND(AVERAGE('T1'!C128,'T2'!C128,'A1'!C128,'A2'!C128),2),\"\"),\"\")","v":1},{"$f":"IF(Data_Sheet!A123<>\"\",ROUND(SUM('T1'!C128,'T2'!C128,'A1'!C128,'A2'!C128)/4,2),\"\")","v":0.25}]
[null,{"$f":"IF(Data_Sheet!A124<>\"\",Data_Sheet!A124,\"\")","v":"CO6"},{"$f":"IF(Data_Sheet!A124<>\"\",'T1'!C129,\"\")","v":""},{"$f":"IF(Data_Sheet!A124<>\"\",'T1'!P129,\"\")","v":0},{"$f":"IF(Data_Sheet!A124<>\"\",'T2'!C129,\"\")","v":""},{"$f":"IF(Data_Sheet!A124<>\"\",'T2'!R129,\"\")","v":0},{"$f":"IF(Data_Sheet!A124<>\"\",'T3'!C129,\"\")","v":""},{"$f":"IF(Data_Sheet!A124<>\"\",'T3'!I129,\"\")","v":0},{"$f":"IF(Data_Sheet!A124<>\"\",'A1'!C129,\"\")","v":""},{"$f":"IF(Data_Sheet!A124<>\"\",'A1'!F129,\"\")","v":0},{"$f":"IF(Data_Sheet!A124<>\"\",'A2'!C129,\"\")","v":3},{"$f":"IF(Data_Sheet!A124<>\"\",'A2'!F129,\"\")","v":5},3,{"$f":"IF(Data_Sheet!A124<>\"\",IF(M18=\"\",\"No Correlation\",\"\"),\"\")","v":""},{"$f":"IFERROR(IF(Data_Sheet!A124<>\"\",ROUND(AVERAGE('T1'!C129,'T2'!C129,'A1'!C129,'A2'!C129),2),\"\"),\"\")","v":3},{"$f":"IF(Data_Sheet!A124<>\"\",ROUND(SUM('T1'!C129,'T2'!C129,'A1'!C129,'A2'!C129)/4,2),\"\")","v":0.75}]
["Average of COs",null,null,null,null,null,null,null,null,null,null,null,{"$f":"ROUND(AVERAGE(M13:M18),2)","v":1.53}]
["External Marks Analysis",null,{"$f":"IF(Data_Sheet!A119<>\"\",Data_Sheet!A119,\"\")","v":"CO1"},{"$f":"IF(Data_Sheet!A120<>\"\",Data_Sheet!A120,\"\")","v":"CO2"},{"$f":"IF(Data_Sheet!A121<>\"\",Data_Sheet!A121,\"\")","v":"CO3"},{"$f":"IF(Data_Sheet!A122<>\"\",Data_Sheet!A122,\"\")","v":"CO4"},{"$f":"IF(Data_Sheet!A123<>\"\",Data_Sheet!A123,\"\")","v":"CO5"},{"$f":"IF(Data_Sheet!A124<>\"\",Data_Sheet!A124,\"\")","v":"CO6"},"Average"]
[null,null,{"$f":"IF(Data_Sheet!A119<>\"\",Data_Sheet!E117,\"\")","v":1},{"$f":"IF(Data_Sheet!A120<>\"\",Data_Sheet!E117,\"\")","v":1},{"$f":"IF(Data_Sheet!A121<>\"\",Data_Sheet!E117,\"\")","v":1},{"$f":"IF(Data_Sheet!A122<>\"\",Data_Sheet!E117,\"\")","v":1},{"$f":"IF(Data_Sheet!A123<>\"\",Data_Sheet!E117,\"\")","v":1},{"$f":"IF(Data_Sheet!A124<>\"\",Data_Sheet!E117,\"\")","v":1},{"$f":"ROUND(AVERAGE(C21:H21),2)","v":1}]
[]
[{"$f":"\"Course Outcome  Attainment for \"&Data_Sheet!A9&\" \"&Data_Sheet!B9","v":"Course Outcome  Attainment for CS203 Switching Theory and Logic Design"},null,null,null,null,null,null,null,null,null,null,null,{"$f":"ROUND((M19*Data_Sheet!E126+I21*Data_Sheet!E130)/100,2)","v":1.1599999999999999}]
[{"$f":"Data_Sheet!A127","v":"Attainment Level 1: 60% students scoring more than 60% of the Total Marks"}]
[{"$f":"Data_Sheet!A128","v":"Attainment Level 2: 70% students scoring more than 60% of the Total Marks"}]
[{"$f":"Data_Sheet!A129","v":"Attainment Level 3: 80% students scoring more than 60% of the Total Marks"}]
[null,null,null,null,null,null,null,null,null,null,{"$f":"Data_Sheet!B10","v":"Name of Faculty : "},null,{"$f":"Data_Sheet!B11","v":"Namitha T N"}]
[null,null,null,null,null,null,null,null,null,null,{"$f":"Data_Sheet!B136","v":"Dated Signature :  "}]
[]
[]
[]
[]
[{"$f":"Data_Sheet!A2","v":"Jyothi Engineering College, Cheruthuruthy"}]
[]
[{"$f":"Data_Sheet!A4","v":"Department of Computer Science Engineering"}]
[]
["Question Paper & Assignment Quality Analysis"]
[]
[{"$f":"Data_Sheet!A17","v":"S3 CS              CS203 Switching Theory and Logic Design               2019-20"}]
[]
["Quality Analysis",null,"T1",{"$f":"'T1'!F5","v":50},"T2",{"$f":"'T2'!F5","v":50},"T3",{"$f":"'T3'!F5","v":50},"A1",{"$f":"'A1'!E5","v":10},"A2",{"$f":"'A2'!E5","v":10},"Average Marks %","Remarks"]
[null,null,"Included","Marks %","Included","Marks %","Included","Marks %","Included","Marks %","Included","Marks %",null,null,null,null,"L1","L2","L3","L4","L5","L6"]
["Blooms Taxonomy Level",1,{"$f":"IF(D43<>0,\"Yes\",\"No\")","v":"Yes"},{"$f":"IFERROR(ROUND('T1'!$P176/SUM('T1'!$D$21:'T1'!$O$21)*100,2),0)","v":94.92},{"$f":"IF(F43<>0,\"Yes\",\"No\")","v":"No"},{"$f":"IFERROR(ROUND('T2'!$R176/SUM('T2'!$D$21:'T2'!$Q$21)*100,2),0)","v":0},{"$f":"IF(H43<>0,\"Yes\",\"No\")","v":"No"},{"$f":"IFERROR(ROUND('T3'!$I176/SUM('T3'!$D$21:'T3'!$H$21)*100,2),0)","v":0},{"$f":"IF(J43<>0,\"Yes\",\"No\")","v":"Yes"},{"$f":"IFERROR(ROUND('A1'!$F176/SUM('A1'!$D$21:'A1'!$E$21)*100,2),0)","v":8.33},{"$f":"IF(L43<>0,\"Yes\",\"No\")","v":"No"},{"$f":"IFERROR(ROUND('A2'!$F176/SUM('A2'!$D$21:'A2'!$E$21)*100,2),0)","v":0},{"$f":"IF(SUM(D43,F43,H43,J43,L43)=0,\"\",ROUND((IF(C43=\"No\",0,$D$41*D43)+IF(E43=\"No\",0,$F$41*F43)+IF(G43=\"No\",0,$H$41*H43)+IF(I43=\"No\",0,$J$41*J43)+IF(K43=\"No\",0,$L$41*L43))/(SUM($D$41,$F$41,$H$41,$J$41,$L$41)),2))","v":28.41},{"$f":"IF(M43=\"\",\"Not Included\",\"\")","v":""},{"$f":"($D43*$D$41+$F43*$F$41+$H43*$H$41+$J43*$J$41+$L43*$L$41)/100","v":48.292999999999999},"T1",{"$f":"TRANSPOSE(D43:D48)","v":94.92},5.08,0,0,0,0]
[null,2,"Yes",{"$f":"IFERROR(ROUND('T1'!$P177/SUM('T1'!$D$21:'T1'!$O$21)*100,2),0)","v":5.08},"No",{"$f":"IFERROR(ROUND('T2'!$R177/SUM('T2'!$D$21:'T2'!$Q$21)*100,2),0)","v":0},"No",{"$f":"IFERROR(ROUND('T3'!$I177/SUM('T3'!$D$21:'T3'!$H$21)*100,2),0)","v":0},"Yes",{"$f":"IFERROR(ROUND('A1'!$F177/SUM('A1'!$D$21:'A1'!$E$21)*100,2),0)","v":58.33},"No",{"$f":"IFERROR(ROUND('A2'!$F177/SUM('A2'!$D$21:'A2'!$E$21)*100,2),0)","v":0},{"$f":"IF(SUM(D44,F44,H44,J44,L44)=0,\"\",ROUND((IF(C44=\"No\",0,$D$41*D44)+IF(E44=\"No\",0,$F$41*F44)+IF(G44=\"No\",0,$H$41*H44)+IF(I44=\"No\",0,$J$41*J44)+IF(K44=\"No\",0,$L$41*L44))/(SUM($D$41,$F$41,$H$41,$J$41,$L$41)),2))","v":4.93},{"$f":"IF(M44=\"\",\"Not Included\",\"\")","v":""},{"$f":"($D44*$D$41+$F44*$F$41+$H44*$H$41+$J44*$J$41+$L44*$L$41)/100","v":8.3729999999999993},"T2",{"$f":"TRANSPOSE(F43:F48)","v":0},0,85.71,14.29,0,0]
[null,3,"No",{"$f":"IFERROR(ROUND('T1'!$P178/SUM('T1'!$D$21:'T1'!$O$21)*100,2),0)","v":0},"Yes",{"$f":"IFERROR(ROUND('T2'!$R178/SUM('T2'!$D$21:'T2'!$Q$21)*100,2),0)","v":85.71},"No",{"$f":"IFERROR(ROUND('T3'!$I178/SUM('T3'!$D$21:'T3'!$H$21)*100,2),0)","v":0},"Yes",{"$f":"IFERROR(ROUND('A1'!$F178/SUM('A1'!$D$21:'A1'!$E$21)*100,2),0)","v":8.33},"No",{"$f":"IFERROR(ROUND('A2'!$F178/SUM('A2'!$D$21:'A2'!$E$21)*100,2),0)","v":0},25.7,{"$f":"IF(M45=\"\",\"Not Included\",\"\")","v":""},43.688000000000002,"T3",{"$f":"TRANSPOSE(H43:H48)","v":0},0,0,0,60,40]
[null,4,"No",{"$f":"IFERROR(ROUND('T1'!$P179/SUM('T1'!$D$21:'T1'!$O$21)*100,2),0)","v":0},"Yes",{"$f":"IFERROR(ROUND('T2'!$R179/SUM('T2'!$D$21:'T2'!$Q$21)*100,2),0)","v":14.29},"No",{"$f":"IFERROR(ROUND('T3'!$I179/SUM('T3'!$D$21:'T3'!$H$21)*100,2),0)","v":0},"Yes",{"$f":"IFERROR(ROUND('A1'!$F179/SUM('A1'!$D$21:'A1'!$E$21)*100,2),0)","v":8.33},"Yes",{"$f":"IFERROR(ROUND('A2'!$F179/SUM('A2'!$D$21:'A2'!$E$21)*100,2),0)","v":25},6.16,"",10.478,"A1",{"$f":"TRANSPOSE(J43:J48)","v":8.33},58.33,8.33,8.33,8.33,8.33]
[null,5,"No",{"$f":"IFERROR(ROUND('T1'!$P180/SUM('T1'!$D$21:'T1'!$O$21)*100,2),0)","v":0},"No",{"$f":"IFERROR(ROUND('T2'!$R180/SUM('T2'!$D$21:'T2'!$Q$21)*100,2),0)","v":0},"Yes",{"$f":"IFERROR(ROUND('T3'!$I180/SUM('T3'!$D$21:'T3'!$H$21)*100,2),0)","v":60},"Yes",{"$f":"IFERROR(ROUND('A1'!$F180/SUM('A1'!$D$21:'A1'!$E$21)*100,2),0)","v":8.33},"Yes",{"$f":"IFERROR(ROUND('A2'!$F180/SUM('A2'!$D$21:'A2'!$E$21)*100,2),0)","v":50},21.08,"",35.832999999999998,"A2",{"$f":"TRANSPOSE(L43:L48)","v":0},0,0,25,50,25]
[null,6,"No",{"$f":"IFERROR(ROUND('T1'!$P181/SUM('T1'!$D$21:'T1'!$O$21)*100,2),0)","v":0},"No",{"$f":"IFERROR(ROUND('T2'!$R181/SUM('T2'!$D$21:'T2'!$Q$21)*100,2),0)","v":0},"Yes",{"$f":"IFERROR(ROUND('T3'!$I181/SUM('T3'!$D$21:'T3'!$H$21)*100,2),0)","v":40},"Yes",{"$f":"IFERROR(ROUND('A1'!$F181/SUM('A1'!$D$21:'A1'!$E$21)*100,2),0)","v":8.33},"Yes",{"$f":"IFERROR(ROUND('A2'!$F181/SUM('A2'!$D$21:'A2'!$E$21)*100,2),0)","v":25},13.73,"",23.333000000000002,"Average",{"$f":"TRANSPOSE(M43:M48)","v":28.41},4.93,25.7,6.16,21.08,13.73]
[]
[]
[]
[]
[]
[]
[]
[]
[]
[]
[]
[null,null,null,null,null,null,null,null,null,null,{"$f":"Data_Sheet!B10","v":"Name of Faculty : "},{"$f":"Data_Sheet!B11","v":"Namitha T N"}]
[null,null,null,null,null,null,null,null,null,null,{"$f":"Data_Sheet!B136","v":"Dated Signature :  "}]